harmony-alerts mailing list archives

Site index · List index
Message view « Date » · « Thread »
Top « Date » · « Thread »
From nom...@intel.com
Subject [build-test alert] BUILD FAILED Windows XP SP2 msvc debug: classlib over drlvm
Date Tue, 27 Feb 2007 10:32:24 GMT
BUILD FAILED:
	Ant Error Message:
C:\cruise\trunk\cc\projects\classlib\trunk\build.xml:167: The following error occurred while
executing this line: C:\cruise\trunk\cc\projects\classlib\trunk\make\build-test.xml:52: The
following error occurred while executing this line: C:\cruise\trunk\cc\projects\classlib\trunk\make\properties.xml:354:
The following error occurred while executing this line: C:\cruise\trunk\cc\projects\classlib\trunk\modules\jndi\build.xml:133:
Compile failed; see the compiler error output for details.

Date of build:	02/27/2007 16:27:00
Time to build:	5 minutes 2 seconds
Last changed:	02/27/2007 16:03:51
Last log entry:	more cleanup

***********************************************************
Execution log (errors/warnings messages):	

========================================
Testing class libraries...
========================================

Checking for depends/jars/yoko_M2-20070130/yoko.jar
Checking for depends/jars/yoko_M2-20070130/yoko-core.jar
Checking for depends/jars/yoko_M2-20070130/yoko-rmi-impl.jar
Checking for depends/jars/yoko_M2-20070130/yoko-rmi-spec.jar
Checking for depends/jars/bcel-5.2/bcel-5.2.jar
Checking for depends/jars/xalan-j_2.7.0/xalan.jar
Checking for depends/jars/xerces_2.8.0/resolver.jar
Checking for depends/jars/xerces_2.8.0/xercesImpl.jar
Checking for depends/jars/xerces_2.8.0/xml-apis.jar
Checking for depends/jars/junit_3.8.2/junit.jar
Checking for depends/jars/bcprov-jdk15-134/bcprov.jar
Checking for depends/jars/icu4j_3.4.4/icu4j_3_4_4.jar
Checking for depends/jars/mx4j_3.0.2/mx4j.zip
Checking for depends/jars/ecj_3.2/ecj_3.2.jar
Checking for depends/jars/jetty/jetty-6.0.0.jar
Checking for depends/jars/jetty/jetty-util-6.0.0.jar
Checking for depends/jars/jetty/servlet-api-2.5-6.0.0.jar
Checking for depends/libs/windows.x86/msvcr71.dll
Checking for depends/libs/windows.x86/swing_awt_deps_winxp_2006-09-28.tgz
Since fork is false, ignoring memoryMaximumSize setting
Compiling ACCESSIBILITY classes
Compiling ACCESSIBILITY tests
Since fork is false, ignoring memoryMaximumSize setting
Compiling ANNOTATION classes
Compiling ANNOTATION tests
Since fork is false, ignoring memoryMaximumSize setting
Compiling APPLET classes
Compiling APPLET tests
Since fork is false, ignoring memoryMaximumSize setting
Compiling ARCHIVE classes
Compiling ARCHIVE tests
Since fork is false, ignoring memoryMaximumSize setting
Compiling AUTH classes
Compiling AUTH tests
Since fork is false, ignoring memoryMaximumSize setting
Compiling AWT classes
Compiling AWT tests
Since fork is false, ignoring memoryMaximumSize setting
java.lang.RuntimeException: expected from EDT
	at java.awt.EventDispatchThreadRTest$1.run(EventDispatchThreadRTest.java:29)
	at java.awt.event.InvocationEvent.runAndNotify(InvocationEvent.java:90)
	at java.awt.event.InvocationEvent.dispatch(InvocationEvent.java:77)
	at java.awt.EventQueueCore.dispatchEventImpl(EventQueueCore.java:140)
	at java.awt.EventQueue.dispatchEvent(EventQueue.java:144)
	at java.awt.EventDispatchThread.runModalLoop(EventDispatchThread.java:73)
	at java.awt.EventDispatchThread.run(EventDispatchThread.java:45)
Compiling BEANS classes
Compiling support classes for BEANS tests
Compiling internal BEANS tests
Compiling BEANS tests
Since fork is false, ignoring memoryMaximumSize setting
Running internal BEANS tests
Running BEANS tests
Compiling CRYPTO classes
Compiling CRYPTO test support files
Since fork is false, ignoring memoryMaximumSize setting
Compiling CRYPTO api tests
Since fork is false, ignoring memoryMaximumSize setting
Compiling CRYPTO api injected tests
Since fork is false, ignoring memoryMaximumSize setting
Compiling CRYPTO impl injected tests
Since fork is false, ignoring memoryMaximumSize setting
Compiling CRYPTO impl tests
Since fork is false, ignoring memoryMaximumSize setting
Running CRYPTO api tests
Running CRYPTO api.injected tests
Running CRYPTO impl tests
Running CRYPTO impl injected tests
Compiling ImageIO classes
Compiling ImageIO tests
Compiling INSTRUMENT classes
Compiling INSTRUMENT tests
Since fork is false, ignoring memoryMaximumSize setting
Compiling JNDI classes
Compiling JNDI tests
Since fork is false, ignoring memoryMaximumSize setting
----------
1. ERROR in C:\cruise\trunk\cc\projects\classlib\trunk\modules\jndi\src\test\java\org\apache\harmony\jndi\tests\javax\naming\ldap\main\AllTestLdap.java
 (at line 32)
	import org.apache.harmony.jndi.tests.javax.naming.ldap.TestRdn;
	       ^^^^^^^^^^^^^^^^^^^^^^^^^^^^^^^^^^^^^^^^^^^^^^^^^^^^^^^
The import org.apache.harmony.jndi.tests.javax.naming.ldap.TestRdn cannot be resolved
----------
2. ERROR in C:\cruise\trunk\cc\projects\classlib\trunk\modules\jndi\src\test\java\org\apache\harmony\jndi\tests\javax\naming\ldap\main\AllTestLdap.java
 (at line 80)
	suite.addTest(new TestSuite(TestRdn.class));
	                            ^^^^^^^
TestRdn cannot be resolved to a type
----------
2 problems (2 errors)

***********************************************************
Unit Tests: (3826)
        

***********************************************************
Modifications since last successful build:	(7)
            
modified mloenko  /harmony/enhanced/classlib/trunk/modules/jndi/src/test/java/org/apache/harmony/jndi/tests/javax/naming/ldap/LdapNameTest.java
02/27/2007 16:03:51 more cleanup
modified mloenko  /harmony/enhanced/classlib/trunk/modules/jndi/make/exclude.common 02/27/2007
16:03:51 more cleanup
modified mloenko  /harmony/enhanced/classlib/trunk/modules/jndi/src/main/java/javax/naming/ldap/LdapName.java
02/27/2007 16:03:51 more cleanup
modified hindessm  /harmony/enhanced/classlib/trunk/depends/build/defines.mk 02/27/2007 15:05:06
Some aix defines.
modified hindessm  /harmony/enhanced/classlib/trunk/modules/archive/src/main/native/zlib/unix/makefile
02/27/2007 15:05:06 Some aix defines.
add cc-drlvm log20070227145111Lbuild.184 02/27/2007 14:51:11drlvm
add cc-classlib log20070227144521Lbuild.150 02/27/2007 14:45:21classlib

Mime
View raw message