harmony-alerts mailing list archives

Site index · List index
Message view « Date » · « Thread »
Top « Date » · « Thread »
From ndbe...@apache.org
Subject [build-test alert] BUILD FAILED win msvc debug: classlib
Date Tue, 27 Feb 2007 03:37:06 GMT
BUILD FAILED:
	Ant Error Message:
C:\bt-trunk\cc\projects\classlib\trunk\build.xml:167: The following error occurred while executing
this line: C:\bt-trunk\cc\projects\classlib\trunk\make\build-test.xml:133: There were test
crashes: C:\bt-trunk\cc\projects\classlib\trunk\build\test_report\TEST-java.awt.AccessibleAWTCheckboxMenuItemTest.xml;C:\bt-trunk\cc\projects\classlib\trunk\build\test_report\TEST-javax.swing.AbstractActionRTest.xml;C:\bt-trunk\cc\projects\classlib\trunk\build\test_report\TEST-org.apache.harmony.beans.tests.java.beans.SimpleBeanInfoTest.xml

Date of build:	02/26/2007 20:36:44
Time to build:	59 minutes 28 seconds
Last changed:	02/26/2007 11:00:20
Last log entry:	Fix that allows embedding assembly manifests into corresponding DLL/EXE files
during the build process. This was MSVS 2005-specific issue. See HARMONY-3240.

***********************************************************
Errors/Warnings:	(498)
            
Test org.apache.harmony.awt.HeadlessTest FAILED
Tests FAILED
Tests FAILED
Tests FAILED
Checking depends/jars/yoko_M2-20070130/yoko.jar
Checksum verified (true)
Checking depends/jars/yoko_M2-20070130/yoko-core.jar
Checksum verified (true)
Checking depends/jars/yoko_M2-20070130/yoko-rmi-impl.jar
Checksum verified (true)
Checking depends/jars/yoko_M2-20070130/yoko-rmi-spec.jar
Checksum verified (true)
Checking depends/jars/bcel-5.2/bcel-5.2.jar
Checksum verified (true)
Checking depends/jars/xalan-j_2.7.0/xalan.jar
Checksum verified (true)
Checking depends/jars/xerces_2.8.0/resolver.jar
Checksum verified (true)
Checking depends/jars/xerces_2.8.0/xercesImpl.jar
Checksum verified (true)
Checking depends/jars/xerces_2.8.0/xml-apis.jar
Checksum verified (true)
Checking depends/jars/junit_3.8.2/junit.jar
Checksum verified (true)
Checking depends/jars/bcprov-jdk15-134/bcprov.jar
Checksum verified (true)
Checking depends/jars/icu4j_3.4.4/icu4j_3_4_4.jar
Checksum verified (true)
Checking depends/jars/mx4j_3.0.2/mx4j.zip
Checksum verified (true)
Checking depends/jars/ecj_3.2/ecj_3.2.jar
Checksum verified (true)
Checking depends/jars/jetty/jetty-6.0.0.jar
Checksum verified (true)
Checking depends/jars/jetty/jetty-util-6.0.0.jar
Checksum verified (true)
Checking depends/jars/jetty/servlet-api-2.5-6.0.0.jar
Checksum verified (true)
Checking depends/libs/windows.x86/msvcr71.dll
Checksum verified (true)
Checking depends/libs/windows.x86/swing_awt_deps_winxp_2006-09-28.tgz
Checksum verified (true)
C:\bt-trunk\cc\projects\classlib\trunk\modules\concurrent\bin\test not found.
C:\bt-trunk\cc\projects\classlib\trunk\modules\lang-management\${hy.lang-management.bin.test}
not found.
The system cannot find the file specified.
Could Not Find C:\bt-trunk\cc\projects\classlib\trunk\deploy\lib\hyfdlibm.pdb
C:\bt-trunk\cc\projects\classlib\trunk\deploy\jdk\include not found.

========================================
Building Java component archives...
========================================
        
Checking for depends/jars/yoko_M2-20070130/yoko.jar
Checking for depends/jars/yoko_M2-20070130/yoko-core.jar
Checking for depends/jars/yoko_M2-20070130/yoko-rmi-impl.jar
Checking for depends/jars/yoko_M2-20070130/yoko-rmi-spec.jar
Checking for depends/jars/bcel-5.2/bcel-5.2.jar
Checking for depends/jars/xalan-j_2.7.0/xalan.jar
Checking for depends/jars/xerces_2.8.0/resolver.jar
Checking for depends/jars/xerces_2.8.0/xercesImpl.jar
Checking for depends/jars/xerces_2.8.0/xml-apis.jar
Checking for depends/jars/junit_3.8.2/junit.jar
Checking for depends/jars/bcprov-jdk15-134/bcprov.jar
Checking for depends/jars/icu4j_3.4.4/icu4j_3_4_4.jar
Checking for depends/jars/mx4j_3.0.2/mx4j.zip
Checking for depends/jars/ecj_3.2/ecj_3.2.jar
Checking for depends/jars/jetty/jetty-6.0.0.jar
Checking for depends/jars/jetty/jetty-util-6.0.0.jar
Checking for depends/jars/jetty/servlet-api-2.5-6.0.0.jar
Checking for depends/libs/windows.x86/msvcr71.dll
Checking for depends/libs/windows.x86/swing_awt_deps_winxp_2006-09-28.tgz
Compiling ACCESSIBILITY classes
Compiling ANNOTATION classes
Compiling APPLET classes
Compiling ARCHIVE classes
Compiling AUTH classes
Compiling AWT classes
Compiling BEANS classes
Compiling CONCURRENT classes
Compiling CRYPTO classes
Compiling ImageIO classes
Compiling INSTRUMENT classes
Compiling JNDI classes
Compiling LANG-MANAGEMENT classes
Compiling LOGGING classes
Compiling LUNI classes
Compiling MATH classes
Compiling MISC classes
Compiling NIO classes
Compiling NIO_CHAR classes
Compiling PACK200 classes
Since fork is false, ignoring memoryMaximumSize setting
Since fork is false, ignoring memoryMaximumSize setting
Compiling PREFS classes
Compiling PRINT classes
Compiling REGEX classes
Compiling RMI classes
Compiling SECURITY classes
Compiling SOUND classes
Since fork is false, ignoring memoryMaximumSize setting
Compiling SQL classes
Compiling Sun Compat classes
Compiling SWING classes
Compiling TEXT classes
Compiling TOOLS classes
Compiling X-NET classes

========================================
Building native libs and executables...
========================================
        
Checking for depends/jars/yoko_M2-20070130/yoko.jar
Checking for depends/jars/yoko_M2-20070130/yoko-core.jar
Checking for depends/jars/yoko_M2-20070130/yoko-rmi-impl.jar
Checking for depends/jars/yoko_M2-20070130/yoko-rmi-spec.jar
Checking for depends/jars/bcel-5.2/bcel-5.2.jar
Checking for depends/jars/xalan-j_2.7.0/xalan.jar
Checking for depends/jars/xerces_2.8.0/resolver.jar
Checking for depends/jars/xerces_2.8.0/xercesImpl.jar
Checking for depends/jars/xerces_2.8.0/xml-apis.jar
Checking for depends/jars/junit_3.8.2/junit.jar
Checking for depends/jars/bcprov-jdk15-134/bcprov.jar
Checking for depends/jars/icu4j_3.4.4/icu4j_3_4_4.jar
Checking for depends/jars/mx4j_3.0.2/mx4j.zip
Checking for depends/jars/ecj_3.2/ecj_3.2.jar
Checking for depends/jars/jetty/jetty-6.0.0.jar
Checking for depends/jars/jetty/jetty-util-6.0.0.jar
Checking for depends/jars/jetty/servlet-api-2.5-6.0.0.jar
Checking for depends/libs/windows.x86/msvcr71.dll
Checking for depends/libs/windows.x86/swing_awt_deps_winxp_2006-09-28.tgz

========================================
Testing class libraries...
========================================

Checking for depends/jars/yoko_M2-20070130/yoko.jar
Checking for depends/jars/yoko_M2-20070130/yoko-core.jar
Checking for depends/jars/yoko_M2-20070130/yoko-rmi-impl.jar
Checking for depends/jars/yoko_M2-20070130/yoko-rmi-spec.jar
Checking for depends/jars/bcel-5.2/bcel-5.2.jar
Checking for depends/jars/xalan-j_2.7.0/xalan.jar
Checking for depends/jars/xerces_2.8.0/resolver.jar
Checking for depends/jars/xerces_2.8.0/xercesImpl.jar
Checking for depends/jars/xerces_2.8.0/xml-apis.jar
Checking for depends/jars/junit_3.8.2/junit.jar
Checking for depends/jars/bcprov-jdk15-134/bcprov.jar
Checking for depends/jars/icu4j_3.4.4/icu4j_3_4_4.jar
Checking for depends/jars/mx4j_3.0.2/mx4j.zip
Checking for depends/jars/ecj_3.2/ecj_3.2.jar
Checking for depends/jars/jetty/jetty-6.0.0.jar
Checking for depends/jars/jetty/jetty-util-6.0.0.jar
Checking for depends/jars/jetty/servlet-api-2.5-6.0.0.jar
Checking for depends/libs/windows.x86/msvcr71.dll
Checking for depends/libs/windows.x86/swing_awt_deps_winxp_2006-09-28.tgz
Since fork is false, ignoring memoryMaximumSize setting
Compiling ACCESSIBILITY classes
Compiling ACCESSIBILITY tests
Since fork is false, ignoring memoryMaximumSize setting
Compiling ANNOTATION classes
Compiling ANNOTATION tests
Since fork is false, ignoring memoryMaximumSize setting
Compiling APPLET classes
Compiling APPLET tests
Since fork is false, ignoring memoryMaximumSize setting
Compiling ARCHIVE classes
Compiling ARCHIVE tests
Since fork is false, ignoring memoryMaximumSize setting
Compiling AUTH classes
Compiling AUTH tests
Since fork is false, ignoring memoryMaximumSize setting
Compiling AWT classes
Compiling AWT tests
Since fork is false, ignoring memoryMaximumSize setting
Unhandled exception
Type=Segmentation error vmState=0x00040000
J9Generic_Signal_Number=00000004 ExceptionCode=c0000005 ExceptionAddress=00000000 ContextFlags=0001003f
Handler1=7FE50390 Handler2=7FD074F0 InaccessibleAddress=00000000
EDI=10D4FC70 ESI=00000020 EAX=00000000 EBX=00000000
ECX=0000007F EDX=00000002
EIP=00000000 ESP=10D4FC5C EBP=10D4FC68
Module=C:\bt-trunk\cc\projects\classlib\trunk\deploy\jdk\jre\bin\java.exe
Module_base_address=00000000 Offset_in_DLL=00000000
Target=2_30_20060727_07300_lHdSMR (Windows 2000 5.0 build 2195 Service Pack 4)
CPU=x86 (1 logical CPUs) (0x3ff4c000 RAM)
JavaVMInitArgs.nOptions=12:
    -Dcom.ibm.oti.vm.vmdir=C:\bt-trunk\cc\projects\classlib\trunk\deploy\jdk\jre\bin\default\
    -Dcom.ibm.oti.vm.exe=C:\bt-trunk\cc\projects\classlib\trunk\deploy\jdk\jre\bin\java.exe
    -Dcom.ibm.oti.vm.bootstrap.library.path=C:\bt-trunk\cc\projects\classlib\trunk\deploy\jdk\jre\bin;C:\bt-trunk\cc\projects\classlib\trunk\deploy\jdk\jre\bin\default
    -Xbootclasspath/p:C:\bt-trunk\cc\projects\classlib\trunk\deploy\jdk\jre\bin\default\luni-kernel.jar;C:\bt-trunk\cc\projects\classlib\trunk\deploy\jdk\jre\bin\default\security-kernel.jar
    -DTEST_SRC_DIR=C:\bt-trunk\cc\projects\classlib\trunk\modules\awt\bin\test
    -Xbootclasspath/a:C:\bt-trunk\cc\projects\classlib\trunk\modules\awt\bin\test;C:\bt-trunk\cc\projects\classlib\trunk\modules\awt/../../depends/jars/junit_3.8.2/junit.jar
    -Djava.class.path=C:\bt-trunk\cc\lib\junit.jar;C:\bt-trunk\cc\lib\ant-launcher.jar;C:\bt-trunk\cc\lib\ant.jar;C:\bt-trunk\cc\lib\ant-junit-1.6.5.jar
    -Djava.home=C:\bt-trunk\cc\projects\classlib\trunk\deploy\jdk\jre
    -Djava.library.path=C:\bt-trunk\cc\projects\classlib\trunk\deploy\jdk\jre\bin\;.;C:\bt-trunk\cc\projects\classlib\trunk\deploy\jdk\jre\bin\default;C:\bt-trunk\cc\projects\classlib\trunk\deploy\jdk\jre\bin\;C:\Program
Files\Microsoft Visual Studio .NET 2003\Common7\IDE;C:\Program Files\Microsoft Visual Studio
.NET 2003\VC7\BIN;C:\Program Files\Microsoft Visual Studio .NET 2003\Common7\Tools;C:\Program
Files\Microsoft Visual Studio .NET 2003\Common7\Tools\bin\prerelease;C:\Program Files\Microsoft
Visual Studio .NET 2003\Common7\Tools\bin;C:\Program Files\Microsoft Visual Studio .NET 2003\SDK\v1.1\bin;C:\WINNT\Microsoft.NET\Framework\v1.1.4322;C:\WINNT\system32;C:\WINNT;C:\WINNT\System32\Wbem;c:\install\bin;c:\install\svn\bin;c:\install\ant\bin;
    _org.apache.harmony.vmi.portlib (extra info: 0012FBB8)
    -Xjcl:jclclear_23
    _j2se_j9=136448
Error: Dump failed - could not link MiniDumpWriteDump in DBGHELP.DLL
Thread: AWT-NativeEventThread (priority 5) (daemon) (LOCATION OF ERROR)
 NATIVE   org/apache/harmony/awt/nativebridge/windows/Win32.IsThemeActive()I
 00000018 org/apache/harmony/awt/wtk/windows/WinEventQueue$ThemeMap.<init>(Lorg/apache/harmony/awt/wtk/windows/WinEventQueue;)V
 0000000a org/apache/harmony/awt/wtk/windows/WinEventQueue.<init>(Lorg/apache/harmony/awt/wtk/windows/WinSystemProperties;)V
 00000018 org/apache/harmony/awt/wtk/windows/WinWTK.<init>()V
 NATIVE   java/lang/Class.newInstanceImpl()Ljava/lang/Object;
 00000006 java/lang/Class.newInstance()Ljava/lang/Object;
 00000006 java/awt/Toolkit.createWTK(Ljava/lang/String;)Lorg/apache/harmony/awt/wtk/WTK;
 00000002 java/awt/Toolkit.access$1(Ljava/awt/Toolkit;Ljava/lang/String;)Lorg/apache/harmony/awt/wtk/WTK;
 0000000c java/awt/Toolkit$1.init()Lorg/apache/harmony/awt/wtk/WTK;
 0000000b org/apache/harmony/awt/wtk/NativeEventThread.run()V
Thread: main (priority 5)
 NATIVE   java/lang/Object.wait(JI)V
 00000003 java/lang/Object.wait()V
 0000000e org/apache/harmony/awt/wtk/NativeEventThread.start(Lorg/apache/harmony/awt/wtk/NativeEventThread$Init;)V
 0000007a java/awt/Toolkit.init()V
 00000092 java/awt/Toolkit.<init>()V
 00000033 java/awt/Toolkit.getDefaultToolkit()Ljava/awt/Toolkit;
 0000000a java/awt/MenuComponent.<init>()V
 00000001 java/awt/MenuItem.<init>(Ljava/lang/String;Ljava/awt/MenuShortcut;)V
 00000004 java/awt/MenuItem.<init>()V
 00000001 java/awt/CheckboxMenuItem.<init>()V
 00000009 java/awt/AccessibleAWTCheckboxMenuItemTest.setUp()V
 00000003 junit/framework/TestCase.runBare()V
 00000004 junit/framework/TestResult$1.protect()V
 00000003 junit/framework/TestResult.runProtected(Ljunit/framework/Test;Ljunit/framework/Protectable;)V
 00000012 junit/framework/TestResult.run(Ljunit/framework/TestCase;)V
 00000002 junit/framework/TestCase.run(Ljunit/framework/TestResult;)V
 00000004 junit/framework/TestSuite.runTest(Ljunit/framework/Test;Ljunit/framework/TestResult;)V
 00000025 junit/framework/TestSuite.run(Ljunit/framework/TestResult;)V
 000001a2 org/apache/tools/ant/taskdefs/optional/junit/JUnitTestRunner.run()V
 00000023 org/apache/tools/ant/taskdefs/optional/junit/JUnitTestRunner.launch(Lorg/apache/tools/ant/taskdefs/optional/junit/JUnitTest;ZZZZLjava/util/Properties;)I
 000001b9 org/apache/tools/ant/taskdefs/optional/junit/JUnitTestRunner.main([Ljava/lang/String;)V
Thread: JIT Compilation Thread (priority 10) (daemon)
Thread: Finalizer thread (priority 5) (daemon)
Thread: AWT-DataTransferThread (priority 5) (daemon)
 NATIVE   org/apache/harmony/awt/nativebridge/windows/Win32.GetMessageW(JJII)I
 00000016 org/apache/harmony/awt/nativebridge/windows/Win32.GetMessageW(Lorg/apache/harmony/awt/nativebridge/windows/Win32$MSG;JII)I
 0000001a org/apache/harmony/awt/datatransfer/windows/WinDTK.runEventLoop()V
 00000025 org/apache/harmony/awt/datatransfer/DataTransferThread.run()V
Compiling BEANS classes
Compiling support classes for BEANS tests
Compiling internal BEANS tests
Compiling BEANS tests
Since fork is false, ignoring memoryMaximumSize setting
Running internal BEANS tests
Running BEANS tests
Unhandled exception
Type=Segmentation error vmState=0x00040000
J9Generic_Signal_Number=00000004 ExceptionCode=c0000005 ExceptionAddress=00000000 ContextFlags=0001003f
Handler1=7FE50390 Handler2=7FD074F0 InaccessibleAddress=00000000
EDI=0140FC70 ESI=00000020 EAX=00000000 EBX=00000000
ECX=0000007F EDX=00000002
EIP=00000000 ESP=0140FC5C EBP=0140FC68
Module=C:\bt-trunk\cc\projects\classlib\trunk\deploy\jdk\jre\bin\java.exe
Module_base_address=00000000 Offset_in_DLL=00000000
Target=2_30_20060727_07300_lHdSMR (Windows 2000 5.0 build 2195 Service Pack 4)
CPU=x86 (1 logical CPUs) (0x3ff4c000 RAM)
JavaVMInitArgs.nOptions=10:
    -Dcom.ibm.oti.vm.vmdir=C:\bt-trunk\cc\projects\classlib\trunk\deploy\jdk\jre\bin\default\
    -Dcom.ibm.oti.vm.exe=C:\bt-trunk\cc\projects\classlib\trunk\deploy\jdk\jre\bin\java.exe
    -Dcom.ibm.oti.vm.bootstrap.library.path=C:\bt-trunk\cc\projects\classlib\trunk\deploy\jdk\jre\bin;C:\bt-trunk\cc\projects\classlib\trunk\deploy\jdk\jre\bin\default
    -Xbootclasspath/p:C:\bt-trunk\cc\projects\classlib\trunk\deploy\jdk\jre\bin\default\luni-kernel.jar;C:\bt-trunk\cc\projects\classlib\trunk\deploy\jdk\jre\bin\default\security-kernel.jar
    -Djava.class.path=C:\bt-trunk\cc\projects\classlib\trunk\modules\beans\bin\test;C:\bt-trunk\cc\projects\classlib\trunk\modules\beans\bin\test_support;C:\bt-trunk\cc\projects\classlib\trunk\modules\beans\src\test\resources;C:\bt-trunk\cc\projects\classlib\trunk\deploy\build\test\support.jar;C:\bt-trunk\cc\lib\junit.jar;C:\bt-trunk\cc\lib\ant-launcher.jar;C:\bt-trunk\cc\lib\ant.jar;C:\bt-trunk\cc\lib\ant-junit-1.6.5.jar
    -Djava.home=C:\bt-trunk\cc\projects\classlib\trunk\deploy\jdk\jre
    -Djava.library.path=C:\bt-trunk\cc\projects\classlib\trunk\deploy\jdk\jre\bin\;.;C:\bt-trunk\cc\projects\classlib\trunk\deploy\jdk\jre\bin\default;C:\bt-trunk\cc\projects\classlib\trunk\deploy\jdk\jre\bin\;C:\Program
Files\Microsoft Visual Studio .NET 2003\Common7\IDE;C:\Program Files\Microsoft Visual Studio
.NET 2003\VC7\BIN;C:\Program Files\Microsoft Visual Studio .NET 2003\Common7\Tools;C:\Program
Files\Microsoft Visual Studio .NET 2003\Common7\Tools\bin\prerelease;C:\Program Files\Microsoft
Visual Studio .NET 2003\Common7\Tools\bin;C:\Program Files\Microsoft Visual Studio .NET 2003\SDK\v1.1\bin;C:\WINNT\Microsoft.NET\Framework\v1.1.4322;C:\WINNT\system32;C:\WINNT;C:\WINNT\System32\Wbem;c:\install\bin;c:\install\svn\bin;c:\install\ant\bin;
    _org.apache.harmony.vmi.portlib (extra info: 0012FBB8)
    -Xjcl:jclclear_23
    _j2se_j9=136448
Error: Dump failed - could not link MiniDumpWriteDump in DBGHELP.DLL
Thread: AWT-NativeEventThread (priority 5) (daemon) (LOCATION OF ERROR)
 NATIVE   org/apache/harmony/awt/nativebridge/windows/Win32.IsThemeActive()I
 00000018 org/apache/harmony/awt/wtk/windows/WinEventQueue$ThemeMap.<init>(Lorg/apache/harmony/awt/wtk/windows/WinEventQueue;)V
 0000000a org/apache/harmony/awt/wtk/windows/WinEventQueue.<init>(Lorg/apache/harmony/awt/wtk/windows/WinSystemProperties;)V
 00000018 org/apache/harmony/awt/wtk/windows/WinWTK.<init>()V
 NATIVE   java/lang/Class.newInstanceImpl()Ljava/lang/Object;
 00000006 java/lang/Class.newInstance()Ljava/lang/Object;
 00000006 java/awt/Toolkit.createWTK(Ljava/lang/String;)Lorg/apache/harmony/awt/wtk/WTK;
 00000002 java/awt/Toolkit.access$1(Ljava/awt/Toolkit;Ljava/lang/String;)Lorg/apache/harmony/awt/wtk/WTK;
 0000000c java/awt/Toolkit$1.init()Lorg/apache/harmony/awt/wtk/WTK;
 0000000b org/apache/harmony/awt/wtk/NativeEventThread.run()V
Thread: main (priority 5)
 NATIVE   java/lang/Object.wait(JI)V
 00000003 java/lang/Object.wait()V
 0000000e org/apache/harmony/awt/wtk/NativeEventThread.start(Lorg/apache/harmony/awt/wtk/NativeEventThread$Init;)V
 0000007a java/awt/Toolkit.init()V
 00000092 java/awt/Toolkit.<init>()V
 00000033 java/awt/Toolkit.getDefaultToolkit()Ljava/awt/Toolkit;
 0000000d java/beans/SimpleBeanInfo.loadImage(Ljava/lang/String;)Ljava/awt/Image;
 0000000b org/apache/harmony/beans/tests/java/beans/SimpleBeanInfoTest.testLoadImage()V
 00000004 java/lang/reflect/AccessibleObject.invokeV(Ljava/lang/Object;[Ljava/lang/Object;)V
 0000043a java/lang/reflect/Method.invoke(Ljava/lang/Object;[Ljava/lang/Object;)Ljava/lang/Object;
 (@31E2D276)
 00000060 junit/framework/TestCase.runTest()V
 00000005 junit/framework/TestCase.runBare()V
 00000004 junit/framework/TestResult$1.protect()V
 00000003 junit/framework/TestResult.runProtected(Ljunit/framework/Test;Ljunit/framework/Protectable;)V
 00000011 junit/framework/TestResult.run(Ljunit/framework/TestCase;)V
 00000002 junit/framework/TestCase.run(Ljunit/framework/TestResult;)V
 INLINED  junit/framework/TestSuite.runTest(Ljunit/framework/Test;Ljunit/framework/TestResult;)V
 (@31E3012E)
 00000188 junit/framework/TestSuite.run(Ljunit/framework/TestResult;)V  (@31E3012E)
 000001a2 org/apache/tools/ant/taskdefs/optional/junit/JUnitTestRunner.run()V
 00000023 org/apache/tools/ant/taskdefs/optional/junit/JUnitTestRunner.launch(Lorg/apache/tools/ant/taskdefs/optional/junit/JUnitTest;ZZZZLjava/util/Properties;)I
 000001b9 org/apache/tools/ant/taskdefs/optional/junit/JUnitTestRunner.main([Ljava/lang/String;)V
Thread: JIT Compilation Thread (priority 10) (daemon)
Thread: Finalizer thread (priority 5) (daemon)
Thread: AWT-DataTransferThread (priority 5) (daemon)
 NATIVE   org/apache/harmony/awt/nativebridge/windows/Win32.GetMessageW(JJII)I
 00000016 org/apache/harmony/awt/nativebridge/windows/Win32.GetMessageW(Lorg/apache/harmony/awt/nativebridge/windows/Win32$MSG;JII)I
 0000001a org/apache/harmony/awt/datatransfer/windows/WinDTK.runEventLoop()V
 00000025 org/apache/harmony/awt/datatransfer/DataTransferThread.run()V
Compiling CRYPTO classes
Compiling CRYPTO test support files
Since fork is false, ignoring memoryMaximumSize setting
Compiling CRYPTO api tests
Since fork is false, ignoring memoryMaximumSize setting
Compiling CRYPTO api injected tests
Since fork is false, ignoring memoryMaximumSize setting
Compiling CRYPTO impl injected tests
Since fork is false, ignoring memoryMaximumSize setting
Compiling CRYPTO impl tests
Since fork is false, ignoring memoryMaximumSize setting
Running CRYPTO api tests
Running CRYPTO api.injected tests
Running CRYPTO impl tests
Running CRYPTO impl injected tests
Compiling ImageIO classes
Compiling ImageIO tests
Compiling INSTRUMENT classes
Compiling INSTRUMENT tests
Since fork is false, ignoring memoryMaximumSize setting
Compiling JNDI classes
Compiling JNDI tests
Since fork is false, ignoring memoryMaximumSize setting
Compiling LANG-MANAGEMENT classes
Compiling LANG-MANAGEMENT API tests
Compiling LANG-MANAGEMENT Implementation tests
Compiling LOGGING classes
Compiling LOGGING tests
Since fork is false, ignoring memoryMaximumSize setting
Compiling LUNI classes
Compiling LUNI JUnit Tests
Since fork is false, ignoring memoryMaximumSize setting
Running LUNI JUnit Tests
Compiling MATH classes
Compiling MATH tests
Since fork is false, ignoring memoryMaximumSize setting
Compiling MISC classes
Compiling MISC tests
Since fork is false, ignoring memoryMaximumSize setting
Compiling NIO classes
Compiling NIO tests
Since fork is false, ignoring memoryMaximumSize setting
Compiling NIO_CHAR classes
Compiling NIO_CHAR tests
Since fork is false, ignoring memoryMaximumSize setting
Cannot find unmappable byte array for US-ASCII
Cannot find unmappable byte array for gb18030
Cannot find unmappable byte array for ISO-8859-1
Cannot find malform byte array for ISO-8859-1
Cannot find unmappable byte array for UTF-16BE
Cannot find malform byte array for UTF-16BE
Cannot find unmappable byte array for UTF-16LE
Cannot find malform byte array for UTF-16LE
Cannot find unmappable byte array for UTF-8
Compiling PACK200 classes
Compiling PACK200 tests
Since fork is false, ignoring memoryMaximumSize setting
Running PACK200 tests
Compiling PREFS classes
Compiling PREFS tests
Since fork is false, ignoring memoryMaximumSize setting
Compiling PRINT classes
Compiling Print tests
Since fork is false, ignoring memoryMaximumSize setting
Compiling REGEX classes
Compiling REGEX tests
Since fork is false, ignoring memoryMaximumSize setting
Compiling RMI classes
Compiling RMI api tests
Since fork is false, ignoring memoryMaximumSize setting
Running RMI api tests
Unexporting MyRemoteObject1[UnicastServerRef[endpoint:[[192.168.1.150:4826]](local), ObjID[65536,
UID[341e341e:1110131db11:-7ff7]]]] ...
Done.
Unexporting MyRemoteObject1[UnicastServerRef[endpoint:[[192.168.1.150:4827]](local), ObjID[65537,
UID[341e341e:1110131db11:-7ff6]]]] ...
Done.
Unexporting MyRemoteObject1[UnicastServerRef[endpoint:[[192.168.1.150:4828]](local), ObjID[65538,
UID[341e341e:1110131db11:-7ff5]]]] ...
Done.
Unexporting MyRemoteObject1[UnicastServerRef[endpoint:[[192.168.1.150:4829]](local), ObjID[65539,
UID[341e341e:1110131db11:-7ff4]]]] ...
Done.
Unexporting MyRemoteObject1[UnicastServerRef[endpoint:[[192.168.1.150:4830]](local), ObjID[65540,
UID[341e341e:1110131db11:-7ff3]]]] ...
Done.
Unexporting MyRemoteObject1[UnicastServerRef[endpoint:[[192.168.1.150:4831]](local), ObjID[65541,
UID[341e341e:1110131db11:-7ff2]]]] ...
Done.
Unexporting MyRemoteObject1[UnicastServerRef[endpoint:[[192.168.1.150:4832]](local), ObjID[65542,
UID[341e341e:1110131db11:-7ff1]]]] ...
Done.
Unexporting MyRemoteObject1[UnicastServerRef[endpoint:[[192.168.1.150:4833]](local), ObjID[65543,
UID[341e341e:1110131db11:-7ff0]]]] ...
Done.
LogStream[tst]:
Compiling SECURITY classes
Compiling SECURITY test support files
Since fork is false, ignoring memoryMaximumSize setting
Compiling SECURITY api tests
Since fork is false, ignoring memoryMaximumSize setting
Compiling SECURITY api injected tests
Since fork is false, ignoring memoryMaximumSize setting
Compiling SECURITY impl injected tests
Since fork is false, ignoring memoryMaximumSize setting
Compiling SECURITY impl tests
Since fork is false, ignoring memoryMaximumSize setting
Running SECURITY api tests
Running SECURITY api.injected tests
Running SECURITY impl tests
Running SECURITY impl injected tests
Compiling SOUND classes
Compiling SOUND tests
Since fork is false, ignoring memoryMaximumSize setting
Compiling SQL classes
Compiling SQL tests
Since fork is false, ignoring memoryMaximumSize setting
Compiling Sun Compat classes
Compiling SUNCOMPAT tests
Compiling SWING classes
Compiling SWING tests
Since fork is false, ignoring memoryMaximumSize setting
Unhandled exception
Type=Segmentation error vmState=0x00040000
J9Generic_Signal_Number=00000004 ExceptionCode=c0000005 ExceptionAddress=00000000 ContextFlags=0001003f
Handler1=7FE50390 Handler2=7FD074F0 InaccessibleAddress=00000000
EDI=00EBFC70 ESI=00000020 EAX=00000000 EBX=00000000
ECX=0000007F EDX=00000002
EIP=00000000 ESP=00EBFC5C EBP=00EBFC68
Module=C:\bt-trunk\cc\projects\classlib\trunk\deploy\jdk\jre\bin\java.exe
Module_base_address=00000000 Offset_in_DLL=00000000
Target=2_30_20060727_07300_lHdSMR (Windows 2000 5.0 build 2195 Service Pack 4)
CPU=x86 (1 logical CPUs) (0x3ff4c000 RAM)
JavaVMInitArgs.nOptions=11:
    -Dcom.ibm.oti.vm.vmdir=C:\bt-trunk\cc\projects\classlib\trunk\deploy\jdk\jre\bin\default\
    -Dcom.ibm.oti.vm.exe=C:\bt-trunk\cc\projects\classlib\trunk\deploy\jdk\jre\bin\java.exe
    -Dcom.ibm.oti.vm.bootstrap.library.path=C:\bt-trunk\cc\projects\classlib\trunk\deploy\jdk\jre\bin;C:\bt-trunk\cc\projects\classlib\trunk\deploy\jdk\jre\bin\default
    -Xbootclasspath/p:C:\bt-trunk\cc\projects\classlib\trunk\deploy\jdk\jre\bin\default\luni-kernel.jar;C:\bt-trunk\cc\projects\classlib\trunk\deploy\jdk\jre\bin\default\security-kernel.jar
    -Xbootclasspath/a:C:\bt-trunk\cc\projects\classlib\trunk\modules\swing\bin\test;../../depends/jars/junit_3.8.2/junit.jar;C:\bt-trunk\cc\projects\classlib\trunk\deploy/build/test/support.jar
    -Djava.class.path=C:\bt-trunk\cc\lib\junit.jar;C:\bt-trunk\cc\lib\ant-launcher.jar;C:\bt-trunk\cc\lib\ant.jar;C:\bt-trunk\cc\lib\ant-junit-1.6.5.jar
    -Djava.home=C:\bt-trunk\cc\projects\classlib\trunk\deploy\jdk\jre
    -Djava.library.path=C:\bt-trunk\cc\projects\classlib\trunk\deploy\jdk\jre\bin\;.;C:\bt-trunk\cc\projects\classlib\trunk\deploy\jdk\jre\bin\default;C:\bt-trunk\cc\projects\classlib\trunk\deploy\jdk\jre\bin\;C:\Program
Files\Microsoft Visual Studio .NET 2003\Common7\IDE;C:\Program Files\Microsoft Visual Studio
.NET 2003\VC7\BIN;C:\Program Files\Microsoft Visual Studio .NET 2003\Common7\Tools;C:\Program
Files\Microsoft Visual Studio .NET 2003\Common7\Tools\bin\prerelease;C:\Program Files\Microsoft
Visual Studio .NET 2003\Common7\Tools\bin;C:\Program Files\Microsoft Visual Studio .NET 2003\SDK\v1.1\bin;C:\WINNT\Microsoft.NET\Framework\v1.1.4322;C:\WINNT\system32;C:\WINNT;C:\WINNT\System32\Wbem;c:\install\bin;c:\install\svn\bin;c:\install\ant\bin;
    _org.apache.harmony.vmi.portlib (extra info: 0012FBB8)
    -Xjcl:jclclear_23
    _j2se_j9=136448
Error: Dump failed - could not link MiniDumpWriteDump in DBGHELP.DLL
Thread: AWT-NativeEventThread (priority 5) (daemon) (LOCATION OF ERROR)
 NATIVE   org/apache/harmony/awt/nativebridge/windows/Win32.IsThemeActive()I
 00000018 org/apache/harmony/awt/wtk/windows/WinEventQueue$ThemeMap.<init>(Lorg/apache/harmony/awt/wtk/windows/WinEventQueue;)V
 0000000a org/apache/harmony/awt/wtk/windows/WinEventQueue.<init>(Lorg/apache/harmony/awt/wtk/windows/WinSystemProperties;)V
 00000018 org/apache/harmony/awt/wtk/windows/WinWTK.<init>()V
 NATIVE   java/lang/Class.newInstanceImpl()Ljava/lang/Object;
 00000006 java/lang/Class.newInstance()Ljava/lang/Object;
 00000006 java/awt/Toolkit.createWTK(Ljava/lang/String;)Lorg/apache/harmony/awt/wtk/WTK;
 00000002 java/awt/Toolkit.access$1(Ljava/awt/Toolkit;Ljava/lang/String;)Lorg/apache/harmony/awt/wtk/WTK;
 0000000c java/awt/Toolkit$1.init()Lorg/apache/harmony/awt/wtk/WTK;
 0000000b org/apache/harmony/awt/wtk/NativeEventThread.run()V
Thread: main (priority 5)
 NATIVE   java/lang/Object.wait(JI)V
 00000003 java/lang/Object.wait(J)V
 00000063 java/lang/Thread.join(JI)V
 00000003 java/lang/Thread.join(J)V
 0000001e javax/swing/BasicSwingTestCase.runBare()V
 00000004 junit/framework/TestResult$1.protect()V
 00000003 junit/framework/TestResult.runProtected(Ljunit/framework/Test;Ljunit/framework/Protectable;)V
 00000012 junit/framework/TestResult.run(Ljunit/framework/TestCase;)V
 00000002 junit/framework/TestCase.run(Ljunit/framework/TestResult;)V
 00000004 junit/framework/TestSuite.runTest(Ljunit/framework/Test;Ljunit/framework/TestResult;)V
 00000025 junit/framework/TestSuite.run(Ljunit/framework/TestResult;)V
 000001a2 org/apache/tools/ant/taskdefs/optional/junit/JUnitTestRunner.run()V
 00000023 org/apache/tools/ant/taskdefs/optional/junit/JUnitTestRunner.launch(Lorg/apache/tools/ant/taskdefs/optional/junit/JUnitTest;ZZZZLjava/util/Properties;)I
 000001b9 org/apache/tools/ant/taskdefs/optional/junit/JUnitTestRunner.main([Ljava/lang/String;)V
Thread: JIT Compilation Thread (priority 10) (daemon)
Thread: Thread-0 (priority 5)
 NATIVE   java/lang/Object.wait(JI)V
 00000003 java/lang/Object.wait()V
 0000000e org/apache/harmony/awt/wtk/NativeEventThread.start(Lorg/apache/harmony/awt/wtk/NativeEventThread$Init;)V
 0000007a java/awt/Toolkit.init()V
 00000092 java/awt/Toolkit.<init>()V
 00000033 java/awt/Toolkit.getDefaultToolkit()Ljava/awt/Toolkit;
 0000000e java/awt/EventQueue.invokeAndWait(Ljava/lang/Runnable;)V
 0000000e javax/swing/SwingTestCase.runBareImpl()Ljava/lang/Throwable;
 00000009 javax/swing/BasicSwingTestCase$1.run()V
 0000000d java/lang/Thread.run()V
Thread: Finalizer thread (priority 5) (daemon)
Thread: AWT-DataTransferThread (priority 5) (daemon)
 NATIVE   org/apache/harmony/awt/nativebridge/windows/Win32.GetMessageW(JJII)I
 00000016 org/apache/harmony/awt/nativebridge/windows/Win32.GetMessageW(Lorg/apache/harmony/awt/nativebridge/windows/Win32$MSG;JII)I
 0000001a org/apache/harmony/awt/datatransfer/windows/WinDTK.runEventLoop()V
 00000025 org/apache/harmony/awt/datatransfer/DataTransferThread.run()V
Compiling TEXT classes
Compiling TEXT tests
Since fork is false, ignoring memoryMaximumSize setting
Compiling TOOLS classes
Compiling Tools tests
Since fork is false, ignoring memoryMaximumSize setting
Compiling X-NET classes
Compiling X-NET test support files
Since fork is false, ignoring memoryMaximumSize setting
Compiling X-NET api tests
Since fork is false, ignoring memoryMaximumSize setting
Compiling X-NET impl injected tests
Since fork is false, ignoring memoryMaximumSize setting
Compiling X-NET impl tests
Since fork is false, ignoring memoryMaximumSize setting
Running X-NET api tests
Running X-NET impl tests
Running X-NET impl injected tests
The test report is in C:\bt-trunk\cc\projects\classlib\trunk\build\test_report\html\index.html

***********************************************************
Unit Tests: (0)
        
No Tests Run: This project doesn't have any tests

***********************************************************
Modifications since last successful build:	(59)
            
modified ayza  /harmony/enhanced/classlib/trunk/modules/security/src/main/native/security/windows
02/26/2007 11:00:20 Fix that allows embedding assembly manifests into corresponding DLL/EXE
files during the build process. This was MSVS 2005-specific issue. See HARMONY-3240.
modified ayza  /harmony/enhanced/classlib/trunk/depends/build/rules.mak 02/26/2007 11:00:20
Fix that allows embedding assembly manifests into corresponding DLL/EXE files during the build
process. This was MSVS 2005-specific issue. See HARMONY-3240.
modified ayza  /harmony/enhanced/classlib/trunk/modules/nio/src/main/native/nio 02/26/2007
11:00:20 Fix that allows embedding assembly manifests into corresponding DLL/EXE files during
the build process. This was MSVS 2005-specific issue. See HARMONY-3240.
modified ayza  /harmony/enhanced/classlib/trunk/modules/prefs/build.xml 02/26/2007 11:00:20
Fix that allows embedding assembly manifests into corresponding DLL/EXE files during the build
process. This was MSVS 2005-specific issue. See HARMONY-3240.
modified ayza  /harmony/enhanced/classlib/trunk/modules/portlib/src/test/native/hytime/windows/makefile
02/26/2007 11:00:20 Fix that allows embedding assembly manifests into corresponding DLL/EXE
files during the build process. This was MSVS 2005-specific issue. See HARMONY-3240.
modified ayza  /harmony/enhanced/classlib/trunk/modules/archive/build.xml 02/26/2007 11:00:20
Fix that allows embedding assembly manifests into corresponding DLL/EXE files during the build
process. This was MSVS 2005-specific issue. See HARMONY-3240.
modified ayza  /harmony/enhanced/classlib/trunk/modules/awt/src/main/native/winfont 02/26/2007
11:00:20 Fix that allows embedding assembly manifests into corresponding DLL/EXE files during
the build process. This was MSVS 2005-specific issue. See HARMONY-3240.
modified ayza  /harmony/enhanced/classlib/trunk/modules/misc/src/main/native/accessors 02/26/2007
11:00:20 Fix that allows embedding assembly manifests into corresponding DLL/EXE files during
the build process. This was MSVS 2005-specific issue. See HARMONY-3240.
modified ayza  /harmony/enhanced/classlib/trunk/modules/portlib/src/test/native/init/windows/makefile
02/26/2007 11:00:20 Fix that allows embedding assembly manifests into corresponding DLL/EXE
files during the build process. This was MSVS 2005-specific issue. See HARMONY-3240.
modified ayza  /harmony/enhanced/classlib/trunk/modules/portlib/src/main/native/thread 02/26/2007
11:00:20 Fix that allows embedding assembly manifests into corresponding DLL/EXE files during
the build process. This was MSVS 2005-specific issue. See HARMONY-3240.
modified ayza  /harmony/enhanced/classlib/trunk/modules/nio/build.xml 02/26/2007 11:00:20
Fix that allows embedding assembly manifests into corresponding DLL/EXE files during the build
process. This was MSVS 2005-specific issue. See HARMONY-3240.
modified ayza  /harmony/enhanced/classlib/trunk/modules/portlib/src/main/native/common/windows/windows.x86_64
02/26/2007 11:00:20 Fix that allows embedding assembly manifests into corresponding DLL/EXE
files during the build process. This was MSVS 2005-specific issue. See HARMONY-3240.
modified ayza  /harmony/enhanced/classlib/trunk/modules/print/src/main/native/print 02/26/2007
11:00:20 Fix that allows embedding assembly manifests into corresponding DLL/EXE files during
the build process. This was MSVS 2005-specific issue. See HARMONY-3240.
modified ayza  /harmony/enhanced/classlib/trunk/modules/misc/build.xml 02/26/2007 11:00:20
Fix that allows embedding assembly manifests into corresponding DLL/EXE files during the build
process. This was MSVS 2005-specific issue. See HARMONY-3240.
modified ayza  /harmony/enhanced/classlib/trunk/modules/awt/build.xml 02/26/2007 11:00:20
Fix that allows embedding assembly manifests into corresponding DLL/EXE files during the build
process. This was MSVS 2005-specific issue. See HARMONY-3240.
modified ayza  /harmony/enhanced/classlib/trunk/modules/print/build.xml 02/26/2007 11:00:20
Fix that allows embedding assembly manifests into corresponding DLL/EXE files during the build
process. This was MSVS 2005-specific issue. See HARMONY-3240.
modified ayza  /harmony/enhanced/classlib/trunk/modules/awt/src/main/native/gl 02/26/2007
11:00:20 Fix that allows embedding assembly manifests into corresponding DLL/EXE files during
the build process. This was MSVS 2005-specific issue. See HARMONY-3240.
modified ayza  /harmony/enhanced/classlib/trunk/modules/portlib/src/main/native/sig 02/26/2007
11:00:20 Fix that allows embedding assembly manifests into corresponding DLL/EXE files during
the build process. This was MSVS 2005-specific issue. See HARMONY-3240.
modified ayza  /harmony/enhanced/classlib/trunk/modules/awt/src/main/native/win32wrapper 02/26/2007
11:00:20 Fix that allows embedding assembly manifests into corresponding DLL/EXE files during
the build process. This was MSVS 2005-specific issue. See HARMONY-3240.
modified ayza  /harmony/enhanced/classlib/trunk/modules/imageio/src/main/native/jpegencoder
02/26/2007 11:00:20 Fix that allows embedding assembly manifests into corresponding DLL/EXE
files during the build process. This was MSVS 2005-specific issue. See HARMONY-3240.
modified ayza  /harmony/enhanced/classlib/trunk/modules/portlib/src/test/native/hyerror 02/26/2007
11:00:20 Fix that allows embedding assembly manifests into corresponding DLL/EXE files during
the build process. This was MSVS 2005-specific issue. See HARMONY-3240.
modified ayza  /harmony/enhanced/classlib/trunk/modules/auth/src/main/native/auth 02/26/2007
11:00:20 Fix that allows embedding assembly manifests into corresponding DLL/EXE files during
the build process. This was MSVS 2005-specific issue. See HARMONY-3240.
modified ayza  /harmony/enhanced/classlib/trunk/modules/portlib/src/main/native/thread/windows/windows.x86_64
02/26/2007 11:00:20 Fix that allows embedding assembly manifests into corresponding DLL/EXE
files during the build process. This was MSVS 2005-specific issue. See HARMONY-3240.
modified ayza  /harmony/enhanced/classlib/trunk/modules/security/build.xml 02/26/2007 11:00:20
Fix that allows embedding assembly manifests into corresponding DLL/EXE files during the build
process. This was MSVS 2005-specific issue. See HARMONY-3240.
modified ayza  /harmony/enhanced/classlib/trunk/modules/luni/build.xml 02/26/2007 11:00:20
Fix that allows embedding assembly manifests into corresponding DLL/EXE files during the build
process. This was MSVS 2005-specific issue. See HARMONY-3240.
modified ayza  /harmony/enhanced/classlib/trunk/modules/portlib/src/test/native/hytime 02/26/2007
11:00:20 Fix that allows embedding assembly manifests into corresponding DLL/EXE files during
the build process. This was MSVS 2005-specific issue. See HARMONY-3240.
modified ayza  /harmony/enhanced/classlib/trunk/modules/awt/src/main/native/jpegdecoder 02/26/2007
11:00:20 Fix that allows embedding assembly manifests into corresponding DLL/EXE files during
the build process. This was MSVS 2005-specific issue. See HARMONY-3240.
modified ayza  /harmony/enhanced/classlib/trunk/modules/imageio/build.xml 02/26/2007 11:00:20
Fix that allows embedding assembly manifests into corresponding DLL/EXE files during the build
process. This was MSVS 2005-specific issue. See HARMONY-3240.
modified ayza  /harmony/enhanced/classlib/trunk/modules/portlib/src/test/native/hyerror/windows/makefile
02/26/2007 11:00:20 Fix that allows embedding assembly manifests into corresponding DLL/EXE
files during the build process. This was MSVS 2005-specific issue. See HARMONY-3240.
modified ayza  /harmony/enhanced/classlib/trunk/modules/portlib/build.xml 02/26/2007 11:00:20
Fix that allows embedding assembly manifests into corresponding DLL/EXE files during the build
process. This was MSVS 2005-specific issue. See HARMONY-3240.
modified ayza  /harmony/enhanced/classlib/trunk/modules/luni/src/main/native/launcher 02/26/2007
11:00:20 Fix that allows embedding assembly manifests into corresponding DLL/EXE files during
the build process. This was MSVS 2005-specific issue. See HARMONY-3240.
modified ayza  /harmony/enhanced/classlib/trunk/modules/text/src/main/native/text 02/26/2007
11:00:20 Fix that allows embedding assembly manifests into corresponding DLL/EXE files during
the build process. This was MSVS 2005-specific issue. See HARMONY-3240.
modified ayza  /harmony/enhanced/classlib/trunk/modules/portlib/src/test/native/init 02/26/2007
11:00:20 Fix that allows embedding assembly manifests into corresponding DLL/EXE files during
the build process. This was MSVS 2005-specific issue. See HARMONY-3240.
modified ayza  /harmony/enhanced/classlib/trunk/modules/awt/src/main/native/oglwrapper 02/26/2007
11:00:20 Fix that allows embedding assembly manifests into corresponding DLL/EXE files during
the build process. This was MSVS 2005-specific issue. See HARMONY-3240.
modified ayza  /harmony/enhanced/classlib/trunk/modules/security/src/main/native/security
02/26/2007 11:00:20 Fix that allows embedding assembly manifests into corresponding DLL/EXE
files during the build process. This was MSVS 2005-specific issue. See HARMONY-3240.
modified ayza  /harmony/enhanced/classlib/trunk/modules/luni/src/main/native/luni 02/26/2007
11:00:20 Fix that allows embedding assembly manifests into corresponding DLL/EXE files during
the build process. This was MSVS 2005-specific issue. See HARMONY-3240.
modified ayza  /harmony/enhanced/classlib/trunk/modules/archive/src/main/native/zlib 02/26/2007
11:00:20 Fix that allows embedding assembly manifests into corresponding DLL/EXE files during
the build process. This was MSVS 2005-specific issue. See HARMONY-3240.
modified ayza  /harmony/enhanced/classlib/trunk/modules/text/build.xml 02/26/2007 11:00:20
Fix that allows embedding assembly manifests into corresponding DLL/EXE files during the build
process. This was MSVS 2005-specific issue. See HARMONY-3240.
modified ayza  /harmony/enhanced/classlib/trunk/modules/print/src/main/native/print/windows
02/26/2007 11:00:20 Fix that allows embedding assembly manifests into corresponding DLL/EXE
files during the build process. This was MSVS 2005-specific issue. See HARMONY-3240.
modified ayza  /harmony/enhanced/classlib/trunk/modules/awt/src/main/native/lcmm 02/26/2007
11:00:20 Fix that allows embedding assembly manifests into corresponding DLL/EXE files during
the build process. This was MSVS 2005-specific issue. See HARMONY-3240.
modified ayza  /harmony/enhanced/classlib/trunk/modules/portlib/src/test/native/hyfile 02/26/2007
11:00:20 Fix that allows embedding assembly manifests into corresponding DLL/EXE files during
the build process. This was MSVS 2005-specific issue. See HARMONY-3240.
modified ayza  /harmony/enhanced/classlib/trunk/depends/libs/windows.x86_64 02/26/2007 11:00:20
Fix that allows embedding assembly manifests into corresponding DLL/EXE files during the build
process. This was MSVS 2005-specific issue. See HARMONY-3240.
modified ayza  /harmony/enhanced/classlib/trunk/modules/imageio/src/main/native/jpegencoder/windows
02/26/2007 11:00:20 Fix that allows embedding assembly manifests into corresponding DLL/EXE
files during the build process. This was MSVS 2005-specific issue. See HARMONY-3240.
modified ayza  /harmony/enhanced/classlib/trunk/modules/portlib/src/test/native/hyfile/windows/makefile
02/26/2007 11:00:20 Fix that allows embedding assembly manifests into corresponding DLL/EXE
files during the build process. This was MSVS 2005-specific issue. See HARMONY-3240.
modified ayza  /harmony/enhanced/classlib/trunk/modules/prefs/src/main/native/prefs 02/26/2007
11:00:20 Fix that allows embedding assembly manifests into corresponding DLL/EXE files during
the build process. This was MSVS 2005-specific issue. See HARMONY-3240.
modified ayza  /harmony/enhanced/classlib/trunk/modules/auth/build.xml 02/26/2007 11:00:20
Fix that allows embedding assembly manifests into corresponding DLL/EXE files during the build
process. This was MSVS 2005-specific issue. See HARMONY-3240.
modified ayza  /harmony/enhanced/classlib/trunk/modules/portlib/src/main/native/port 02/26/2007
11:00:20 Fix that allows embedding assembly manifests into corresponding DLL/EXE files during
the build process. This was MSVS 2005-specific issue. See HARMONY-3240.
modified ayza  /harmony/enhanced/classlib/trunk/make/properties.xml 02/26/2007 11:00:20 Fix
that allows embedding assembly manifests into corresponding DLL/EXE files during the build
process. This was MSVS 2005-specific issue. See HARMONY-3240.
modified ayza  /harmony/enhanced/classlib/trunk/modules/archive/src/main/native/archive 02/26/2007
11:00:20 Fix that allows embedding assembly manifests into corresponding DLL/EXE files during
the build process. This was MSVS 2005-specific issue. See HARMONY-3240.
modified hindessm  /harmony/enhanced/classlib/trunk/make/properties.xml 02/26/2007 09:37:03
Adding aix properties.
modified mloenko  /harmony/enhanced/classlib/trunk/modules/jndi/make/exclude.common 02/26/2007
01:27:11 including jndi tests that have incorrect masks
modified mloenko  /harmony/enhanced/classlib/trunk/modules/jndi/build.xml 02/26/2007 01:27:11
including jndi tests that have incorrect masks
added mloenko  /harmony/enhanced/classlib/trunk/modules/jndi/src/test/java/org/apache/harmony/jndi/tests/javax/naming/ldap/LdapNameTest.java
02/26/2007 01:10:15 incluiding test for LdapNamethe test was adapted to the guidlinesfurther
simplification is still necessary
deleted mloenko  /harmony/enhanced/classlib/trunk/modules/jndi/src/test/java/org/apache/harmony/jndi/tests/javax/naming/ldap/TestLdapName.java
02/26/2007 01:10:15 incluiding test for LdapNamethe test was adapted to the guidlinesfurther
simplification is still necessary
modified mloenko  /harmony/enhanced/classlib/trunk/modules/jndi/src/test/java/org/apache/harmony/jndi/tests/javax/naming/ldap/main/AllTestLdap.java
02/26/2007 01:10:15 incluiding test for LdapNamethe test was adapted to the guidlinesfurther
simplification is still necessary
modified mloenko  /harmony/enhanced/classlib/trunk/modules/jndi/src/main/java/org/apache/harmony/jndi/internal/parser/LdapNameParser.java
02/26/2007 01:08:56 generification and style improvements
modified mloenko  /harmony/enhanced/classlib/trunk/modules/jndi/src/main/java/org/apache/harmony/jndi/internal/parser/LdapRdnParser.java
02/26/2007 01:08:56 generification and style improvements
modified mloenko  /harmony/enhanced/classlib/trunk/modules/jndi/src/main/java/javax/naming/ldap/LdapName.java
02/26/2007 01:08:56 generification and style improvements
modified mloenko  /harmony/enhanced/classlib/trunk/modules/jndi/src/main/java/javax/naming/ldap/Rdn.java
02/26/2007 01:08:56 generification and style improvements


Mime
View raw message