harmony-alerts mailing list archives

Site index · List index
Message view « Date » · « Thread »
Top « Date » · « Thread »
From nom...@hursley.ibm.com
Subject [continuum] BUILD FAILURE: Classlib/linux.ia32 Build/Test
Date Mon, 26 Feb 2007 19:04:55 GMT
Online report : http://people.apache.org/~hindessm/continuum/classlib/linux.ia32/2007/02/26/20070226-190455.failure.log.gz
Build statistics:
  State: Failed
  Previous State: Ok
  Started at: Mon, 26 Feb 2007 18:01:23 +0000
  Finished at: Mon, 26 Feb 2007 19:04:52 +0000
  Total time: 1h 3m 29s
  Build Trigger: Schedule
  Exit code: 1
  Building machine hostname: hy2
  Operating system : Linux(unknown)
  Java version : 1.5.0_06(Sun Microsystems Inc.)

Changes
                            classlib/depends/build/rules.mak
            classlib/modules/text/build.xml
            classlib/modules/auth/build.xml
            classlib/modules/prefs/build.xml
            classlib/modules/archive/build.xml
            classlib/modules/nio/build.xml
            classlib/modules/misc/build.xml
            classlib/modules/awt/build.xml
            classlib/modules/print/build.xml
            classlib/modules/security/build.xml
            classlib/modules/luni/build.xml
            classlib/modules/imageio/build.xml
            classlib/modules/portlib/src/test/native/hytime/windows/makefile
            classlib/modules/portlib/src/test/native/hyfile/windows/makefile
            classlib/modules/portlib/src/test/native/init/windows/makefile
            classlib/modules/portlib/src/test/native/hyerror/windows/makefile
            classlib/modules/portlib/build.xml
            classlib/make/properties.xml
        
****************************************************************************
Output:
****************************************************************************
Buildfile: build.xml

svn-prop:

build:
   [delete] Deleting directory /home/hybld/continuum-working-directory/6/classlib/deploy
     [echo] Classlib revision is 511932
     [echo] Post process: true
     [echo] JAPI: true
     [echo] Building with reference jdk/javac
     [exec] Buildfile: build.xml

     [exec] -init-hdk-for-clean:
     [exec]     [mkdir] Created dir: /home/hybld/continuum-working-directory/6/classlib/deploy/build/ant
     [exec]      [copy] Copying 1 file to /home/hybld/continuum-working-directory/6/classlib/deploy/build/ant

     [exec] clean-java:

     [exec] -modules-clean-bin:

     [exec] clean:
     [exec]    [delete] Deleting 30 files from /home/hybld/continuum-working-directory/6/classlib/build/classes
     [exec]    [delete] Deleting 12 files from /home/hybld/continuum-working-directory/6/classlib/modules/accessibility/bin/test

     [exec] clean:
     [exec]    [delete] Deleting 13 files from /home/hybld/continuum-working-directory/6/classlib/build/classes
     [exec]    [delete] Deleting 1 files from /home/hybld/continuum-working-directory/6/classlib/modules/annotation/bin/test

     [exec] clean:
     [exec]    [delete] Deleting 35 files from /home/hybld/continuum-working-directory/6/classlib/build/classes
     [exec]    [delete] Deleting 1 files from /home/hybld/continuum-working-directory/6/classlib/modules/applet/bin/test

     [exec] clean:
     [exec]    [delete] Deleting 41 files from /home/hybld/continuum-working-directory/6/classlib/build/classes
     [exec]    [delete] Deleting 34 files from /home/hybld/continuum-working-directory/6/classlib/modules/archive/bin/test

     [exec] clean-native-includes:
     [exec]    [delete] /home/hybld/continuum-working-directory/6/classlib/deploy/include
not found.

     [exec] clean:
     [exec]    [delete] Deleting 112 files from /home/hybld/continuum-working-directory/6/classlib/build/classes
     [exec]    [delete] Deleting 226 files from /home/hybld/continuum-working-directory/6/classlib/modules/auth/bin/test

     [exec] clean:
     [exec]    [delete] Deleting 908 files from /home/hybld/continuum-working-directory/6/classlib/build/classes
     [exec]    [delete] Deleting 612 files from /home/hybld/continuum-working-directory/6/classlib/modules/awt/bin/test

     [exec] clean:
     [exec]    [delete] Deleting 107 files from /home/hybld/continuum-working-directory/6/classlib/build/classes
     [exec]    [delete] Deleting 238 files from /home/hybld/continuum-working-directory/6/classlib/modules/beans/bin/test

     [exec] clean:
     [exec]    [delete] Deleting 125 files from /home/hybld/continuum-working-directory/6/classlib/build/classes
     [exec]    [delete] /home/hybld/continuum-working-directory/6/classlib/modules/concurrent/bin/test
not found.

     [exec] clean:
     [exec]    [delete] Deleting 48 files from /home/hybld/continuum-working-directory/6/classlib/build/classes
     [exec]    [delete] Deleting 90 files from /home/hybld/continuum-working-directory/6/classlib/modules/crypto/bin/test

     [exec] clean:
     [exec]    [delete] Deleting 87 files from /home/hybld/continuum-working-directory/6/classlib/build/classes

     [exec] clean:
     [exec]    [delete] Deleting 9 files from /home/hybld/continuum-working-directory/6/classlib/build/classes
     [exec]    [delete] Deleting 20 files from /home/hybld/continuum-working-directory/6/classlib/modules/instrument/bin/test

     [exec] clean:
     [exec]    [delete] Deleting 183 files from /home/hybld/continuum-working-directory/6/classlib/build/classes
     [exec]    [delete] Deleting 202 files from /home/hybld/continuum-working-directory/6/classlib/modules/jndi/bin/test

     [exec] clean:
     [exec]    [delete] Deleting 43 files from /home/hybld/continuum-working-directory/6/classlib/build/classes
     [exec]    [delete] /home/hybld/continuum-working-directory/6/classlib/modules/lang-management/${hy.lang-management.bin.test}
not found.

     [exec] clean:
     [exec]    [delete] Deleting 34 files from /home/hybld/continuum-working-directory/6/classlib/build/classes
     [exec]    [delete] Deleting 100 files from /home/hybld/continuum-working-directory/6/classlib/modules/logging/bin/test

     [exec] clean:
     [exec]    [delete] Deleting 963 files from /home/hybld/continuum-working-directory/6/classlib/build/classes
     [exec]    [delete] Deleting 911 files from /home/hybld/continuum-working-directory/6/classlib/modules/luni/bin/test

     [exec] clean-native-includes:
     [exec]    [delete] /home/hybld/continuum-working-directory/6/classlib/deploy/include
not found.
     [exec]    [delete] /home/hybld/continuum-working-directory/6/classlib/deploy/jdk/include
not found.

     [exec] clean:
     [exec]    [delete] Deleting 29 files from /home/hybld/continuum-working-directory/6/classlib/build/classes

     [exec] clean:
     [exec]    [delete] Deleting 14 files from /home/hybld/continuum-working-directory/6/classlib/build/classes
     [exec]    [delete] Deleting 25 files from /home/hybld/continuum-working-directory/6/classlib/modules/math/bin/test

     [exec] clean:
     [exec]    [delete] Deleting 14 files from /home/hybld/continuum-working-directory/6/classlib/build/classes
     [exec]    [delete] Deleting 1 files from /home/hybld/continuum-working-directory/6/classlib/modules/misc/bin/test

     [exec] clean:
     [exec]    [delete] Deleting 142 files from /home/hybld/continuum-working-directory/6/classlib/build/classes
     [exec]    [delete] Deleted 5 directories from /home/hybld/continuum-working-directory/6/classlib/build/classes
     [exec]    [delete] Deleting 156 files from /home/hybld/continuum-working-directory/6/classlib/modules/nio/bin/test
     [exec]    [delete] Deleted 19 directories from /home/hybld/continuum-working-directory/6/classlib/modules/nio/bin/test

     [exec] clean:
     [exec]    [delete] Deleting 20 files from /home/hybld/continuum-working-directory/6/classlib/build/classes
     [exec]    [delete] Deleting 77 files from /home/hybld/continuum-working-directory/6/classlib/modules/nio_char/bin/test

     [exec] clean:
     [exec]    [delete] Deleting 37 files from /home/hybld/continuum-working-directory/6/classlib/build/classes
     [exec]    [delete] Deleting 16 files from /home/hybld/continuum-working-directory/6/classlib/modules/pack200/bin/test

     [exec] clean-native-includes:
     [exec]    [delete] /home/hybld/continuum-working-directory/6/classlib/deploy/include
not found.

     [exec] clean:

     [exec] clean:
     [exec]    [delete] Deleting 32 files from /home/hybld/continuum-working-directory/6/classlib/build/classes
     [exec]    [delete] Deleting 34 files from /home/hybld/continuum-working-directory/6/classlib/modules/prefs/bin/test

     [exec] clean:
     [exec]    [delete] Deleting 205 files from /home/hybld/continuum-working-directory/6/classlib/build/classes
     [exec]    [delete] Deleting 60 files from /home/hybld/continuum-working-directory/6/classlib/modules/print/bin/test

     [exec] clean:
     [exec]    [delete] Deleting 177 files from /home/hybld/continuum-working-directory/6/classlib/build/classes
     [exec]    [delete] Deleting 13 files from /home/hybld/continuum-working-directory/6/classlib/modules/regex/bin/test

     [exec] clean:
     [exec]    [delete] Deleting 230 files from /home/hybld/continuum-working-directory/6/classlib/build/classes
     [exec]    [delete] Deleting 53 files from /home/hybld/continuum-working-directory/6/classlib/modules/rmi/bin/test

     [exec] clean:
     [exec]    [delete] Deleting 428 files from /home/hybld/continuum-working-directory/6/classlib/build/classes
     [exec]    [delete] Deleting 617 files from /home/hybld/continuum-working-directory/6/classlib/modules/security/bin/test

     [exec] clean:
     [exec]    [delete] Deleting 2 files from /home/hybld/continuum-working-directory/6/classlib/build/classes

     [exec] clean:
     [exec]    [delete] Deleting 74 files from /home/hybld/continuum-working-directory/6/classlib/build/classes
     [exec]    [delete] Deleting 54 files from /home/hybld/continuum-working-directory/6/classlib/modules/sound/bin/test

     [exec] clean:
     [exec]    [delete] Deleting 75 files from /home/hybld/continuum-working-directory/6/classlib/build/classes
     [exec]    [delete] Deleting 57 files from /home/hybld/continuum-working-directory/6/classlib/modules/sql/bin/test

     [exec] clean:
     [exec]    [delete] Deleting 5 files from /home/hybld/continuum-working-directory/6/classlib/build/classes

     [exec] clean:
     [exec]    [delete] Deleting 1619 files from /home/hybld/continuum-working-directory/6/classlib/build/classes

...

     [exec] test-all:

     [exec] BUILD SUCCESSFUL
     [exec] Total time: 51 minutes 19 seconds
     [echo] Tests.failed is set to ${tests.failed}

japi:

     [exec] Processing class java.lang,Object:+
     [exec] Processing package java.lang,:=============================================================================+-++++++++++++++++++++++++-+++++++++++++++++++++++++++++++++++++++++++++++++--^+^+++++++++--++++++++++

...

     [exec] Processing package java.lang.management,:=============================================================================++++-+++++++++++
     [exec] Processing package java.lang.ref,:=============================================================================+++++
     [exec] Processing package java.lang.reflect,:=============================================================================+++++++++++++++++++++
     [exec] Processing class ,java:
     [exec] Failed to Japize java: java.lang.RuntimeException: NoClassDefFoundError: java
     [exec] java.lang.RuntimeException: NoClassDefFoundError: java
     [exec] 	at net.wuffies.japi.ClassFile.forName(ClassFile.java:163)
     [exec] 	at net.wuffies.japi.Japize.getClassWrapper(Japize.java:1425)
     [exec] 	at net.wuffies.japi.Japize.japizeClass(Japize.java:748)
     [exec] 	at net.wuffies.japi.Japize.processClass(Japize.java:516)

...

     [exec] 	at net.wuffies.japi.Japize.doJapize(Japize.java:443)
     [exec] 	at net.wuffies.japi.Japize.main(Japize.java:316)

     [exec] Processing class ,javax:
     [exec] Failed to Japize javax: java.lang.RuntimeException: NoClassDefFoundError: javax
     [exec] java.lang.RuntimeException: NoClassDefFoundError: javax
     [exec] 	at net.wuffies.japi.ClassFile.forName(ClassFile.java:163)
     [exec] 	at net.wuffies.japi.Japize.getClassWrapper(Japize.java:1425)
     [exec] 	at net.wuffies.japi.Japize.japizeClass(Japize.java:748)
     [exec] 	at net.wuffies.japi.Japize.processClass(Japize.java:516)

...

     [exec] 	at net.wuffies.japi.Japize.doJapize(Japize.java:443)
     [exec] 	at net.wuffies.japi.Japize.main(Japize.java:316)

     [exec] Processing class ,org:
     [exec] Failed to Japize org: java.lang.RuntimeException: NoClassDefFoundError: org
     [exec] java.lang.RuntimeException: NoClassDefFoundError: org
     [exec] 	at net.wuffies.japi.ClassFile.forName(ClassFile.java:163)
     [exec] 	at net.wuffies.japi.Japize.getClassWrapper(Japize.java:1425)
     [exec] 	at net.wuffies.japi.Japize.japizeClass(Japize.java:748)
     [exec] 	at net.wuffies.japi.Japize.processClass(Japize.java:516)

...

     [exec] Processing package javax.activity,:=============================================================================+++
     [exec] Processing package javax.crypto,:=============================================================================++++++--+++++++++++++++++
     [exec] Processing package javax.crypto.interfaces,:=============================================================================++++
     [exec] Processing package javax.crypto.spec,:=============================================================================
     [exec] Failed to Japize javax.crypto.spec.DESKeySpec: java.lang.ArrayIndexOutOfBoundsException
     [exec] java.lang.ArrayIndexOutOfBoundsException
     [exec] 	at java.util.Arrays.mergeSort(Arrays.java:2460)
     [exec] 	at java.util.Arrays.mergeSort(Arrays.java:2432)
     [exec] 	at java.util.Arrays.sort(Arrays.java:2369)
     [exec] 	at java.util.Arrays.sort(Arrays.java:2329)

...

     [exec] 	at net.wuffies.japi.Japize.processRootSet(Japize.java:471)
     [exec] 	at net.wuffies.japi.Japize.doJapize(Japize.java:443)
     [exec] 	at net.wuffies.japi.Japize.main(Japize.java:316)

     [exec] Failed to Japize javax.crypto.spec.DESedeKeySpec: java.lang.ArrayIndexOutOfBoundsException
     [exec] java.lang.ArrayIndexOutOfBoundsException
     [exec] 	at java.util.Arrays.mergeSort(Arrays.java:2460)
     [exec] 	at java.util.Arrays.mergeSort(Arrays.java:2432)
     [exec] 	at java.util.Arrays.sort(Arrays.java:2369)
     [exec] 	at java.util.Arrays.sort(Arrays.java:2329)

...

     [exec] 	at net.wuffies.japi.Japize.processRootSet(Japize.java:471)
     [exec] 	at net.wuffies.japi.Japize.doJapize(Japize.java:443)
     [exec] 	at net.wuffies.japi.Japize.main(Japize.java:316)

     [exec] Failed to Japize javax.crypto.spec.DHGenParameterSpec: java.lang.ArrayIndexOutOfBoundsException
     [exec] java.lang.ArrayIndexOutOfBoundsException
     [exec] 	at java.util.Arrays.mergeSort(Arrays.java:2452)
     [exec] 	at java.util.Arrays.sort(Arrays.java:2369)
     [exec] 	at java.util.Arrays.sort(Arrays.java:2329)
     [exec] 	at net.wuffies.japi.BoundMemberSet.getCalls(BoundMemberSet.java:46)

...

     [exec] 	at net.wuffies.japi.Japize.processRootSet(Japize.java:471)
     [exec] 	at net.wuffies.japi.Japize.doJapize(Japize.java:443)
     [exec] 	at net.wuffies.japi.Japize.main(Japize.java:316)

     [exec] Failed to Japize javax.crypto.spec.DHParameterSpec: java.lang.ArrayIndexOutOfBoundsException
     [exec] java.lang.ArrayIndexOutOfBoundsException
     [exec] 	at java.util.Arrays.mergeSort(Arrays.java:2452)
     [exec] 	at java.util.Arrays.sort(Arrays.java:2369)
     [exec] 	at java.util.Arrays.sort(Arrays.java:2329)
     [exec] 	at net.wuffies.japi.BoundMemberSet.getCalls(BoundMemberSet.java:46)

...

     [exec] 	at net.wuffies.japi.Japize.processRootSet(Japize.java:471)
     [exec] 	at net.wuffies.japi.Japize.doJapize(Japize.java:443)
     [exec] 	at net.wuffies.japi.Japize.main(Japize.java:316)

     [exec] Failed to Japize javax.crypto.spec.DHPrivateKeySpec: java.lang.ArrayIndexOutOfBoundsException
     [exec] java.lang.ArrayIndexOutOfBoundsException
     [exec] 	at java.util.Arrays.mergeSort(Arrays.java:2452)
     [exec] 	at java.util.Arrays.sort(Arrays.java:2369)
     [exec] 	at java.util.Arrays.sort(Arrays.java:2329)
     [exec] 	at net.wuffies.japi.BoundMemberSet.getCalls(BoundMemberSet.java:46)

...

     [exec] 	at net.wuffies.japi.Japize.processRootSet(Japize.java:471)
     [exec] 	at net.wuffies.japi.Japize.doJapize(Japize.java:443)
     [exec] 	at net.wuffies.japi.Japize.main(Japize.java:316)

     [exec] Failed to Japize javax.crypto.spec.DHPublicKeySpec: java.lang.ArrayIndexOutOfBoundsException
     [exec] java.lang.ArrayIndexOutOfBoundsException
     [exec] 	at java.util.Arrays.mergeSort(Arrays.java:2452)
     [exec] 	at java.util.Arrays.sort(Arrays.java:2369)
     [exec] 	at java.util.Arrays.sort(Arrays.java:2329)
     [exec] 	at net.wuffies.japi.BoundMemberSet.getCalls(BoundMemberSet.java:46)

...

     [exec] 	at net.wuffies.japi.Japize.processRootSet(Japize.java:471)
     [exec] 	at net.wuffies.japi.Japize.doJapize(Japize.java:443)
     [exec] 	at net.wuffies.japi.Japize.main(Japize.java:316)

     [exec] Failed to Japize javax.crypto.spec.IvParameterSpec: java.lang.ArrayIndexOutOfBoundsException
     [exec] java.lang.ArrayIndexOutOfBoundsException
     [exec] 	at java.util.Arrays.mergeSort(Arrays.java:2452)
     [exec] 	at java.util.Arrays.sort(Arrays.java:2369)
     [exec] 	at java.util.Arrays.sort(Arrays.java:2329)
     [exec] 	at net.wuffies.japi.BoundMemberSet.getCalls(BoundMemberSet.java:46)

...

     [exec] 	at net.wuffies.japi.Japize.processRootSet(Japize.java:471)
     [exec] 	at net.wuffies.japi.Japize.doJapize(Japize.java:443)
     [exec] 	at net.wuffies.japi.Japize.main(Japize.java:316)
     [exec] +
     [exec] Failed to Japize javax.crypto.spec.PBEKeySpec: java.lang.ArrayIndexOutOfBoundsException
     [exec] java.lang.ArrayIndexOutOfBoundsException
     [exec] 	at java.util.Arrays.mergeSort(Arrays.java:2460)
     [exec] 	at java.util.Arrays.mergeSort(Arrays.java:2432)
     [exec] 	at java.util.Arrays.sort(Arrays.java:2369)
     [exec] 	at java.util.Arrays.sort(Arrays.java:2329)

...

     [exec] 	at net.wuffies.japi.Japize.processRootSet(Japize.java:471)
     [exec] 	at net.wuffies.japi.Japize.doJapize(Japize.java:443)
     [exec] 	at net.wuffies.japi.Japize.main(Japize.java:316)

     [exec] Failed to Japize javax.crypto.spec.PBEParameterSpec: java.lang.ArrayIndexOutOfBoundsException
     [exec] java.lang.ArrayIndexOutOfBoundsException
     [exec] 	at java.util.Arrays.mergeSort(Arrays.java:2450)
     [exec] 	at java.util.Arrays.sort(Arrays.java:2369)
     [exec] 	at java.util.Arrays.sort(Arrays.java:2329)
     [exec] 	at net.wuffies.japi.BoundMemberSet.getCalls(BoundMemberSet.java:46)

...

     [exec] 	at net.wuffies.japi.Japize.processRootSet(Japize.java:471)
     [exec] 	at net.wuffies.japi.Japize.doJapize(Japize.java:443)
     [exec] 	at net.wuffies.japi.Japize.main(Japize.java:316)

     [exec] Failed to Japize javax.crypto.spec.PSource: java.lang.ArrayIndexOutOfBoundsException
     [exec] java.lang.ArrayIndexOutOfBoundsException
     [exec] 	at java.util.Arrays.mergeSort(Arrays.java:2458)
     [exec] 	at java.util.Arrays.sort(Arrays.java:2369)
     [exec] 	at java.util.Arrays.sort(Arrays.java:2329)
     [exec] 	at net.wuffies.japi.BoundMemberSet.getCalls(BoundMemberSet.java:46)

...

     [exec] 	at net.wuffies.japi.Japize.processRootSet(Japize.java:471)
     [exec] 	at net.wuffies.japi.Japize.doJapize(Japize.java:443)
     [exec] 	at net.wuffies.japi.Japize.main(Japize.java:316)

     [exec] Failed to Japize javax.crypto.spec.PSource$PSpecified: java.lang.ArrayIndexOutOfBoundsException
     [exec] java.lang.ArrayIndexOutOfBoundsException
     [exec] 	at java.util.Arrays.mergeSort(Arrays.java:2458)
     [exec] 	at java.util.Arrays.mergeSort(Arrays.java:2432)
     [exec] 	at java.util.Arrays.sort(Arrays.java:2369)
     [exec] 	at java.util.Arrays.sort(Arrays.java:2329)

...

     [exec] 	at net.wuffies.japi.Japize.processRootSet(Japize.java:471)
     [exec] 	at net.wuffies.japi.Japize.doJapize(Japize.java:443)
     [exec] 	at net.wuffies.japi.Japize.main(Japize.java:316)

     [exec] Failed to Japize javax.crypto.spec.RC2ParameterSpec: java.lang.ArrayIndexOutOfBoundsException
     [exec] java.lang.ArrayIndexOutOfBoundsException
     [exec] 	at java.util.Arrays.mergeSort(Arrays.java:2452)
     [exec] 	at java.util.Arrays.mergeSort(Arrays.java:2431)
     [exec] 	at java.util.Arrays.sort(Arrays.java:2369)
     [exec] 	at java.util.Arrays.sort(Arrays.java:2329)

...

     [exec] 	at net.wuffies.japi.Japize.processRootSet(Japize.java:471)
     [exec] 	at net.wuffies.japi.Japize.doJapize(Japize.java:443)
     [exec] 	at net.wuffies.japi.Japize.main(Japize.java:316)

     [exec] Failed to Japize javax.crypto.spec.RC5ParameterSpec: java.lang.ArrayIndexOutOfBoundsException
     [exec] java.lang.ArrayIndexOutOfBoundsException
     [exec] 	at java.util.Arrays.mergeSort(Arrays.java:2460)
     [exec] 	at java.util.Arrays.mergeSort(Arrays.java:2432)
     [exec] 	at java.util.Arrays.sort(Arrays.java:2369)
     [exec] 	at java.util.Arrays.sort(Arrays.java:2329)

...

     [exec] 	at net.wuffies.japi.Japize.processRootSet(Japize.java:471)
     [exec] 	at net.wuffies.japi.Japize.doJapize(Japize.java:443)
     [exec] 	at net.wuffies.japi.Japize.main(Japize.java:316)

     [exec] Failed to Japize javax.crypto.spec.SecretKeySpec: java.lang.ArrayIndexOutOfBoundsException
     [exec] java.lang.ArrayIndexOutOfBoundsException
     [exec] 	at java.util.Arrays.mergeSort(Arrays.java:2452)
     [exec] 	at java.util.Arrays.mergeSort(Arrays.java:2431)
     [exec] 	at java.util.Arrays.sort(Arrays.java:2369)
     [exec] 	at java.util.Arrays.sort(Arrays.java:2329)

...

     [exec] Incorrect ordering of classlib/harmony.japi.gz:
     [exec] javax.crypto.spec,OAEPParameterSpec!(Ljava/lang/String;,Ljava/lang/String;,Ljava/security/spec/AlgorithmParameterSpec;,Ljavax/crypto/spec/PSource;)
>=
     [exec] javax.crypto.spec,OAEPParameterSpec!(Ljava/lang/String;,Ljava/lang/String;,Ljava/security/spec/AlgorithmParameterSpec;,Ljavax/crypto/spec/PSource;)
at /home/hybld/continuum-working-directory/7/bin/japicompat line 345, <GEN3> line 42535.

BUILD FAILED
/home/hybld/continuum-working-directory/6/build.xml:237: exec returned: 9

Total time: 63 minutes 27 seconds

****************************************************************************

...

Mime
View raw message