harmony-alerts mailing list archives

Site index · List index
Message view « Date » · « Thread »
Top « Date » · « Thread »
From nom...@hursley.ibm.com
Subject [continuum] BUILD FAILURE: Classlib/linux.ia32 Build/Test
Date Tue, 20 Feb 2007 11:17:09 GMT
Online report : http://people.apache.org/~hindessm/continuum/classlib/linux.ia32/2007/02/20/20070220-111709.failure.log.gz
Build statistics:
  State: Failed
  Previous State: Failed
  Started at: Tue, 20 Feb 2007 11:08:31 +0000
  Finished at: Tue, 20 Feb 2007 11:17:06 +0000
  Total time: 8m 35s
  Build Trigger: Schedule
  Exit code: 1
  Building machine hostname: hy2
  Operating system : Linux(unknown)
  Java version : 1.5.0_06(Sun Microsystems Inc.)

Changes
                            classlib/modules/swing/src/main/java/common/javax/swing/RepaintManager.java
            classlib/modules/awt/src/test/api/java/common/org/apache/harmony/awt/HeadlessTest.java
            classlib/modules/awt/src/main/java/common/java/awt/Panel.java
            classlib/modules/awt/src/main/java/common/java/awt/EventQueueCore.java
            classlib/modules/awt/src/main/java/common/java/awt/EventDispatchThread.java
            classlib/modules/awt/src/main/java/common/java/awt/Toolkit.java
            classlib/modules/awt/src/main/java/common/java/awt/HeadlessToolkit.java
            classlib/modules/awt/src/main/java/common/java/awt/HeadlessGraphicsEnvironment.java
            classlib/modules/awt/src/main/java/common/java/awt/Canvas.java
            classlib/modules/awt/src/main/java/common/java/awt/HeadlessEventDispatchThread.java
            classlib/modules/awt/src/main/java/common/java/awt/Component.java
            classlib/modules/awt/src/main/java/common/java/awt/SystemColor.java
            classlib/modules/awt/src/main/java/common/java/awt/ToolkitImpl.java
            classlib/modules/awt/src/main/java/common/java/awt/GraphicsEnvironment.java
            classlib/modules/awt/build.xml
            classlib/modules/portlib/src/main/native/port/unix/hyfiletext.c
        
****************************************************************************
Output:
****************************************************************************
Buildfile: build.xml

svn-prop:

build:
   [delete] Deleting directory /home/hybld/continuum-working-directory/6/classlib/deploy
     [echo] Classlib revision is 509509
     [echo] Post process: true
     [echo] JAPI: true
     [echo] Building with reference jdk/javac
     [exec] Buildfile: build.xml

     [exec] -init-hdk-for-clean:
     [exec]     [mkdir] Created dir: /home/hybld/continuum-working-directory/6/classlib/deploy/build/ant
     [exec]      [copy] Copying 1 file to /home/hybld/continuum-working-directory/6/classlib/deploy/build/ant

     [exec] clean-java:

     [exec] -modules-clean-bin:

     [exec] clean:
     [exec]    [delete] Deleting 30 files from /home/hybld/continuum-working-directory/6/classlib/build/classes

     [exec] clean:
     [exec]    [delete] Deleting 13 files from /home/hybld/continuum-working-directory/6/classlib/build/classes

     [exec] clean:
     [exec]    [delete] Deleting 35 files from /home/hybld/continuum-working-directory/6/classlib/build/classes

     [exec] clean:
     [exec]    [delete] Deleting 41 files from /home/hybld/continuum-working-directory/6/classlib/build/classes

     [exec] clean-native-includes:
     [exec]    [delete] /home/hybld/continuum-working-directory/6/classlib/deploy/include
not found.

     [exec] clean:
     [exec]    [delete] Deleting 112 files from /home/hybld/continuum-working-directory/6/classlib/build/classes

     [exec] clean:
     [exec]    [delete] Deleting 905 files from /home/hybld/continuum-working-directory/6/classlib/build/classes

     [exec] clean:
     [exec]    [delete] Deleting 107 files from /home/hybld/continuum-working-directory/6/classlib/build/classes

     [exec] clean:
     [exec]    [delete] Deleting 125 files from /home/hybld/continuum-working-directory/6/classlib/build/classes
     [exec]    [delete] /home/hybld/continuum-working-directory/6/classlib/modules/concurrent/bin/test
not found.

     [exec] clean:
     [exec]    [delete] Deleting 48 files from /home/hybld/continuum-working-directory/6/classlib/build/classes

     [exec] clean:
     [exec]    [delete] Deleting 87 files from /home/hybld/continuum-working-directory/6/classlib/build/classes

     [exec] clean:
     [exec]    [delete] Deleting 9 files from /home/hybld/continuum-working-directory/6/classlib/build/classes

     [exec] clean:
     [exec]    [delete] Deleting 183 files from /home/hybld/continuum-working-directory/6/classlib/build/classes

     [exec] clean:
     [exec]    [delete] Deleting 43 files from /home/hybld/continuum-working-directory/6/classlib/build/classes
     [exec]    [delete] /home/hybld/continuum-working-directory/6/classlib/modules/lang-management/${hy.lang-management.bin.test}
not found.

     [exec] clean:
     [exec]    [delete] Deleting 34 files from /home/hybld/continuum-working-directory/6/classlib/build/classes

     [exec] clean:
     [exec]    [delete] Deleting 963 files from /home/hybld/continuum-working-directory/6/classlib/build/classes

     [exec] clean-native-includes:
     [exec]    [delete] /home/hybld/continuum-working-directory/6/classlib/deploy/include
not found.
     [exec]    [delete] /home/hybld/continuum-working-directory/6/classlib/deploy/jdk/include
not found.

     [exec] clean:
     [exec]    [delete] Deleting 29 files from /home/hybld/continuum-working-directory/6/classlib/build/classes

     [exec] clean:
     [exec]    [delete] Deleting 14 files from /home/hybld/continuum-working-directory/6/classlib/build/classes

     [exec] clean:
     [exec]    [delete] Deleting 14 files from /home/hybld/continuum-working-directory/6/classlib/build/classes

     [exec] clean:
     [exec]    [delete] Deleting 142 files from /home/hybld/continuum-working-directory/6/classlib/build/classes
     [exec]    [delete] Deleted 5 directories from /home/hybld/continuum-working-directory/6/classlib/build/classes
     [exec]    [delete] /home/hybld/continuum-working-directory/6/classlib/modules/nio/bin/test
not found.

     [exec] clean:
     [exec]    [delete] Deleting 20 files from /home/hybld/continuum-working-directory/6/classlib/build/classes

     [exec] clean:
     [exec]    [delete] Deleting 37 files from /home/hybld/continuum-working-directory/6/classlib/build/classes

     [exec] clean-native-includes:
     [exec]    [delete] /home/hybld/continuum-working-directory/6/classlib/deploy/include
not found.

     [exec] clean:

     [exec] clean:
     [exec]    [delete] Deleting 32 files from /home/hybld/continuum-working-directory/6/classlib/build/classes

     [exec] clean:
     [exec]    [delete] Deleting 205 files from /home/hybld/continuum-working-directory/6/classlib/build/classes

     [exec] clean:
     [exec]    [delete] Deleting 177 files from /home/hybld/continuum-working-directory/6/classlib/build/classes

     [exec] clean:
     [exec]    [delete] Deleting 230 files from /home/hybld/continuum-working-directory/6/classlib/build/classes

     [exec] clean:
     [exec]    [delete] Deleting 428 files from /home/hybld/continuum-working-directory/6/classlib/build/classes

     [exec] clean:
     [exec]    [delete] Deleting 2 files from /home/hybld/continuum-working-directory/6/classlib/build/classes

     [exec] clean:
     [exec]    [delete] Deleting 74 files from /home/hybld/continuum-working-directory/6/classlib/build/classes

     [exec] clean:
     [exec]    [delete] Deleting 75 files from /home/hybld/continuum-working-directory/6/classlib/build/classes

     [exec] clean:
     [exec]    [delete] Deleting 5 files from /home/hybld/continuum-working-directory/6/classlib/build/classes

     [exec] clean:
     [exec]    [delete] Deleting 1619 files from /home/hybld/continuum-working-directory/6/classlib/build/classes
     [exec]    [delete] Deleting 4 files from /home/hybld/continuum-working-directory/6/classlib/build/classes

     [exec] clean:
     [exec]    [delete] Deleting 40 files from /home/hybld/continuum-working-directory/6/classlib/build/classes

     [exec] clean:
     [exec]    [delete] Deleting 35 files from /home/hybld/continuum-working-directory/6/classlib/build/classes

     [exec] clean:
     [exec]    [delete] Deleting 123 files from /home/hybld/continuum-working-directory/6/classlib/build/classes

     [exec] -clean-bin-catch-all-test:

     [exec] -clean-bin-catch-all:
     [exec]    [delete] Deleted 311 directories from /home/hybld/continuum-working-directory/6/classlib/build/classes

     [exec] -clean-bin:

     [exec] -clean-layout:
     [exec]    [delete] /home/hybld/continuum-working-directory/6/classlib/deploy/jdk not
found.

     [exec] clean:

     [exec] clean-native:

     [exec] copy-makefile-includes:
     [exec]     [mkdir] Created dir: /home/hybld/continuum-working-directory/6/classlib/deploy/build/make
     [exec]      [copy] Copying 12 files to /home/hybld/continuum-working-directory/6/classlib/deploy/build/make

     [exec] -make-clean:

     [exec] -clean-native-sig:
     [exec]      [exec] rm -f ../shared/hysig_copyright.o hysiglinux.o hysigunix.o ../libhysig.so
  libhysig.exp \
     [exec]      [exec]        

     [exec] -clean-native-tests:
     [exec]      [exec] rm -f ../shared/init.o  ../init  .exp \
     [exec]      [exec]        
     [exec]      [exec] rm -f ../shared/hyerror.o  ../hyerror  .exp \
     [exec]      [exec]        
     [exec]      [exec] rm -f ../shared/hytime.o  ../hytime  .exp \
     [exec]      [exec]        
     [exec]      [exec] rm -f ../shared/hyfile.o  ../hyfile  .exp \
     [exec]      [exec]        

     [exec] clean-native:
     [exec]      [exec] rm -f ../shared/thread_copyright.o x86/thrhelp.o x86/thrspinlock.o
../shared/hythread.o ../shared/hythreadinspect.o linuxonexit.o priority.o rasthrsup.o ../shared/rwmutex.o
thrcreate.o thrdsup.o ../shared/thrprof.o ../libhythr.so   libhythr.exp \
     [exec]      [exec]        
     [exec]      [exec] rm -f ../shared/port_copyright.o hycpu.o ../shared/hyerror.o hyerrorhelpers.o
../shared/hyexit.o hyfile.o hyfiletext.o ../shared/hygp.o hyipcmutex.o hymem.o hymmap.o ../shared/hynls.o
hynlshelpers.o hyosdump.o ../shared/hyport.o ../shared/hyportcontrol.o hyportptb.o hysharedhelper.o
hyshmem.o hyshsem.o hysl.o hysock.o ../shared/hystr.o ../shared/hystrftime.o ../shared/hystsl.o
hysysinfo.o hytime.o ../shared/hytlshelpers.o hytty.o hyvmem.o hysignal.o linux.x86/hysignal_context.o
../libhyprt.so  /home/hybld/continuum-working-directory/6/classlib/deploy/lib/libhyprt.a libhyprt.exp
\

...

     [exec]      [exec] -Wl,-soname=liboglwrapper.so  -o ../liboglwrapper.so \
     [exec]      [exec] ../shared//org_apache_harmony_awt_gl_opengl_GL.o \
     [exec]      [exec] -Xlinker --start-group /home/hybld/continuum-working-directory/6/classlib/deploy/jdk/jre/bin/libhythr.so
/home/hybld/continuum-working-directory/6/classlib/deploy/lib/libhycommon.a /home/hybld/continuum-working-directory/6/classlib/deploy/jdk/jre/bin/libhysig.so
/home/hybld/continuum-working-directory/6/classlib/deploy/lib/libhyzip.a /home/hybld/continuum-working-directory/6/classlib/deploy/jdk/jre/bin/libhyzlib.so
/home/hybld/continuum-working-directory/6/classlib/deploy/lib/libhypool.a /home/hybld/continuum-working-directory/6/classlib/deploy/lib/libhyfdlibm.a
/home/hybld/continuum-working-directory/6/classlib/deploy/lib/libvmi.so -Xlinker --end-group
\
     [exec]      [exec] -lc -lm -ldl -lstdc++
     [exec]      [exec] /usr/bin/ld:liboglwrapper.exp:65: syntax error in VERSION script
     [exec]      [exec] collect2: ld returned 1 exit status
     [exec]      [exec] make: *** [../liboglwrapper.so] Error 1

     [exec] BUILD FAILED
     [exec] /home/hybld/continuum-working-directory/6/classlib/build.xml:146: The following
error occurred while executing this line:
     [exec] /home/hybld/continuum-working-directory/6/classlib/make/build-native.xml:77: The
following error occurred while executing this line:
     [exec] /home/hybld/continuum-working-directory/6/classlib/modules/awt/build.xml:166:
The following error occurred while executing this line:
     [exec] /home/hybld/continuum-working-directory/6/classlib/make/properties.xml:356: exec
returned: 2

     [exec] Total time: 8 minutes 29 seconds

BUILD FAILED
/home/hybld/continuum-working-directory/6/build.xml:128: exec returned: 1

Total time: 8 minutes 34 seconds

****************************************************************************

...

Mime
View raw message