harmony-alerts mailing list archives

Site index · List index
Message view « Date » · « Thread »
Top « Date » · « Thread »
From nom...@intel.com
Subject [build-test alert] BUILD FAILED Linux SUSE 9 64bit gcc debug: drlvm tests
Date Mon, 19 Feb 2007 11:57:28 GMT
BUILD FAILED:
	Ant Error Message:
/export/cruise/trunk/cc/projects/drlvm/trunk/build/make/build.xml:368: The following error
occurred while executing this line: /export/cruise/trunk/cc/projects/drlvm/trunk/build/make/build_component.xml:72:
The following error occurred while executing this line: /export/cruise/trunk/cc/projects/drlvm/trunk/build/lnx_em64t_gcc_debug/semis/build/targets/test.xml:6:
Some tests failed

Date of build:	02/19/2007 16:55:52
Time to build:	61 minutes 14 seconds
Last changed:	02/19/2007 16:44:24
Last log entry:	drlvm

***********************************************************
Execution log (errors/warnings messages):	
/export/cruise/trunk/cc/projects/drlvm/trunk/vm/tests/unit/thread/test_native_suspend.c: In
function `test_hythread_thread_suspend':
/export/cruise/trunk/cc/projects/drlvm/trunk/vm/tests/unit/thread/test_native_suspend.c:67:
warning: cast from pointer to integer of different size
/export/cruise/trunk/cc/projects/drlvm/trunk/vm/tests/unit/thread/test_native_basic.c: In
function `test_hythread_iterator':
/export/cruise/trunk/cc/projects/drlvm/trunk/vm/tests/unit/thread/test_native_basic.c:87:
warning: int format, different type arg (arg 2)
/export/cruise/trunk/cc/projects/drlvm/trunk/vm/tests/unit/thread/test_native_basic.c: In
function `test_hythread_iterator_default':
/export/cruise/trunk/cc/projects/drlvm/trunk/vm/tests/unit/thread/test_native_basic.c:123:
warning: int format, different type arg (arg 2)
/export/cruise/trunk/cc/projects/drlvm/trunk/vm/tests/unit/thread/test_java_basic.c: In function
`run_for_test_jthread_timed_join':
/export/cruise/trunk/cc/projects/drlvm/trunk/vm/tests/unit/thread/test_java_basic.c:225: warning:
unsigned int format, different type arg (arg 2)
/export/cruise/trunk/cc/projects/drlvm/trunk/vm/tests/unit/thread/test_java_basic.c:225: warning:
int format, different type arg (arg 3)
/export/cruise/trunk/cc/projects/drlvm/trunk/vm/tests/unit/thread/test_native_thin_monitor.c:
In function `test_hythread_thin_monitor_fat_unlock':
/export/cruise/trunk/cc/projects/drlvm/trunk/vm/tests/unit/thread/test_native_thin_monitor.c:111:
warning: int format, different type arg (arg 2)
/export/cruise/trunk/cc/projects/drlvm/trunk/vm/tests/unit/thread/test_native_thin_monitor.c:
In function `test_hythread_thin_monitor_enter_contended':
/usr/lib64/gcc-lib/x86_64-suse-linux/3.3.3/../../../../x86_64-suse-linux/bin/ld: warning:
libhysig.so, needed by /export/cruise/trunk/cc/projects/classlib/trunk/deploy/jdk/jre/bin/libhyzlib.so,
not found (try using -rpath or -rpath-link)
/usr/lib64/gcc-lib/x86_64-suse-linux/3.3.3/../../../../x86_64-suse-linux/bin/ld: warning:
libhysig.so, needed by /export/cruise/trunk/cc/projects/classlib/trunk/deploy/jdk/jre/bin/libhyzlib.so,
not found (try using -rpath or -rpath-link)
/usr/lib64/gcc-lib/x86_64-suse-linux/3.3.3/../../../../x86_64-suse-linux/bin/ld: warning:
libhysig.so, needed by /export/cruise/trunk/cc/projects/classlib/trunk/deploy/jdk/jre/bin/libhyzlib.so,
not found (try using -rpath or -rpath-link)
/usr/lib64/gcc-lib/x86_64-suse-linux/3.3.3/../../../../x86_64-suse-linux/bin/ld: warning:
libhysig.so, needed by /export/cruise/trunk/cc/projects/classlib/trunk/deploy/jdk/jre/bin/libhyzlib.so,
not found (try using -rpath or -rpath-link)
/usr/lib64/gcc-lib/x86_64-suse-linux/3.3.3/../../../../x86_64-suse-linux/bin/ld: warning:
libhysig.so, needed by /export/cruise/trunk/cc/projects/classlib/trunk/deploy/jdk/jre/bin/libhyzlib.so,
not found (try using -rpath or -rpath-link)
/usr/lib64/gcc-lib/x86_64-suse-linux/3.3.3/../../../../x86_64-suse-linux/bin/ld: warning:
libhysig.so, needed by /export/cruise/trunk/cc/projects/classlib/trunk/deploy/jdk/jre/bin/libhyzlib.so,
not found (try using -rpath or -rpath-link)
/usr/lib64/gcc-lib/x86_64-suse-linux/3.3.3/../../../../x86_64-suse-linux/bin/ld: warning:
libhysig.so, needed by /export/cruise/trunk/cc/projects/classlib/trunk/deploy/jdk/jre/bin/libhyzlib.so,
not found (try using -rpath or -rpath-link)
/usr/lib64/gcc-lib/x86_64-suse-linux/3.3.3/../../../../x86_64-suse-linux/bin/ld: warning:
libhysig.so, needed by /export/cruise/trunk/cc/projects/classlib/trunk/deploy/jdk/jre/bin/libhyzlib.so,
not found (try using -rpath or -rpath-link)
/usr/lib64/gcc-lib/x86_64-suse-linux/3.3.3/../../../../x86_64-suse-linux/bin/ld: warning:
libhysig.so, needed by /export/cruise/trunk/cc/projects/classlib/trunk/deploy/jdk/jre/bin/libhyzlib.so,
not found (try using -rpath or -rpath-link)
/usr/lib64/gcc-lib/x86_64-suse-linux/3.3.3/../../../../x86_64-suse-linux/bin/ld: warning:
libhysig.so, needed by /export/cruise/trunk/cc/projects/classlib/trunk/deploy/jdk/jre/bin/libhyzlib.so,
not found (try using -rpath or -rpath-link)
/usr/lib64/gcc-lib/x86_64-suse-linux/3.3.3/../../../../x86_64-suse-linux/bin/ld: warning:
libhysig.so, needed by /export/cruise/trunk/cc/projects/classlib/trunk/deploy/jdk/jre/bin/libhyzlib.so,
not found (try using -rpath or -rpath-link)
/usr/lib64/gcc-lib/x86_64-suse-linux/3.3.3/../../../../x86_64-suse-linux/bin/ld: warning:
libhysig.so, needed by /export/cruise/trunk/cc/projects/classlib/trunk/deploy/jdk/jre/bin/libhyzlib.so,
not found (try using -rpath or -rpath-link)
/usr/lib64/gcc-lib/x86_64-suse-linux/3.3.3/../../../../x86_64-suse-linux/bin/ld: warning:
libhysig.so, needed by /export/cruise/trunk/cc/projects/classlib/trunk/deploy/jdk/jre/bin/libhyzlib.so,
not found (try using -rpath or -rpath-link)
/usr/lib64/gcc-lib/x86_64-suse-linux/3.3.3/../../../../x86_64-suse-linux/bin/ld: warning:
libhysig.so, needed by /export/cruise/trunk/cc/projects/classlib/trunk/deploy/jdk/jre/bin/libhyzlib.so,
not found (try using -rpath or -rpath-link)
/usr/lib64/gcc-lib/x86_64-suse-linux/3.3.3/../../../../x86_64-suse-linux/bin/ld: warning:
libhysig.so, needed by /export/cruise/trunk/cc/projects/classlib/trunk/deploy/jdk/jre/bin/libhyzlib.so,
not found (try using -rpath or -rpath-link)
/usr/lib64/gcc-lib/x86_64-suse-linux/3.3.3/../../../../x86_64-suse-linux/bin/ld: warning:
libhysig.so, needed by /export/cruise/trunk/cc/projects/classlib/trunk/deploy/jdk/jre/bin/libhyzlib.so,
not found (try using -rpath or -rpath-link)
/usr/lib64/gcc-lib/x86_64-suse-linux/3.3.3/../../../../x86_64-suse-linux/bin/ld: warning:
libhysig.so, needed by /export/cruise/trunk/cc/projects/classlib/trunk/deploy/jdk/jre/bin/libhyzlib.so,
not found (try using -rpath or -rpath-link)
/usr/lib64/gcc-lib/x86_64-suse-linux/3.3.3/../../../../x86_64-suse-linux/bin/ld: warning:
libhysig.so, needed by /export/cruise/trunk/cc/projects/classlib/trunk/deploy/jdk/jre/bin/libhyzlib.so,
not found (try using -rpath or -rpath-link)
/usr/lib64/gcc-lib/x86_64-suse-linux/3.3.3/../../../../x86_64-suse-linux/bin/ld: warning:
libhysig.so, needed by /export/cruise/trunk/cc/projects/classlib/trunk/deploy/jdk/jre/bin/libhyzlib.so,
not found (try using -rpath or -rpath-link)
Result: 1
/export/cruise/trunk/cc/projects/drlvm/trunk/vm/tests/smoke/shutdown/TestFatalError.c:7:2:
warning: no newline at end of file
/export/cruise/trunk/cc/projects/drlvm/trunk/vm/tests/smoke/shutdown/TestInterrupt.c:24:7:
warning: no newline at end of file
/export/cruise/trunk/cc/projects/drlvm/trunk/vm/tests/smoke/shutdown/TestNativeAllocation.c:36:2:
warning: no newline at end of file
Java Result: 1
Java Result: 1
Java Result: 130
Java Result: 1
Java Result: 1
Java Result: 130
Java Result: 1
Java Result: 1
Java Result: 130
 Using CLASSLIB = /export/cruise/trunk/cc/projects/classlib/trunk
jars: true
using proxy settings: proxy.ims.intel.com port:911
Configuration:
    classlib root = /export/cruise/trunk/cc/projects/classlib/trunk
               os = Linux
             arch = em64t
              cxx = gcc
              cfg = debug
       components = deploy
## Compiling JVMTI natives in: /export/cruise/trunk/cc/projects/drlvm/trunk/vm/tests/jvmti/Breakpoint1
## Compiling JVMTI natives in: /export/cruise/trunk/cc/projects/drlvm/trunk/vm/tests/jvmti/SingleStep1
## Compiling JVMTI natives in: /export/cruise/trunk/cc/projects/drlvm/trunk/vm/tests/jvmti/VMInit1
## Compiling framework...
## Compiling C unit tests
## Linking C unit test: test_java_attrs
## Linking C unit test: test_java_basic
## Linking C unit test: test_java_identify
## Linking C unit test: test_java_interrupt
## Linking C unit test: test_java_monitors
## Linking C unit test: test_java_park
## Linking C unit test: test_java_ptr_conv
## Linking C unit test: test_java_suspend
## Linking C unit test: test_native_basic
## Linking C unit test: test_native_fat_monitor
## Linking C unit test: test_native_suspend
## Linking C unit test: test_native_thin_monitor
## Linking C unit test: test_ti_instrum
## Linking C unit test: test_ti_local_storage
## Linking C unit test: test_ti_monitor_info
## Linking C unit test: test_ti_peak_count
## Linking C unit test: test_ti_raw_monitors
## Linking C unit test: test_ti_state
## Linking C unit test: test_ti_timing
## Executing C unit test: test_java_attrs
INFO: TEST test_jthread_get_priority start
INFO: TEST test_jthread_get_priority: PASSED
INFO: TEST test_jthread_set_priority start
INFO: TEST test_jthread_set_priority: PASSED
## TEST PASSED
## Executing C unit test: test_java_basic
INFO: TEST test_jthread_attach start
INFO: TEST test_jthread_attach: PASSED
INFO: TEST test_jthread_detach start
INFO: TEST test_jthread_detach: PASSED
INFO: TEST test_hythread_create start
INFO: TEST test_hythread_create: PASSED
INFO: TEST test_hythread_create_with_function start
INFO: TEST test_hythread_create_with_function: PASSED
INFO: TEST test_jthread_get_JNI_env start
INFO: TEST test_jthread_get_JNI_env: PASSED
INFO: TEST test_jthread_join start
INFO: TEST test_jthread_join: PASSED
INFO: TEST test_jthread_timed_join start
-------- status = 00011177 (70007) 100
-------- status = 00000000 (0) 100
-------- status = 00000000 (0) 100
-------- status = 00000000 (0) 100
-------- status = 00000000 (0) 50000
-------- status = 00000000 (0) 50000
-------- status = 00000000 (0) 50000
-------- status = 00000000 (0) 50000
INFO: TEST test_jthread_timed_join: PASSED
INFO: TEST test_jthread_exception_stop start
INFO: TEST test_jthread_exception_stop: PASSED
INFO: TEST test_jthread_sleep start
INFO: TEST test_jthread_sleep: PASSED
INFO: TEST test_hythread_yield start
INFO: TEST test_hythread_yield: PASSED
## TEST PASSED
## Executing C unit test: test_java_identify
INFO: TEST test_jthread_self start
INFO: TEST test_jthread_self: PASSED
INFO: TEST test_jthread_get_id start
INFO: TEST test_jthread_get_id: PASSED
INFO: TEST test_jthread_get_thread start
INFO: TEST test_jthread_get_thread: PASSED
## TEST PASSED
## Executing C unit test: test_java_interrupt
INFO: TEST test_jthread_interrupt start
INFO: TEST test_jthread_interrupt: PASSED
INFO: TEST test_jthread_is_interrupted start
INFO: TEST test_jthread_is_interrupted: PASSED
INFO: TEST test_jthread_clear_interrupted start
INFO: TEST test_jthread_clear_interrupted: PASSED
## TEST PASSED
## Executing C unit test: test_java_monitors
INFO: TEST test_jthread_monitor_init start
INFO: TEST test_jthread_monitor_init: PASSED
INFO: TEST test_jthread_monitor_enter start
INFO: TEST test_jthread_monitor_enter: PASSED
INFO: TEST test_jthread_monitor_try_enter start
INFO: TEST test_jthread_monitor_try_enter: PASSED
INFO: TEST test_jthread_monitor_exit start
INFO: TEST test_jthread_monitor_exit: PASSED
INFO: TEST test_jthread_monitor_notify_all start
INFO: TEST test_jthread_monitor_notify_all: PASSED
INFO: TEST test_jthread_monitor_wait start
INFO: TEST test_jthread_monitor_wait: PASSED
INFO: TEST test_jthread_monitor_timed_wait start
INFO: TEST test_jthread_monitor_timed_wait: PASSED
INFO: TEST test_jthread_monitor_timed_wait_timeout start
INFO: TEST test_jthread_monitor_timed_wait_timeout: PASSED
## TEST PASSED
## Executing C unit test: test_java_park
INFO: TEST test_jthread_park_unpark start
INFO: TEST test_jthread_park_unpark: PASSED
INFO: TEST test_jthread_park_interrupt start
INFO: TEST test_jthread_park_interrupt: PASSED
INFO: TEST test_jthread_timed_park start
INFO: TEST test_jthread_timed_park: PASSED
## TEST PASSED
## Executing C unit test: test_java_ptr_conv
INFO: TEST test_jthread_get_java_thread start
INFO: TEST test_jthread_get_java_thread: PASSED
INFO: TEST test_jthread_get_native_thread start
INFO: TEST test_jthread_get_native_thread: PASSED
## TEST PASSED
## Executing C unit test: test_java_suspend
INFO: TEST test_jthread_suspend_resume start
INFO: TEST test_jthread_suspend_resume: PASSED
INFO: TEST test_jthread_suspend_all_resume_all start
INFO: TEST test_jthread_suspend_all_resume_all: PASSED
## TEST PASSED
## Executing C unit test: test_native_basic
INFO: TEST test_hythread_self_base start
INFO: TEST test_hythread_self_base: PASSED
INFO: TEST test_hythread_create start
INFO: TEST test_hythread_create: PASSED
INFO: TEST test_hythread_create_many start
INFO: TEST test_hythread_create_many: PASSED
INFO: TEST test_hythread_iterator start
iterator size: 100
INFO: TEST test_hythread_iterator: PASSED
INFO: TEST test_hythread_iterator_default start
default group iterator: 103
INFO: TEST test_hythread_iterator_default: PASSED
## TEST PASSED
## Executing C unit test: test_native_fat_monitor
INFO: TEST test_wait_signal start
INFO: TEST test_wait_signal: PASSED
## TEST PASSED
## Executing C unit test: test_native_suspend
INFO: TEST test_hythread_thread_suspend start
INFO: TEST test_hythread_thread_suspend: PASSED
INFO: TEST test_hythread_thread_suspend_all start
INFO: TEST test_hythread_thread_suspend_all: PASSED
## TEST PASSED
## Executing C unit test: test_native_thin_monitor
INFO: TEST test_hythread_thin_monitor_enter start
INFO: TEST test_hythread_thin_monitor_enter: PASSED
INFO: TEST test_hythread_thin_monitor_try_enter start
INFO: TEST test_hythread_thin_monitor_try_enter: PASSED
INFO: TEST test_hythread_thin_monitor_wait_timed_illegal start
INFO: TEST test_hythread_thin_monitor_wait_timed_illegal: PASSED
INFO: TEST test_hythread_thin_monitor_wait_timed start
INFO: TEST test_hythread_thin_monitor_wait_timed: PASSED
INFO: TEST test_hythread_thin_monitor_fat_unlock start
status: 70007
INFO: TEST test_hythread_thin_monitor_fat_unlock: PASSED
INFO: TEST test_hythread_thin_monitor_enter_contended start
INFO: TEST test_hythread_thin_monitor_enter_contended: PASSED
## TEST PASSED
## Executing C unit test: test_ti_instrum
INFO: TEST test_jthread_get_all_threads start
INFO: TEST test_jthread_get_all_threads: PASSED
INFO: TEST test_jthread_get_thread_count start
INFO: TEST test_jthread_get_thread_count: PASSED
INFO: TEST test_jthread_get_blocked_count start
ERROR: Test failed: Wrong number waiting on monitor threads (/export/cruise/trunk/cc/projects/drlvm/trunk/vm/tests/unit/thread/test_ti_instrum.c:139)
INFO: TEST test_jthread_get_blocked_count: FAILED
## TEST FAILED
## Executing C unit test: test_ti_local_storage
## TEST PASSED
## Executing C unit test: test_ti_monitor_info
INFO: TEST test_jthread_get_contended_monitor start
INFO: TEST test_jthread_get_contended_monitor: PASSED
INFO: TEST test_jthread_holds_lock start
INFO: TEST test_jthread_holds_lock: PASSED
INFO: TEST test_jthread_get_lock_owner start
INFO: TEST test_jthread_get_lock_owner: PASSED
INFO: TEST test_jthread_get_owned_monitors start
INFO: TEST test_jthread_get_owned_monitors: PASSED
## TEST PASSED
## Executing C unit test: test_ti_peak_count
## TEST PASSED
## Executing C unit test: test_ti_raw_monitors
INFO: TEST test_jthread_raw_monitor_create start
INFO: TEST test_jthread_raw_monitor_create: PASSED
INFO: TEST test_jthread_raw_monitor_destroy start
INFO: TEST test_jthread_raw_monitor_destroy: PASSED
INFO: TEST test_jthread_raw_monitor_enter start
INFO: TEST test_jthread_raw_monitor_enter: PASSED
INFO: TEST test_jthread_raw_monitor_try_enter start
INFO: TEST test_jthread_raw_monitor_try_enter: PASSED
INFO: TEST test_jthread_raw_monitor_exit start
INFO: TEST test_jthread_raw_monitor_exit: PASSED
## TEST PASSED
## Executing C unit test: test_ti_state
INFO: TEST test_jthread_get_state_6 start
state = 00000002 (00000002)
state = 00000002 (00000002)
state = 00000002 (00000002)
state = 00000002 (00000002)
state = 00000002 (00000002)
INFO: TEST test_jthread_get_state_6: PASSED
## TEST PASSED
## Executing C unit test: test_ti_timing
## TEST PASSED
## Please find tests and results at /export/cruise/trunk/cc/projects/drlvm/trunk/build/lnx_em64t_gcc_debug/semis/vm/_cunit.tests/
Note: /export/cruise/trunk/cc/projects/drlvm/trunk/vm/tests/smoke/gc/RunFinalizersOnExitTest.java
uses or overrides a deprecated API.
Note: Recompile with -Xlint:deprecation for details.
Note: Some input files use unchecked or unsafe operations.
Note: Recompile with -Xlint:unchecked for details.
Using jitrino

        ==================================
        Smoke tests
        ==================================
             
Excluding Tests from /export/cruise/trunk/cc/projects/drlvm/trunk/build/make/excludes/exclude.drlvm_smoke.linux.x86_64.jet
  
        
Check.java
PerfCheck.java
classloader/StressLoader.java
gc/LOS.java
gc/MultiThreads.java
StackTest.java
exception/FinalizeStackTest.java

# fails on Ubuntu6 x86_64
gc/Mark.java

# fails intermittently 
stress/Stack.java
stress/Mix.java


------------------------------------------------
        
Running test : Hi
 PASSED : Hi
Running test : classloader.ClassTestGetDeclaringClass
 PASSED : classloader.ClassTestGetDeclaringClass
Running test : classloader.ExceptionInInitializerTest
 PASSED : classloader.ExceptionInInitializerTest
Running test : classloader.LogLoader
 PASSED : classloader.LogLoader
Running test : classloader.NotFound
 PASSED : classloader.NotFound
Running test : exception.ExceptionStackTest
 PASSED : exception.ExceptionStackTest
Running test : exception.NPE
 PASSED : exception.NPE
Running test : gc.FinAlloc
 PASSED : gc.FinAlloc
Running test : gc.Finalizer
 PASSED : gc.Finalizer
Running test : gc.Force
 PASSED : gc.Force
Running test : gc.Fragment
 PASSED : gc.Fragment
Running test : gc.Free
 PASSED : gc.Free
Running test : gc.List
 PASSED : gc.List
Running test : gc.NPE
 PASSED : gc.NPE
Running test : gc.PhantomReferenceQueueTest
 PASSED : gc.PhantomReferenceQueueTest
Running test : gc.PhantomReferenceTest
 PASSED : gc.PhantomReferenceTest
Running test : gc.RefRemove
 PASSED : gc.RefRemove
Running test : gc.RunFinalizersOnExitTest
 PASSED : gc.RunFinalizersOnExitTest
Running test : gc.StressRef
 PASSED : gc.StressRef
Running test : gc.SynchronizedFinilazersTest
 PASSED : gc.SynchronizedFinilazersTest
Running test : gc.ThreadSuspension
 PASSED : gc.ThreadSuspension
Running test : gc.WeakReferenceTest
 PASSED : gc.WeakReferenceTest
Running test : init.ErrorInInitializer
 PASSED : init.ErrorInInitializer
Running test : init.Other
 PASSED : init.Other
Running test : io.ArrayList
 PASSED : io.ArrayList
Running test : io.Integers
 PASSED : io.Integers
Running test : jni.LoadLibrary
 PASSED : jni.LoadLibrary
Running test : outofmemory.Double
 PASSED : outofmemory.Double
Running test : outofmemory.Int
 PASSED : outofmemory.Int
Running test : outofmemory.Plain
 PASSED : outofmemory.Plain
Running test : outofmemory.Ref
 PASSED : outofmemory.Ref
Running test : outofmemory.Throw
 PASSED : outofmemory.Throw
Running test : outofmemory.Vector
 PASSED : outofmemory.Vector
Running test : outofmemory.VectorDouble
 PASSED : outofmemory.VectorDouble
Running test : outofmemory.VectorInt
 PASSED : outofmemory.VectorInt
Running test : outofmemory.VectorRef
 PASSED : outofmemory.VectorRef
Running test : perf.CreateManyExceptions
 PASSED : perf.CreateManyExceptions
Running test : perf.CreateManyExceptions_depth
 PASSED : perf.CreateManyExceptions_depth
Running test : perf.MultiThreadsSimple
 PASSED : perf.MultiThreadsSimple
Running test : perf.SeveralThreads
 PASSED : perf.SeveralThreads
Running test : perf.StressCornerSize
 PASSED : perf.StressCornerSize
Running test : perf.StressCornerSize_a
 PASSED : perf.StressCornerSize_a
Running test : perf.ThrowMany
 PASSED : perf.ThrowMany
Running test : perf.ThrowManyExceptions
 PASSED : perf.ThrowManyExceptions
Running test : perf.ThrowManyExceptions_depth
 PASSED : perf.ThrowManyExceptions_depth
Running test : perf.ThrowMany_depth
 PASSED : perf.ThrowMany_depth
Running test : reflect.GetMethod
 PASSED : reflect.GetMethod
Running test : shutdown.TestFatalError
 PASSED : shutdown.TestFatalError
Running test : shutdown.TestInterrupt
 PASSED : shutdown.TestInterrupt
Running test : shutdown.TestLock
 PASSED : shutdown.TestLock
Running test : shutdown.TestNativeAllocation
 PASSED : shutdown.TestNativeAllocation
Running test : shutdown.TestWaitSet
 PASSED : shutdown.TestWaitSet
Running test : stress.BigStringBuffer
 PASSED : stress.BigStringBuffer
Running test : stress.Finalizer
 PASSED : stress.Finalizer
Running test : stress.Sync
 PASSED : stress.Sync
Running test : stress.Threads
 PASSED : stress.Threads
Running test : stress.Vector
 PASSED : stress.Vector
Running test : stress.WeakHashmapTest
 PASSED : stress.WeakHashmapTest
Running test : thread.ExitShutdownHook
 PASSED : thread.ExitShutdownHook
Running test : thread.InfiniteFinalizer
 PASSED : thread.InfiniteFinalizer
Running test : thread.Sleep
 PASSED : thread.Sleep
Running test : thread.ThreadInterrupt
 PASSED : thread.ThreadInterrupt
Running test : thread.ThreadOOM
 PASSED : thread.ThreadOOM
Running test : util.Date
 PASSED : util.Date
Running test : util.DoPriveleged
 PASSED : util.DoPriveleged
Running test : util.Prop
 PASSED : util.Prop
Running test : util.StringIntern
 PASSED : util.StringIntern
Please find test classes and results at /export/cruise/trunk/cc/projects/drlvm/trunk/build/lnx_em64t_gcc_debug/semis/vm/_smoke.tests/
Using jitrino

        ==================================
        Smoke tests
        ==================================
             
Excluding Tests from /export/cruise/trunk/cc/projects/drlvm/trunk/build/make/excludes/exclude.drlvm_smoke.linux.x86_64.opt
  
        
Check.java
PerfCheck.java
classloader/StressLoader.java
gc/LOS.java
gc/Finalizer.java
gc/MultiThreads.java
gc/PhantomReferenceTest.java
gc/RunFinalizersOnExitTest.java
StackTest.java
exception/FinalizeStackTest.java

# fails on Ubuntu6 x86_64
gc/Mark.java

# fails intermittently 
stress/Stack.java
stress/Mix.java


------------------------------------------------
        
Running test : Hi
 PASSED : Hi
Running test : classloader.ClassTestGetDeclaringClass
 PASSED : classloader.ClassTestGetDeclaringClass
Running test : classloader.ExceptionInInitializerTest
 PASSED : classloader.ExceptionInInitializerTest
Running test : classloader.LogLoader
 PASSED : classloader.LogLoader
Running test : classloader.NotFound
 PASSED : classloader.NotFound
Running test : exception.ExceptionStackTest
 PASSED : exception.ExceptionStackTest
Running test : exception.NPE
 PASSED : exception.NPE
Running test : gc.FinAlloc
 PASSED : gc.FinAlloc
Running test : gc.Force
 PASSED : gc.Force
Running test : gc.Fragment
 PASSED : gc.Fragment
Running test : gc.Free
 PASSED : gc.Free
Running test : gc.List
 PASSED : gc.List
Running test : gc.NPE
 PASSED : gc.NPE
Running test : gc.PhantomReferenceQueueTest
 PASSED : gc.PhantomReferenceQueueTest
Running test : gc.RefRemove
 PASSED : gc.RefRemove
Running test : gc.StressRef
 PASSED : gc.StressRef
Running test : gc.SynchronizedFinilazersTest
 PASSED : gc.SynchronizedFinilazersTest
Running test : gc.ThreadSuspension
 PASSED : gc.ThreadSuspension
Running test : gc.WeakReferenceTest
 PASSED : gc.WeakReferenceTest
Running test : init.ErrorInInitializer
 PASSED : init.ErrorInInitializer
Running test : init.Other
 PASSED : init.Other
Running test : io.ArrayList
 PASSED : io.ArrayList
Running test : io.Integers
 PASSED : io.Integers
Running test : jni.LoadLibrary
 PASSED : jni.LoadLibrary
Running test : outofmemory.Double
 PASSED : outofmemory.Double
Running test : outofmemory.Int
 PASSED : outofmemory.Int
Running test : outofmemory.Plain
 PASSED : outofmemory.Plain
Running test : outofmemory.Ref
 PASSED : outofmemory.Ref
Running test : outofmemory.Throw
 PASSED : outofmemory.Throw
Running test : outofmemory.Vector
 PASSED : outofmemory.Vector
Running test : outofmemory.VectorDouble
 PASSED : outofmemory.VectorDouble
Running test : outofmemory.VectorInt
 PASSED : outofmemory.VectorInt
Running test : outofmemory.VectorRef
 PASSED : outofmemory.VectorRef
Running test : perf.CreateManyExceptions
 PASSED : perf.CreateManyExceptions
Running test : perf.CreateManyExceptions_depth
 PASSED : perf.CreateManyExceptions_depth
Running test : perf.MultiThreadsSimple
 PASSED : perf.MultiThreadsSimple
Running test : perf.SeveralThreads
 PASSED : perf.SeveralThreads
Running test : perf.StressCornerSize
 PASSED : perf.StressCornerSize
Running test : perf.StressCornerSize_a
 PASSED : perf.StressCornerSize_a
Running test : perf.ThrowMany
 PASSED : perf.ThrowMany
Running test : perf.ThrowManyExceptions
 PASSED : perf.ThrowManyExceptions
Running test : perf.ThrowManyExceptions_depth
 PASSED : perf.ThrowManyExceptions_depth
Running test : perf.ThrowMany_depth
 PASSED : perf.ThrowMany_depth
Running test : reflect.GetMethod
 PASSED : reflect.GetMethod
Running test : shutdown.TestFatalError
 PASSED : shutdown.TestFatalError
Running test : shutdown.TestInterrupt
 PASSED : shutdown.TestInterrupt
Running test : shutdown.TestLock
 PASSED : shutdown.TestLock
Running test : shutdown.TestNativeAllocation
 PASSED : shutdown.TestNativeAllocation
Running test : shutdown.TestWaitSet
 PASSED : shutdown.TestWaitSet
Running test : stress.BigStringBuffer
 PASSED : stress.BigStringBuffer
Running test : stress.Finalizer
 PASSED : stress.Finalizer
Running test : stress.Sync
 PASSED : stress.Sync
Running test : stress.Threads
 PASSED : stress.Threads
Running test : stress.Vector
 PASSED : stress.Vector
Running test : stress.WeakHashmapTest
 PASSED : stress.WeakHashmapTest
Running test : thread.ExitShutdownHook
 PASSED : thread.ExitShutdownHook
Running test : thread.InfiniteFinalizer
 PASSED : thread.InfiniteFinalizer
Running test : thread.Sleep
 PASSED : thread.Sleep
Running test : thread.ThreadInterrupt
 PASSED : thread.ThreadInterrupt
Running test : thread.ThreadOOM
 PASSED : thread.ThreadOOM
Running test : util.Date
 PASSED : util.Date
Running test : util.DoPriveleged
 PASSED : util.DoPriveleged
Running test : util.Prop
 PASSED : util.Prop
Running test : util.StringIntern
 PASSED : util.StringIntern
Please find test classes and results at /export/cruise/trunk/cc/projects/drlvm/trunk/build/lnx_em64t_gcc_debug/semis/vm/_smoke.tests/
Using interpreter

        ==================================
        Smoke tests
        ==================================
             
Excluding Tests from /export/cruise/trunk/cc/projects/drlvm/trunk/build/make/excludes/exclude.drlvm_smoke.linux.x86_64.int
  
        
Check.java
PerfCheck.java
classloader/StressLoader.java
gc/Mark.java
gc/MultiThreads.java
io/Integers.java
stress/Stack.java
stress/Mix.java


------------------------------------------------
        
Running test : Hi
 PASSED : Hi
Running test : StackTest
 PASSED : StackTest
Running test : classloader.ClassTestGetDeclaringClass
 PASSED : classloader.ClassTestGetDeclaringClass
Running test : classloader.ExceptionInInitializerTest
 PASSED : classloader.ExceptionInInitializerTest
Running test : classloader.LogLoader
 PASSED : classloader.LogLoader
Running test : classloader.NotFound
 PASSED : classloader.NotFound
Running test : exception.ExceptionStackTest
 PASSED : exception.ExceptionStackTest
Running test : exception.FinalizeStackTest
 PASSED : exception.FinalizeStackTest
Running test : exception.NPE
 PASSED : exception.NPE
Running test : gc.FinAlloc
 PASSED : gc.FinAlloc
Running test : gc.Finalizer
 PASSED : gc.Finalizer
Running test : gc.Force
 PASSED : gc.Force
Running test : gc.Fragment
 PASSED : gc.Fragment
Running test : gc.Free
 PASSED : gc.Free
Running test : gc.LOS
 PASSED : gc.LOS
Running test : gc.List
 PASSED : gc.List
Running test : gc.NPE
 PASSED : gc.NPE
Running test : gc.PhantomReferenceQueueTest
 PASSED : gc.PhantomReferenceQueueTest
Running test : gc.PhantomReferenceTest
 PASSED : gc.PhantomReferenceTest
Running test : gc.RefRemove
 PASSED : gc.RefRemove
Running test : gc.RunFinalizersOnExitTest
 PASSED : gc.RunFinalizersOnExitTest
Running test : gc.StressRef
 PASSED : gc.StressRef
Running test : gc.SynchronizedFinilazersTest
 PASSED : gc.SynchronizedFinilazersTest
Running test : gc.ThreadSuspension
 PASSED : gc.ThreadSuspension
Running test : gc.WeakReferenceTest
 PASSED : gc.WeakReferenceTest
Running test : init.ErrorInInitializer
 PASSED : init.ErrorInInitializer
Running test : init.Other
 PASSED : init.Other
Running test : io.ArrayList
 PASSED : io.ArrayList
Running test : jni.LoadLibrary
 PASSED : jni.LoadLibrary
Running test : outofmemory.Double
 PASSED : outofmemory.Double
Running test : outofmemory.Int
 PASSED : outofmemory.Int
Running test : outofmemory.Plain
 PASSED : outofmemory.Plain
Running test : outofmemory.Ref
 PASSED : outofmemory.Ref
Running test : outofmemory.Throw
 PASSED : outofmemory.Throw
Running test : outofmemory.Vector
 PASSED : outofmemory.Vector
Running test : outofmemory.VectorDouble
 PASSED : outofmemory.VectorDouble
Running test : outofmemory.VectorInt
 PASSED : outofmemory.VectorInt
Running test : outofmemory.VectorRef
 PASSED : outofmemory.VectorRef
Running test : perf.CreateManyExceptions
 PASSED : perf.CreateManyExceptions
Running test : perf.CreateManyExceptions_depth
 PASSED : perf.CreateManyExceptions_depth
Running test : perf.MultiThreadsSimple
 PASSED : perf.MultiThreadsSimple
Running test : perf.SeveralThreads
 PASSED : perf.SeveralThreads
Running test : perf.StressCornerSize
 PASSED : perf.StressCornerSize
Running test : perf.StressCornerSize_a
 PASSED : perf.StressCornerSize_a
Running test : perf.ThrowMany
 PASSED : perf.ThrowMany
Running test : perf.ThrowManyExceptions
 PASSED : perf.ThrowManyExceptions
Running test : perf.ThrowManyExceptions_depth
 PASSED : perf.ThrowManyExceptions_depth
Running test : perf.ThrowMany_depth
 PASSED : perf.ThrowMany_depth
Running test : reflect.GetMethod
 PASSED : reflect.GetMethod
Running test : shutdown.TestFatalError
 PASSED : shutdown.TestFatalError
Running test : shutdown.TestInterrupt
 PASSED : shutdown.TestInterrupt
Running test : shutdown.TestLock
 PASSED : shutdown.TestLock
Running test : shutdown.TestNativeAllocation
 PASSED : shutdown.TestNativeAllocation
Running test : shutdown.TestWaitSet
 PASSED : shutdown.TestWaitSet
Running test : stress.BigStringBuffer
 PASSED : stress.BigStringBuffer
Running test : stress.Finalizer
 PASSED : stress.Finalizer
Running test : stress.Sync
 PASSED : stress.Sync
Running test : stress.Threads
 PASSED : stress.Threads
Running test : stress.Vector
 PASSED : stress.Vector
Running test : stress.WeakHashmapTest
 PASSED : stress.WeakHashmapTest
Running test : thread.ExitShutdownHook
 PASSED : thread.ExitShutdownHook
Running test : thread.InfiniteFinalizer
 PASSED : thread.InfiniteFinalizer
Running test : thread.Sleep
 PASSED : thread.Sleep
Running test : thread.ThreadInterrupt
 PASSED : thread.ThreadInterrupt
Running test : thread.ThreadOOM
 PASSED : thread.ThreadOOM
Running test : util.Date
 PASSED : util.Date
Running test : util.DoPriveleged
 PASSED : util.DoPriveleged
Running test : util.Prop
 PASSED : util.Prop
Running test : util.StringIntern
 PASSED : util.StringIntern
Please find test classes and results at /export/cruise/trunk/cc/projects/drlvm/trunk/build/lnx_em64t_gcc_debug/semis/vm/_smoke.tests/
The test report is in /export/cruise/trunk/cc/projects/drlvm/trunk/build/lnx_em64t_gcc_debug/semis/vm/_smoke.tests/reports/html/index.html
Note: Some input files use or override a deprecated API.
Note: Recompile with -Xlint:deprecation for details.
Note: /export/cruise/trunk/cc/projects/drlvm/trunk/vm/tests/kernel/java/lang/ClassAnnotationsTest.java
uses unchecked or unsafe operations.
Note: Recompile with -Xlint:unchecked for details.

        ==================================
        Run kernel tests using jitrino.JET
        ==================================
             
Using exclude file = /export/cruise/trunk/cc/projects/drlvm/trunk/build/make/excludes/exclude.drlvm_kernel.linux.x86_64.jet
  
        
## These tests are too slow
java/lang/RuntimeAdditionalTest*.java

## Tese tests are unstable and hang often
java/lang/RuntimeAdditionalTest11.java
java/lang/RuntimeAdditionalTest34.java
java/lang/RuntimeAdditionalTest39.java
java/lang/RuntimeAdditionalTest40.java
java/lang/RuntimeAdditionalTest41.java
java/lang/RuntimeAdditionalTest42.java

## following are tests that fail due to bugs

java/lang/ClassAnnotationsTest.java
java/lang/reflect/FieldTest.java
org/apache/harmony/lang/annotation/AllTypesTest.java

        

        ==================================
        Run kernel tests using jitrino.OPT
        ==================================
             
Using exclude file = /export/cruise/trunk/cc/projects/drlvm/trunk/build/make/excludes/exclude.drlvm_kernel.linux.x86_64.opt
  
        
## These tests are too slow
java/lang/RuntimeAdditionalTest*.java

## Tese tests are unstable and hang often
java/lang/RuntimeAdditionalTest11.java
java/lang/RuntimeAdditionalTest34.java
java/lang/RuntimeAdditionalTest39.java
java/lang/RuntimeAdditionalTest40.java
java/lang/RuntimeAdditionalTest41.java
java/lang/RuntimeAdditionalTest42.java

## these tests show bugs in VM
java/lang/ClassAnnotationsTest.java
java/lang/ClassLoaderTest.java
java/lang/reflect/FieldTest.java
org/apache/harmony/lang/annotation/AllTypesTest.java

        

        ==================================
        Run kernel tests using interpreter
        ==================================
             
Using exclude file = /export/cruise/trunk/cc/projects/drlvm/trunk/build/make/excludes/exclude.drlvm_kernel.linux.x86_64.int
  
        
## These tests are too slow
java/lang/RuntimeAdditionalTest*.java

## Tese tests are unstable and hang often
java/lang/RuntimeAdditionalTest11.java
java/lang/RuntimeAdditionalTest34.java
java/lang/RuntimeAdditionalTest39.java
java/lang/RuntimeAdditionalTest40.java
java/lang/RuntimeAdditionalTest41.java
java/lang/RuntimeAdditionalTest42.java

java/lang/ClassGenericsTest.java
java/lang/ClassGenericsTest4.java
    
# HARMONY-3171
java/lang/ThreadRTest.java

        
  ***************************
  *** Kernel tests status ***
  ***************************
      jitrino.JET PASSED
      jitrino.OPT PASSED
      interpreter PASSED
Please find detailed results under /export/cruise/trunk/cc/projects/drlvm/trunk/build/lnx_em64t_gcc_debug/semis/kernel.tests/reports
directory.

***********************************************************
Unit Tests: (2408)
        
error: test test_ti_instrum
Unit Test Error Details:	(1)
                
Test: testClass: test_ti_instrum

***********************************************************
Modifications since last successful build:	(1)
            
add cc-drlvm log20070219164424Lbuild.306 02/19/2007 16:44:24drlvm

Mime
View raw message