harmony-alerts mailing list archives

Site index · List index
Message view « Date » · « Thread »
Top « Date » · « Thread »
From nom...@intel.com
Subject [build-test alert] BUILD FAILED Windows XP SP2 msvc debug: drlvm tests
Date Fri, 16 Feb 2007 06:55:44 GMT
BUILD FAILED:
	Ant Error Message:
C:\cruise\trunk\cc\projects\drlvm\trunk\build\make\build.xml:368: The following error occurred
while executing this line: C:\cruise\trunk\cc\projects\drlvm\trunk\build\make\build_component.xml:72:
The following error occurred while executing this line: C:\cruise\trunk\cc\projects\drlvm\trunk\build\win_ia32_msvc_debug\semis\build\targets\test.xml:6:
Some tests failed

Date of build:	02/16/2007 12:53:23
Time to build:	2 minutes 7 seconds
Last changed:	02/16/2007 12:48:50
Last log entry:	Partial fix to HARMONY-3184 [drlvm][netbeans] Aborting on RI-supported options
Added handling of -XX:*, -client, -server  cmd-line options.

***********************************************************
Execution log (errors/warnings messages):	
Test SingleStep1.SingleStep1 FAILED
Test VMInit1.VMInit1 FAILED
Test Breakpoint1.Breakpoint1 FAILED
Test SingleStep1.SingleStep1 FAILED
Test VMInit1.VMInit1 FAILED
Java Result: 1
Java Result: 1
Java Result: 1
Java Result: 1
Java Result: 1
Java Result: 1
Java Result: 1
Java Result: 1
Java Result: 1
Java Result: 1
Java Result: 1
Java Result: 1
Java Result: 1
Java Result: 1
Java Result: 1
Java Result: 1
Java Result: 1
Java Result: 1
Java Result: 1
Java Result: 1
Java Result: 1
Java Result: 1
Java Result: 1
Java Result: 1
Java Result: 1
Java Result: 1
Java Result: 1
Java Result: 1
Java Result: 1
Java Result: 1
Java Result: 1
Java Result: 1
Java Result: 1
Java Result: 1
Java Result: 1
Java Result: 1
Java Result: 1
Java Result: 1
Java Result: 1
Java Result: 1
Java Result: 1
Java Result: 1
Java Result: 1
Java Result: 1
Java Result: 1
Java Result: 1
Java Result: 1
Java Result: 1
Java Result: 1
Java Result: 1
Java Result: 1
Java Result: 1
Java Result: 1
Java Result: 1
Java Result: 1
Java Result: 1
Java Result: 1
Java Result: 1
Java Result: 1
Java Result: 1
Java Result: 1
Java Result: 1
Java Result: 1
Java Result: 1
Java Result: 1
Java Result: 1
Java Result: 1
Java Result: 1
Java Result: 1
Java Result: 1
Java Result: 1
Java Result: 1
Java Result: 1
Java Result: 1
Java Result: 1
Java Result: 1
Java Result: 1
Java Result: 1
Java Result: 1
Java Result: 1
Java Result: 1
Java Result: 1
Java Result: 1
Java Result: 1
Java Result: 1
Java Result: 1
Java Result: 1
Java Result: 1
Java Result: 1
Java Result: 1
Java Result: 1
Java Result: 1
Java Result: 1
Java Result: 1
Java Result: 1
Java Result: 1
Java Result: 1
Java Result: 1
Java Result: 1
Java Result: 1
Java Result: 1
Java Result: 1
Java Result: 1
Java Result: 1
Java Result: 1
Java Result: 1
Java Result: 1
Java Result: 1
Java Result: 1
Java Result: 1
Java Result: 1
Java Result: 1
Java Result: 1
Java Result: 1
Java Result: 1
Java Result: 1
Java Result: 1
Java Result: 1
Java Result: 1
Java Result: 1
Java Result: 1
Java Result: 1
Java Result: 1
Java Result: 1
Java Result: 1
Java Result: 1
Java Result: 1
Java Result: 1
Java Result: 1
Java Result: 1
Java Result: 1
Java Result: 1
Java Result: 1
Java Result: 1
Java Result: 1
Java Result: 1
Java Result: 1
Java Result: 1
Java Result: 1
Java Result: 1
Java Result: 1
Tests FAILED
Tests FAILED
Tests FAILED
 Using CLASSLIB = C:\cruise\trunk\cc\projects\classlib\trunk
jars: true
using proxy settings: proxy.ims.intel.com port:911
Configuration:
    classlib root = C:\cruise\trunk\cc\projects\classlib\trunk
               os = Windows
             arch = ia32
              cxx = msvc
              cfg = debug
       components = deploy
extra
extra.apr
extra.apriconv
extra.aprutil
extra.eclipse_script
extra.hyplugin
extra.java_script
extra.jre_libraries
extra.log4cxx
extra.zlib
vm
vm.em
vm.encoder
vm.gc_cc
vm.gc_gen
vm.hythr
vm.interpreter
vm.jitrino
vm.jthread
vm.kernel_classes
vm.port
vm.vmcore
vm.vmi
## Compiling JVMTI natives in: C:\cruise\trunk\cc\projects\drlvm\trunk\vm\tests\jvmti\Breakpoint1
## Compiling JVMTI natives in: C:\cruise\trunk\cc\projects\drlvm\trunk\vm\tests\jvmti\SingleStep1
## Compiling JVMTI natives in: C:\cruise\trunk\cc\projects\drlvm\trunk\vm\tests\jvmti\VMInit1

		==================================
		Run JVMTI tests using jit
		==================================
		
Running Breakpoint1
Unknown option -XX:-vm.assert_dialog
Use java -help to get help on command line options
Running SingleStep1
Unknown option -XX:-vm.assert_dialog
Use java -help to get help on command line options
Running VMInit1
Unknown option -XX:-vm.assert_dialog
Use java -help to get help on command line options

		==================================
		Run JVMTI tests using interpreter
		==================================
		
Running Breakpoint1
Unknown option -XX:-vm.assert_dialog
Use java -help to get help on command line options
Running SingleStep1
Unknown option -XX:-vm.assert_dialog
Use java -help to get help on command line options
Running VMInit1
Unknown option -XX:-vm.assert_dialog
Use java -help to get help on command line options
## Compiling framework...
## Compiling C unit tests
## Linking C unit test: test_java_attrs
## Linking C unit test: test_java_basic
## Linking C unit test: test_java_identify
## Linking C unit test: test_java_interrupt
## Linking C unit test: test_java_monitors
## Linking C unit test: test_java_park
## Linking C unit test: test_java_ptr_conv
## Linking C unit test: test_java_suspend
## Linking C unit test: test_native_basic
## Linking C unit test: test_native_fat_monitor
## Linking C unit test: test_native_suspend
## Linking C unit test: test_native_thin_monitor
## Linking C unit test: test_ti_instrum
## Linking C unit test: test_ti_local_storage
## Linking C unit test: test_ti_monitor_info
## Linking C unit test: test_ti_peak_count
## Linking C unit test: test_ti_raw_monitors
## Linking C unit test: test_ti_state
## Linking C unit test: test_ti_timing
## Executing C unit test: test_java_attrs
INFO: TEST test_jthread_get_priority start
INFO: TEST test_jthread_get_priority: PASSED
INFO: TEST test_jthread_set_priority start
INFO: TEST test_jthread_set_priority: PASSED
## TEST PASSED
## Executing C unit test: test_java_basic
INFO: TEST test_jthread_attach start
INFO: TEST test_jthread_attach: PASSED
INFO: TEST test_jthread_detach start
INFO: TEST test_jthread_detach: PASSED
INFO: TEST test_hythread_create start
INFO: TEST test_hythread_create: PASSED
INFO: TEST test_hythread_create_with_function start
INFO: TEST test_hythread_create_with_function: PASSED
INFO: TEST test_jthread_get_JNI_env start
INFO: TEST test_jthread_get_JNI_env: PASSED
INFO: TEST test_jthread_join start
INFO: TEST test_jthread_join: PASSED
INFO: TEST test_jthread_timed_join start
-------- status = 00011177 (70007) 100
-------- status = 00011177 (70007) 100
-------- status = 00011177 (70007) 100
-------- status = 00011177 (70007) 100
-------- status = 00000000 (0) 50000
-------- status = 00000000 (0) 50000
-------- status = 00000000 (0) 50000
-------- status = 00000000 (0) 50000
INFO: TEST test_jthread_timed_join: PASSED
INFO: TEST test_jthread_exception_stop start
INFO: TEST test_jthread_exception_stop: PASSED
INFO: TEST test_jthread_sleep start
INFO: TEST test_jthread_sleep: PASSED
INFO: TEST test_hythread_yield start
INFO: TEST test_hythread_yield: PASSED
## TEST PASSED
## Executing C unit test: test_java_identify
INFO: TEST test_jthread_self start
INFO: TEST test_jthread_self: PASSED
INFO: TEST test_jthread_get_id start
INFO: TEST test_jthread_get_id: PASSED
INFO: TEST test_jthread_get_thread start
INFO: TEST test_jthread_get_thread: PASSED
## TEST PASSED
## Executing C unit test: test_java_interrupt
INFO: TEST test_jthread_interrupt start
INFO: TEST test_jthread_interrupt: PASSED
INFO: TEST test_jthread_is_interrupted start
INFO: TEST test_jthread_is_interrupted: PASSED
INFO: TEST test_jthread_clear_interrupted start
INFO: TEST test_jthread_clear_interrupted: PASSED
## TEST PASSED
## Executing C unit test: test_java_monitors
INFO: TEST test_jthread_monitor_init start
INFO: TEST test_jthread_monitor_init: PASSED
INFO: TEST test_jthread_monitor_enter start
INFO: TEST test_jthread_monitor_enter: PASSED
INFO: TEST test_jthread_monitor_try_enter start
INFO: TEST test_jthread_monitor_try_enter: PASSED
INFO: TEST test_jthread_monitor_exit start
INFO: TEST test_jthread_monitor_exit: PASSED
INFO: TEST test_jthread_monitor_notify_all start
INFO: TEST test_jthread_monitor_notify_all: PASSED
INFO: TEST test_jthread_monitor_wait start
INFO: TEST test_jthread_monitor_wait: PASSED
INFO: TEST test_jthread_monitor_timed_wait start
INFO: TEST test_jthread_monitor_timed_wait: PASSED
INFO: TEST test_jthread_monitor_timed_wait_timeout start
INFO: TEST test_jthread_monitor_timed_wait_timeout: PASSED
## TEST PASSED
## Executing C unit test: test_java_park
INFO: TEST test_jthread_park_unpark start
INFO: TEST test_jthread_park_unpark: PASSED
INFO: TEST test_jthread_park_interrupt start
INFO: TEST test_jthread_park_interrupt: PASSED
INFO: TEST test_jthread_timed_park start
INFO: TEST test_jthread_timed_park: PASSED
## TEST PASSED
## Executing C unit test: test_java_ptr_conv
INFO: TEST test_jthread_get_java_thread start
INFO: TEST test_jthread_get_java_thread: PASSED
INFO: TEST test_jthread_get_native_thread start
INFO: TEST test_jthread_get_native_thread: PASSED
## TEST PASSED
## Executing C unit test: test_java_suspend
INFO: TEST test_jthread_suspend_resume start
INFO: TEST test_jthread_suspend_resume: PASSED
INFO: TEST test_jthread_suspend_all_resume_all start
INFO: TEST test_jthread_suspend_all_resume_all: PASSED
## TEST PASSED
## Executing C unit test: test_native_basic
INFO: TEST test_hythread_self_base start
INFO: TEST test_hythread_self_base: PASSED
INFO: TEST test_hythread_create start
INFO: TEST test_hythread_create: PASSED
INFO: TEST test_hythread_create_many start
INFO: TEST test_hythread_create_many: PASSED
INFO: TEST test_hythread_iterator start
iterator size: 100
INFO: TEST test_hythread_iterator: PASSED
INFO: TEST test_hythread_iterator_default start
default group iterator: 102
INFO: TEST test_hythread_iterator_default: PASSED
## TEST PASSED
## Executing C unit test: test_native_fat_monitor
INFO: TEST test_wait_signal start
INFO: TEST test_wait_signal: PASSED
## TEST PASSED
## Executing C unit test: test_native_suspend
INFO: TEST test_hythread_thread_suspend start
INFO: TEST test_hythread_thread_suspend: PASSED
INFO: TEST test_hythread_thread_suspend_all start
INFO: TEST test_hythread_thread_suspend_all: PASSED
## TEST PASSED
## Executing C unit test: test_native_thin_monitor
INFO: TEST test_hythread_thin_monitor_enter start
INFO: TEST test_hythread_thin_monitor_enter: PASSED
INFO: TEST test_hythread_thin_monitor_try_enter start
INFO: TEST test_hythread_thin_monitor_try_enter: PASSED
INFO: TEST test_hythread_thin_monitor_wait_timed_illegal start
INFO: TEST test_hythread_thin_monitor_wait_timed_illegal: PASSED
INFO: TEST test_hythread_thin_monitor_wait_timed start
INFO: TEST test_hythread_thin_monitor_wait_timed: PASSED
INFO: TEST test_hythread_thin_monitor_fat_unlock start
status: 70007
INFO: TEST test_hythread_thin_monitor_fat_unlock: PASSED
INFO: TEST test_hythread_thin_monitor_enter_contended start
INFO: TEST test_hythread_thin_monitor_enter_contended: PASSED
## TEST PASSED
## Executing C unit test: test_ti_instrum
INFO: TEST test_jthread_get_all_threads start
INFO: TEST test_jthread_get_all_threads: PASSED
INFO: TEST test_jthread_get_thread_count start
INFO: TEST test_jthread_get_thread_count: PASSED
INFO: TEST test_jthread_get_blocked_count start
INFO: TEST test_jthread_get_blocked_count: PASSED
## TEST PASSED
## Executing C unit test: test_ti_local_storage
## TEST PASSED
## Executing C unit test: test_ti_monitor_info
INFO: TEST test_jthread_get_contended_monitor start
INFO: TEST test_jthread_get_contended_monitor: PASSED
INFO: TEST test_jthread_holds_lock start
INFO: TEST test_jthread_holds_lock: PASSED
INFO: TEST test_jthread_get_lock_owner start
INFO: TEST test_jthread_get_lock_owner: PASSED
INFO: TEST test_jthread_get_owned_monitors start
INFO: TEST test_jthread_get_owned_monitors: PASSED
## TEST PASSED
## Executing C unit test: test_ti_peak_count
## TEST PASSED
## Executing C unit test: test_ti_raw_monitors
INFO: TEST test_jthread_raw_monitor_create start
INFO: TEST test_jthread_raw_monitor_create: PASSED
INFO: TEST test_jthread_raw_monitor_destroy start
INFO: TEST test_jthread_raw_monitor_destroy: PASSED
INFO: TEST test_jthread_raw_monitor_enter start
INFO: TEST test_jthread_raw_monitor_enter: PASSED
INFO: TEST test_jthread_raw_monitor_try_enter start
INFO: TEST test_jthread_raw_monitor_try_enter: PASSED
INFO: TEST test_jthread_raw_monitor_exit start
INFO: TEST test_jthread_raw_monitor_exit: PASSED
## TEST PASSED
## Executing C unit test: test_ti_state
INFO: TEST test_jthread_get_state_6 start
state = 00000002 (00000002)
state = 00000002 (00000002)
state = 00000002 (00000002)
state = 00000002 (00000002)
state = 00000002 (00000002)
INFO: TEST test_jthread_get_state_6: PASSED
## TEST PASSED
## Executing C unit test: test_ti_timing
## TEST PASSED
## Please find tests and results at C:\cruise\trunk\cc\projects\drlvm\trunk\build\win_ia32_msvc_debug\semis/vm/_cunit.tests/
Using jitrino

        ==================================
        Smoke tests
        ==================================
             
Excluding Tests from C:\cruise\trunk\cc\projects\drlvm\trunk\build\make\excludes\exclude.drlvm_smoke.windows.x86.jit
  
        
Check.java
PerfCheck.java
classloader/StressLoader.java
gc/MultiThreads.java
io/Integers.java
shutdown/TestInterrupt.java

------------------------------------------------
        
Running test : Hi
*** FAILED **** : Hi
Running test : StackTest
*** FAILED **** : StackTest
Running test : classloader.ClassTestGetDeclaringClass
*** FAILED **** : classloader.ClassTestGetDeclaringClass
Running test : classloader.ExceptionInInitializerTest
*** FAILED **** : classloader.ExceptionInInitializerTest
Running test : classloader.LogLoader
*** FAILED **** : classloader.LogLoader
Running test : classloader.NotFound
*** FAILED **** : classloader.NotFound
Running test : exception.ExceptionStackTest
*** FAILED **** : exception.ExceptionStackTest
Running test : exception.FinalizeStackTest
*** FAILED **** : exception.FinalizeStackTest
Running test : exception.NPE
*** FAILED **** : exception.NPE
Running test : gc.FinAlloc
*** FAILED **** : gc.FinAlloc
Running test : gc.Finalizer
*** FAILED **** : gc.Finalizer
Running test : gc.Force
*** FAILED **** : gc.Force
Running test : gc.Fragment
*** FAILED **** : gc.Fragment
Running test : gc.Free
*** FAILED **** : gc.Free
Running test : gc.LOS
*** FAILED **** : gc.LOS
Running test : gc.List
*** FAILED **** : gc.List
Running test : gc.Mark
*** FAILED **** : gc.Mark
Running test : gc.NPE
*** FAILED **** : gc.NPE
Running test : gc.PhantomReferenceQueueTest
*** FAILED **** : gc.PhantomReferenceQueueTest
Running test : gc.PhantomReferenceTest
*** FAILED **** : gc.PhantomReferenceTest
Running test : gc.RefRemove
*** FAILED **** : gc.RefRemove
Running test : gc.RunFinalizersOnExitTest
*** FAILED **** : gc.RunFinalizersOnExitTest
Running test : gc.StressRef
*** FAILED **** : gc.StressRef
Running test : gc.SynchronizedFinilazersTest
*** FAILED **** : gc.SynchronizedFinilazersTest
Running test : gc.ThreadSuspension
*** FAILED **** : gc.ThreadSuspension
Running test : gc.WeakReferenceTest
*** FAILED **** : gc.WeakReferenceTest
Running test : init.ErrorInInitializer
*** FAILED **** : init.ErrorInInitializer
Running test : init.Other
*** FAILED **** : init.Other
Running test : io.ArrayList
*** FAILED **** : io.ArrayList
Running test : jni.LoadLibrary
*** FAILED **** : jni.LoadLibrary
Running test : outofmemory.Double
*** FAILED **** : outofmemory.Double
Running test : outofmemory.Int
*** FAILED **** : outofmemory.Int
Running test : outofmemory.Plain
*** FAILED **** : outofmemory.Plain
Running test : outofmemory.Ref
*** FAILED **** : outofmemory.Ref
Running test : outofmemory.Throw
*** FAILED **** : outofmemory.Throw
Running test : outofmemory.Vector
*** FAILED **** : outofmemory.Vector
Running test : outofmemory.VectorDouble
*** FAILED **** : outofmemory.VectorDouble
Running test : outofmemory.VectorInt
*** FAILED **** : outofmemory.VectorInt
Running test : outofmemory.VectorRef
*** FAILED **** : outofmemory.VectorRef
Running test : perf.CreateManyExceptions
*** FAILED **** : perf.CreateManyExceptions
Running test : perf.CreateManyExceptions_depth
*** FAILED **** : perf.CreateManyExceptions_depth
Running test : perf.MultiThreadsSimple
*** FAILED **** : perf.MultiThreadsSimple
Running test : perf.SeveralThreads
*** FAILED **** : perf.SeveralThreads
Running test : perf.StressCornerSize
*** FAILED **** : perf.StressCornerSize
Running test : perf.StressCornerSize_a
*** FAILED **** : perf.StressCornerSize_a
Running test : perf.ThrowMany
*** FAILED **** : perf.ThrowMany
Running test : perf.ThrowManyExceptions
*** FAILED **** : perf.ThrowManyExceptions
Running test : perf.ThrowManyExceptions_depth
*** FAILED **** : perf.ThrowManyExceptions_depth
Running test : perf.ThrowMany_depth
*** FAILED **** : perf.ThrowMany_depth
Running test : reflect.GetMethod
*** FAILED **** : reflect.GetMethod
Running test : shutdown.TestFatalError
*** FAILED **** : shutdown.TestFatalError
Running test : shutdown.TestLock
*** FAILED **** : shutdown.TestLock
Running test : shutdown.TestNativeAllocation
*** FAILED **** : shutdown.TestNativeAllocation
Running test : shutdown.TestWaitSet
*** FAILED **** : shutdown.TestWaitSet
Running test : stress.BigStringBuffer
*** FAILED **** : stress.BigStringBuffer
Running test : stress.Finalizer
*** FAILED **** : stress.Finalizer
Running test : stress.Mix
*** FAILED **** : stress.Mix
Running test : stress.Stack
*** FAILED **** : stress.Stack
Running test : stress.Sync
*** FAILED **** : stress.Sync
Running test : stress.Threads
*** FAILED **** : stress.Threads
Running test : stress.Vector
*** FAILED **** : stress.Vector
Running test : stress.WeakHashmapTest
*** FAILED **** : stress.WeakHashmapTest
Running test : thread.ExitShutdownHook
*** FAILED **** : thread.ExitShutdownHook
Running test : thread.InfiniteFinalizer
*** FAILED **** : thread.InfiniteFinalizer
Running test : thread.Sleep
*** FAILED **** : thread.Sleep
Running test : thread.ThreadInterrupt
*** FAILED **** : thread.ThreadInterrupt
Running test : thread.ThreadOOM
*** FAILED **** : thread.ThreadOOM
Running test : util.Date
*** FAILED **** : util.Date
Running test : util.DoPriveleged
*** FAILED **** : util.DoPriveleged
Running test : util.Prop
*** FAILED **** : util.Prop
Running test : util.StringIntern
*** FAILED **** : util.StringIntern
Please find test classes and results at C:\cruise\trunk\cc\projects\drlvm\trunk\build\win_ia32_msvc_debug\semis/vm/_smoke.tests/
Using interpreter

        ==================================
        Smoke tests
        ==================================
             
Excluding Tests from C:\cruise\trunk\cc\projects\drlvm\trunk\build\make\excludes\exclude.drlvm_smoke.windows.x86.interpreter
  
        
Check.java
PerfCheck.java
classloader/StressLoader.java
gc/Mark.java
gc/MultiThreads.java
io/Integers.java
shutdown/TestInterrupt.java

------------------------------------------------
        
Running test : Hi
*** FAILED **** : Hi
Running test : StackTest
*** FAILED **** : StackTest
Running test : classloader.ClassTestGetDeclaringClass
*** FAILED **** : classloader.ClassTestGetDeclaringClass
Running test : classloader.ExceptionInInitializerTest
*** FAILED **** : classloader.ExceptionInInitializerTest
Running test : classloader.LogLoader
*** FAILED **** : classloader.LogLoader
Running test : classloader.NotFound
*** FAILED **** : classloader.NotFound
Running test : exception.ExceptionStackTest
*** FAILED **** : exception.ExceptionStackTest
Running test : exception.FinalizeStackTest
*** FAILED **** : exception.FinalizeStackTest
Running test : exception.NPE
*** FAILED **** : exception.NPE
Running test : gc.FinAlloc
*** FAILED **** : gc.FinAlloc
Running test : gc.Finalizer
*** FAILED **** : gc.Finalizer
Running test : gc.Force
*** FAILED **** : gc.Force
Running test : gc.Fragment
*** FAILED **** : gc.Fragment
Running test : gc.Free
*** FAILED **** : gc.Free
Running test : gc.LOS
*** FAILED **** : gc.LOS
Running test : gc.List
*** FAILED **** : gc.List
Running test : gc.NPE
*** FAILED **** : gc.NPE
Running test : gc.PhantomReferenceQueueTest
*** FAILED **** : gc.PhantomReferenceQueueTest
Running test : gc.PhantomReferenceTest
*** FAILED **** : gc.PhantomReferenceTest
Running test : gc.RefRemove
*** FAILED **** : gc.RefRemove
Running test : gc.RunFinalizersOnExitTest
*** FAILED **** : gc.RunFinalizersOnExitTest
Running test : gc.StressRef
*** FAILED **** : gc.StressRef
Running test : gc.SynchronizedFinilazersTest
*** FAILED **** : gc.SynchronizedFinilazersTest
Running test : gc.ThreadSuspension
*** FAILED **** : gc.ThreadSuspension
Running test : gc.WeakReferenceTest
*** FAILED **** : gc.WeakReferenceTest
Running test : init.ErrorInInitializer
*** FAILED **** : init.ErrorInInitializer
Running test : init.Other
*** FAILED **** : init.Other
Running test : io.ArrayList
*** FAILED **** : io.ArrayList
Running test : jni.LoadLibrary
*** FAILED **** : jni.LoadLibrary
Running test : outofmemory.Double
*** FAILED **** : outofmemory.Double
Running test : outofmemory.Int
*** FAILED **** : outofmemory.Int
Running test : outofmemory.Plain
*** FAILED **** : outofmemory.Plain
Running test : outofmemory.Ref
*** FAILED **** : outofmemory.Ref
Running test : outofmemory.Throw
*** FAILED **** : outofmemory.Throw
Running test : outofmemory.Vector
*** FAILED **** : outofmemory.Vector
Running test : outofmemory.VectorDouble
*** FAILED **** : outofmemory.VectorDouble
Running test : outofmemory.VectorInt
*** FAILED **** : outofmemory.VectorInt
Running test : outofmemory.VectorRef
*** FAILED **** : outofmemory.VectorRef
Running test : perf.CreateManyExceptions
*** FAILED **** : perf.CreateManyExceptions
Running test : perf.CreateManyExceptions_depth
*** FAILED **** : perf.CreateManyExceptions_depth
Running test : perf.MultiThreadsSimple
*** FAILED **** : perf.MultiThreadsSimple
Running test : perf.SeveralThreads
*** FAILED **** : perf.SeveralThreads
Running test : perf.StressCornerSize
*** FAILED **** : perf.StressCornerSize
Running test : perf.StressCornerSize_a
*** FAILED **** : perf.StressCornerSize_a
Running test : perf.ThrowMany
*** FAILED **** : perf.ThrowMany
Running test : perf.ThrowManyExceptions
*** FAILED **** : perf.ThrowManyExceptions
Running test : perf.ThrowManyExceptions_depth
*** FAILED **** : perf.ThrowManyExceptions_depth
Running test : perf.ThrowMany_depth
*** FAILED **** : perf.ThrowMany_depth
Running test : reflect.GetMethod
*** FAILED **** : reflect.GetMethod
Running test : shutdown.TestFatalError
*** FAILED **** : shutdown.TestFatalError
Running test : shutdown.TestLock
*** FAILED **** : shutdown.TestLock
Running test : shutdown.TestNativeAllocation
*** FAILED **** : shutdown.TestNativeAllocation
Running test : shutdown.TestWaitSet
*** FAILED **** : shutdown.TestWaitSet
Running test : stress.BigStringBuffer
*** FAILED **** : stress.BigStringBuffer
Running test : stress.Finalizer
*** FAILED **** : stress.Finalizer
Running test : stress.Mix
*** FAILED **** : stress.Mix
Running test : stress.Stack
*** FAILED **** : stress.Stack
Running test : stress.Sync
*** FAILED **** : stress.Sync
Running test : stress.Threads
*** FAILED **** : stress.Threads
Running test : stress.Vector
*** FAILED **** : stress.Vector
Running test : stress.WeakHashmapTest
*** FAILED **** : stress.WeakHashmapTest
Running test : thread.ExitShutdownHook
*** FAILED **** : thread.ExitShutdownHook
Running test : thread.InfiniteFinalizer
*** FAILED **** : thread.InfiniteFinalizer
Running test : thread.Sleep
*** FAILED **** : thread.Sleep
Running test : thread.ThreadInterrupt
*** FAILED **** : thread.ThreadInterrupt
Running test : thread.ThreadOOM
*** FAILED **** : thread.ThreadOOM
Running test : util.Date
*** FAILED **** : util.Date
Running test : util.DoPriveleged
*** FAILED **** : util.DoPriveleged
Running test : util.Prop
*** FAILED **** : util.Prop
Running test : util.StringIntern
*** FAILED **** : util.StringIntern
Please find test classes and results at C:\cruise\trunk\cc\projects\drlvm\trunk\build\win_ia32_msvc_debug\semis/vm/_smoke.tests/
The test report is in C:\cruise\trunk\cc\projects\drlvm\trunk\build\win_ia32_msvc_debug\semis\vm\_smoke.tests\reports\html\index.html

        ==================================
        Run kernel tests using jitrino.JET
        ==================================
             
Using exclude file = C:\cruise\trunk\cc\projects\drlvm\trunk\build\make\excludes\exclude.drlvm_kernel.windows.x86.jet
  
        
## These tests are too slow
java/lang/RuntimeAdditionalTest*.java

## These tests are unstable and hang often
java/lang/RuntimeAdditionalTest11.java
java/lang/RuntimeAdditionalTest34.java
java/lang/RuntimeAdditionalTest39.java
java/lang/RuntimeAdditionalTest40.java
java/lang/RuntimeAdditionalTest41.java
java/lang/RuntimeAdditionalTest42.java

# HARMONY-2453 
java/lang/SystemTest.java

        
Unknown option -XX:-vm.assert_dialog
Use java -help to get help on command line options

        ==================================
        Run kernel tests using jitrino.OPT
        ==================================
             
Using exclude file = C:\cruise\trunk\cc\projects\drlvm\trunk\build\make\excludes\exclude.drlvm_kernel.windows.x86.opt
  
        
## These tests are too slow
java/lang/RuntimeAdditionalTest*.java

## These tests are unstable and hang often
java/lang/RuntimeAdditionalTest11.java
java/lang/RuntimeAdditionalTest34.java
java/lang/RuntimeAdditionalTest39.java
java/lang/RuntimeAdditionalTest40.java
java/lang/RuntimeAdditionalTest41.java
java/lang/RuntimeAdditionalTest42.java

# HARMONY-2453 
java/lang/SystemTest.java

        
Unknown option -XX:-vm.assert_dialog
Use java -help to get help on command line options

        ==================================
        Run kernel tests using interpreter
        ==================================
             
Using exclude file = C:\cruise\trunk\cc\projects\drlvm\trunk\build\make\excludes\exclude.drlvm_kernel.windows.x86.int
  
        
## These tests are too slow
java/lang/RuntimeAdditionalTest*.java

## These tests are unstable and hang often
java/lang/RuntimeAdditionalTest11.java
java/lang/RuntimeAdditionalTest34.java
java/lang/RuntimeAdditionalTest39.java
java/lang/RuntimeAdditionalTest40.java
java/lang/RuntimeAdditionalTest41.java
java/lang/RuntimeAdditionalTest42.java

# HARMONY-2453 
java/lang/SystemTest.java

# HARMONY-3171
java/lang/ThreadRTest.java

        
Unknown option -XX:-vm.assert_dialog
Use java -help to get help on command line options
  ***************************
  *** Kernel tests status ***
  ***************************
      jitrino.JET FAILED
      jitrino.OPT FAILED
      interpreter FAILED
Please find detailed results under C:\cruise\trunk\cc\projects\drlvm\trunk\build\win_ia32_msvc_debug\semis\kernel.tests/reports
directory.

***********************************************************
Unit Tests: (160)
        
error: test classloader.ClassTestGetDeclaringClass_interpreter
error: test classloader.ClassTestGetDeclaringClass_jit
error: test classloader.ExceptionInInitializerTest_interpreter
error: test classloader.ExceptionInInitializerTest_jit
error: test classloader.LogLoader_interpreter
error: test classloader.LogLoader_jit
error: test classloader.NotFound_interpreter
error: test classloader.NotFound_jit
error: test exception.ExceptionStackTest_interpreter
error: test exception.ExceptionStackTest_jit
error: test exception.FinalizeStackTest_interpreter
error: test exception.FinalizeStackTest_jit
error: test exception.NPE_interpreter
error: test exception.NPE_jit
error: test gc.Finalizer_interpreter
error: test gc.Finalizer_jit
error: test gc.FinAlloc_interpreter
error: test gc.FinAlloc_jit
error: test gc.Force_interpreter
error: test gc.Force_jit
error: test gc.Fragment_interpreter
error: test gc.Fragment_jit
error: test gc.Free_interpreter
error: test gc.Free_jit
error: test gc.List_interpreter
error: test gc.List_jit
error: test gc.LOS_interpreter
error: test gc.LOS_jit
error: test gc.Mark_jit
error: test gc.NPE_interpreter
error: test gc.NPE_jit
error: test gc.PhantomReferenceQueueTest_interpreter
error: test gc.PhantomReferenceQueueTest_jit
error: test gc.PhantomReferenceTest_interpreter
error: test gc.PhantomReferenceTest_jit
error: test gc.RefRemove_interpreter
error: test gc.RefRemove_jit
error: test gc.RunFinalizersOnExitTest_interpreter
error: test gc.RunFinalizersOnExitTest_jit
error: test gc.StressRef_interpreter
error: test gc.StressRef_jit
error: test gc.SynchronizedFinilazersTest_interpreter
error: test gc.SynchronizedFinilazersTest_jit
error: test gc.ThreadSuspension_interpreter
error: test gc.ThreadSuspension_jit
error: test gc.WeakReferenceTest_interpreter
error: test gc.WeakReferenceTest_jit
error: test Hi_interpreter
error: test Hi_jit
error: test init.ErrorInInitializer_interpreter
error: test init.ErrorInInitializer_jit
error: test init.Other_interpreter
error: test init.Other_jit
error: test io.ArrayList_interpreter
error: test io.ArrayList_jit
error: test jni.LoadLibrary_interpreter
error: test jni.LoadLibrary_jit
error: test outofmemory.Double_interpreter
error: test outofmemory.Double_jit
error: test outofmemory.Int_interpreter
error: test outofmemory.Int_jit
error: test outofmemory.Plain_interpreter
error: test outofmemory.Plain_jit
error: test outofmemory.Ref_interpreter
error: test outofmemory.Ref_jit
error: test outofmemory.Throw_interpreter
error: test outofmemory.Throw_jit
error: test outofmemory.Vector_interpreter
error: test outofmemory.Vector_jit
error: test outofmemory.VectorDouble_interpreter
error: test outofmemory.VectorDouble_jit
error: test outofmemory.VectorInt_interpreter
error: test outofmemory.VectorInt_jit
error: test outofmemory.VectorRef_interpreter
error: test outofmemory.VectorRef_jit
error: test perf.CreateManyExceptions_depth_interpreter
error: test perf.CreateManyExceptions_depth_jit
error: test perf.CreateManyExceptions_interpreter
error: test perf.CreateManyExceptions_jit
error: test perf.MultiThreadsSimple_interpreter
error: test perf.MultiThreadsSimple_jit
error: test perf.SeveralThreads_interpreter
error: test perf.SeveralThreads_jit
error: test perf.StressCornerSize_a_interpreter
error: test perf.StressCornerSize_a_jit
error: test perf.StressCornerSize_interpreter
error: test perf.StressCornerSize_jit
error: test perf.ThrowMany_depth_interpreter
error: test perf.ThrowMany_depth_jit
error: test perf.ThrowMany_interpreter
error: test perf.ThrowMany_jit
error: test perf.ThrowManyExceptions_depth_interpreter
error: test perf.ThrowManyExceptions_depth_jit
error: test perf.ThrowManyExceptions_interpreter
error: test perf.ThrowManyExceptions_jit
error: test reflect.GetMethod_interpreter
error: test reflect.GetMethod_jit
error: test shutdown.TestFatalError_interpreter
error: test shutdown.TestFatalError_jit
error: test shutdown.TestLock_interpreter
error: test shutdown.TestLock_jit
error: test shutdown.TestNativeAllocation_interpreter
error: test shutdown.TestNativeAllocation_jit
error: test shutdown.TestWaitSet_interpreter
error: test shutdown.TestWaitSet_jit
error: test StackTest_interpreter
error: test StackTest_jit
error: test stress.BigStringBuffer_interpreter
error: test stress.BigStringBuffer_jit
error: test stress.Finalizer_interpreter
error: test stress.Finalizer_jit
error: test stress.Mix_interpreter
error: test stress.Mix_jit
error: test stress.Stack_interpreter
error: test stress.Stack_jit
error: test stress.Sync_interpreter
error: test stress.Sync_jit
error: test stress.Threads_interpreter
error: test stress.Threads_jit
error: test stress.Vector_interpreter
error: test stress.Vector_jit
error: test stress.WeakHashmapTest_interpreter
error: test stress.WeakHashmapTest_jit
error: test thread.ExitShutdownHook_interpreter
error: test thread.ExitShutdownHook_jit
error: test thread.InfiniteFinalizer_interpreter
error: test thread.InfiniteFinalizer_jit
error: test thread.Sleep_interpreter
error: test thread.Sleep_jit
error: test thread.ThreadInterrupt_interpreter
error: test thread.ThreadInterrupt_jit
error: test thread.ThreadOOM_interpreter
error: test thread.ThreadOOM_jit
error: test util.Date_interpreter
error: test util.Date_jit
error: test util.DoPriveleged_interpreter
error: test util.DoPriveleged_jit
error: test util.Prop_interpreter
error: test util.Prop_jit
error: test util.StringIntern_interpreter
error: test util.StringIntern_jit
Unit Test Error Details:	(141)
                
Test: testClass: classloader.ClassTestGetDeclaringClass_interpreter
Test: testClass: classloader.ClassTestGetDeclaringClass_jit
Test: testClass: classloader.ExceptionInInitializerTest_interpreter
Test: testClass: classloader.ExceptionInInitializerTest_jit
Test: testClass: classloader.LogLoader_interpreter
Test: testClass: classloader.LogLoader_jit
Test: testClass: classloader.NotFound_interpreter
Test: testClass: classloader.NotFound_jit
Test: testClass: exception.ExceptionStackTest_interpreter
Test: testClass: exception.ExceptionStackTest_jit
Test: testClass: exception.FinalizeStackTest_interpreter
Test: testClass: exception.FinalizeStackTest_jit
Test: testClass: exception.NPE_interpreter
Test: testClass: exception.NPE_jit
Test: testClass: gc.Finalizer_interpreter
Test: testClass: gc.Finalizer_jit
Test: testClass: gc.FinAlloc_interpreter
Test: testClass: gc.FinAlloc_jit
Test: testClass: gc.Force_interpreter
Test: testClass: gc.Force_jit
Test: testClass: gc.Fragment_interpreter
Test: testClass: gc.Fragment_jit
Test: testClass: gc.Free_interpreter
Test: testClass: gc.Free_jit
Test: testClass: gc.List_interpreter
Test: testClass: gc.List_jit
Test: testClass: gc.LOS_interpreter
Test: testClass: gc.LOS_jit
Test: testClass: gc.Mark_jit
Test: testClass: gc.NPE_interpreter
Test: testClass: gc.NPE_jit
Test: testClass: gc.PhantomReferenceQueueTest_interpreter
Test: testClass: gc.PhantomReferenceQueueTest_jit
Test: testClass: gc.PhantomReferenceTest_interpreter
Test: testClass: gc.PhantomReferenceTest_jit
Test: testClass: gc.RefRemove_interpreter
Test: testClass: gc.RefRemove_jit
Test: testClass: gc.RunFinalizersOnExitTest_interpreter
Test: testClass: gc.RunFinalizersOnExitTest_jit
Test: testClass: gc.StressRef_interpreter
Test: testClass: gc.StressRef_jit
Test: testClass: gc.SynchronizedFinilazersTest_interpreter
Test: testClass: gc.SynchronizedFinilazersTest_jit
Test: testClass: gc.ThreadSuspension_interpreter
Test: testClass: gc.ThreadSuspension_jit
Test: testClass: gc.WeakReferenceTest_interpreter
Test: testClass: gc.WeakReferenceTest_jit
Test: testClass: Hi_interpreter
Test: testClass: Hi_jit
Test: testClass: init.ErrorInInitializer_interpreter
Test: testClass: init.ErrorInInitializer_jit
Test: testClass: init.Other_interpreter
Test: testClass: init.Other_jit
Test: testClass: io.ArrayList_interpreter
Test: testClass: io.ArrayList_jit
Test: testClass: jni.LoadLibrary_interpreter
Test: testClass: jni.LoadLibrary_jit
Test: testClass: outofmemory.Double_interpreter
Test: testClass: outofmemory.Double_jit
Test: testClass: outofmemory.Int_interpreter
Test: testClass: outofmemory.Int_jit
Test: testClass: outofmemory.Plain_interpreter
Test: testClass: outofmemory.Plain_jit
Test: testClass: outofmemory.Ref_interpreter
Test: testClass: outofmemory.Ref_jit
Test: testClass: outofmemory.Throw_interpreter
Test: testClass: outofmemory.Throw_jit
Test: testClass: outofmemory.Vector_interpreter
Test: testClass: outofmemory.Vector_jit
Test: testClass: outofmemory.VectorDouble_interpreter
Test: testClass: outofmemory.VectorDouble_jit
Test: testClass: outofmemory.VectorInt_interpreter
Test: testClass: outofmemory.VectorInt_jit
Test: testClass: outofmemory.VectorRef_interpreter
Test: testClass: outofmemory.VectorRef_jit
Test: testClass: perf.CreateManyExceptions_depth_interpreter
Test: testClass: perf.CreateManyExceptions_depth_jit
Test: testClass: perf.CreateManyExceptions_interpreter
Test: testClass: perf.CreateManyExceptions_jit
Test: testClass: perf.MultiThreadsSimple_interpreter
Test: testClass: perf.MultiThreadsSimple_jit
Test: testClass: perf.SeveralThreads_interpreter
Test: testClass: perf.SeveralThreads_jit
Test: testClass: perf.StressCornerSize_a_interpreter
Test: testClass: perf.StressCornerSize_a_jit
Test: testClass: perf.StressCornerSize_interpreter
Test: testClass: perf.StressCornerSize_jit
Test: testClass: perf.ThrowMany_depth_interpreter
Test: testClass: perf.ThrowMany_depth_jit
Test: testClass: perf.ThrowMany_interpreter
Test: testClass: perf.ThrowMany_jit
Test: testClass: perf.ThrowManyExceptions_depth_interpreter
Test: testClass: perf.ThrowManyExceptions_depth_jit
Test: testClass: perf.ThrowManyExceptions_interpreter
Test: testClass: perf.ThrowManyExceptions_jit
Test: testClass: reflect.GetMethod_interpreter
Test: testClass: reflect.GetMethod_jit
Test: testClass: shutdown.TestFatalError_interpreter
Test: testClass: shutdown.TestFatalError_jit
Test: testClass: shutdown.TestLock_interpreter
Test: testClass: shutdown.TestLock_jit
Test: testClass: shutdown.TestNativeAllocation_interpreter
Test: testClass: shutdown.TestNativeAllocation_jit
Test: testClass: shutdown.TestWaitSet_interpreter
Test: testClass: shutdown.TestWaitSet_jit
Test: testClass: StackTest_interpreter
Test: testClass: StackTest_jit
Test: testClass: stress.BigStringBuffer_interpreter
Test: testClass: stress.BigStringBuffer_jit
Test: testClass: stress.Finalizer_interpreter
Test: testClass: stress.Finalizer_jit
Test: testClass: stress.Mix_interpreter
Test: testClass: stress.Mix_jit
Test: testClass: stress.Stack_interpreter
Test: testClass: stress.Stack_jit
Test: testClass: stress.Sync_interpreter
Test: testClass: stress.Sync_jit
Test: testClass: stress.Threads_interpreter
Test: testClass: stress.Threads_jit
Test: testClass: stress.Vector_interpreter
Test: testClass: stress.Vector_jit
Test: testClass: stress.WeakHashmapTest_interpreter
Test: testClass: stress.WeakHashmapTest_jit
Test: testClass: thread.ExitShutdownHook_interpreter
Test: testClass: thread.ExitShutdownHook_jit
Test: testClass: thread.InfiniteFinalizer_interpreter
Test: testClass: thread.InfiniteFinalizer_jit
Test: testClass: thread.Sleep_interpreter
Test: testClass: thread.Sleep_jit
Test: testClass: thread.ThreadInterrupt_interpreter
Test: testClass: thread.ThreadInterrupt_jit
Test: testClass: thread.ThreadOOM_interpreter
Test: testClass: thread.ThreadOOM_jit
Test: testClass: util.Date_interpreter
Test: testClass: util.Date_jit
Test: testClass: util.DoPriveleged_interpreter
Test: testClass: util.DoPriveleged_jit
Test: testClass: util.Prop_interpreter
Test: testClass: util.Prop_jit
Test: testClass: util.StringIntern_interpreter
Test: testClass: util.StringIntern_jit

***********************************************************
Modifications since last successful build:	(10)
            
modified varlax  /harmony/enhanced/drlvm/trunk/vm/vmcore/src/init/parse_arguments.cpp 02/16/2007
12:48:50 Partial fix to HARMONY-3184 [drlvm][netbeans] Aborting on RI-supported optionsAdded
handling of -XX:*, -client, -server  cmd-line options.
modified varlax  /harmony/enhanced/drlvm/trunk/vm/vmcore/src/class_support/C_Interface.cpp
02/16/2007 12:48:50 Partial fix to HARMONY-3184 [drlvm][netbeans] Aborting on RI-supported
optionsAdded handling of -XX:*, -client, -server  cmd-line options.
modified varlax  /harmony/enhanced/drlvm/trunk/build/make/targets/jvmti.test.xml 02/16/2007
12:48:50 Partial fix to HARMONY-3184 [drlvm][netbeans] Aborting on RI-supported optionsAdded
handling of -XX:*, -client, -server  cmd-line options.
modified varlax  /harmony/enhanced/drlvm/trunk/vm/include/open/vm.h 02/16/2007 12:48:50 Partial
fix to HARMONY-3184 [drlvm][netbeans] Aborting on RI-supported optionsAdded handling of -XX:*,
-client, -server  cmd-line options.
modified varlax  /harmony/enhanced/drlvm/trunk/vm/interpreter/interpreter.emconf 02/16/2007
12:48:50 Partial fix to HARMONY-3184 [drlvm][netbeans] Aborting on RI-supported optionsAdded
handling of -XX:*, -client, -server  cmd-line options.
modified varlax  /harmony/enhanced/drlvm/trunk/vm/vmcore/src/init/harmony.properties 02/16/2007
12:48:50 Partial fix to HARMONY-3184 [drlvm][netbeans] Aborting on RI-supported optionsAdded
handling of -XX:*, -client, -server  cmd-line options.
modified varlax  /harmony/enhanced/drlvm/trunk/build/make/targets/smoke.test.xml 02/16/2007
12:48:50 Partial fix to HARMONY-3184 [drlvm][netbeans] Aborting on RI-supported optionsAdded
handling of -XX:*, -client, -server  cmd-line options.
modified varlax  /harmony/enhanced/drlvm/trunk/vm/em/src/DrlEMImpl.cpp 02/16/2007 12:48:50
Partial fix to HARMONY-3184 [drlvm][netbeans] Aborting on RI-supported optionsAdded handling
of -XX:*, -client, -server  cmd-line options.
modified varlax  /harmony/enhanced/drlvm/trunk/build/make/targets/kernel.test.xml 02/16/2007
12:48:50 Partial fix to HARMONY-3184 [drlvm][netbeans] Aborting on RI-supported optionsAdded
handling of -XX:*, -client, -server  cmd-line options.
modified varlax  /harmony/enhanced/drlvm/trunk/vm/vmcore/src/init/vm_properties.cpp 02/16/2007
12:48:50 Partial fix to HARMONY-3184 [drlvm][netbeans] Aborting on RI-supported optionsAdded
handling of -XX:*, -client, -server  cmd-line options.

Mime
View raw message