harmony-alerts mailing list archives

Site index · List index
Message view « Date » · « Thread »
Top « Date » · « Thread »
From nom...@hursley.ibm.com
Subject [continuum] BUILD FAILURE: Classlib/linux.ia32 Build/Test
Date Tue, 13 Feb 2007 17:22:09 GMT
Online report : http://people.apache.org/~hindessm/continuum/classlib/linux.ia32/2007/02/13/20070213-172209.failure.log.gz
Build statistics:
  State: Failed
  Previous State: Failed
  Started at: Tue, 13 Feb 2007 16:08:03 +0000
  Finished at: Tue, 13 Feb 2007 17:22:07 +0000
  Total time: 1h 14m 3s
  Build Trigger: Schedule
  Exit code: 1
  Building machine hostname: hy2
  Operating system : Linux(unknown)
  Java version : 1.5.0_06(Sun Microsystems Inc.)

Changes
                            classlib/depends/build/defines.mk
            classlib/depends/build/defines.mak
            classlib/modules/text/src/main/native/text/unix/makefile
            classlib/modules/text/src/main/native/text/windows/makefile
            classlib/modules/swing/src/test/api/java/common/javax/swing/JTreeTest.java
            classlib/modules/swing/src/test/api/java/common/javax/swing/ImageIconTest.java
            classlib/modules/swing/src/main/java/common/javax/swing/JTree.java
            classlib/modules/swing/src/main/java/common/javax/swing/ImageIcon.java
            classlib/modules/swing/src/main/java/common/javax/swing/JTextField.java
            classlib/modules/swing/src/main/java/common/javax/swing/text/html/parser/AttributeList.java
            classlib/modules/swing/src/main/java/common/javax/swing/text/html/parser/HTMLTagType.java
            classlib/modules/swing/src/main/java/common/javax/swing/text/html/parser/DTDUtilities.java
            classlib/modules/swing/src/main/java/common/javax/swing/text/html/parser/HTMLText.java
            classlib/modules/swing/src/main/java/common/javax/swing/text/html/parser/Entity.java
            classlib/modules/swing/src/main/java/common/javax/swing/text/html/parser/Lexer.java
            classlib/modules/swing/src/main/java/common/javax/swing/text/html/parser/EntitiesHandler.java
            classlib/modules/swing/src/main/java/common/javax/swing/text/html/parser/ParserDelegator.java
            classlib/modules/swing/src/main/java/common/javax/swing/text/html/parser/HTMLAttributeList.java
            classlib/modules/swing/src/main/java/common/javax/swing/text/html/parser/ParserSym.java
            classlib/modules/swing/src/main/java/common/javax/swing/text/html/parser/HTMLComment.java
            classlib/modules/swing/src/main/java/common/javax/swing/text/html/parser/transitional401.bdtd
            classlib/modules/swing/src/main/java/common/javax/swing/text/html/parser/ParserHandler.java
            classlib/modules/swing/src/main/java/common/javax/swing/text/html/parser/ContentModel.java
            classlib/modules/swing/src/main/java/common/javax/swing/text/html/parser/DocumentParser.java
            classlib/modules/swing/src/main/java/common/javax/swing/text/html/parser/Asn1Dtd.java
            classlib/modules/swing/src/main/java/common/javax/swing/text/html/parser/Asn1Entity.java
            classlib/modules/swing/src/main/java/common/javax/swing/text/html/parser/HTMLTag.java
            classlib/modules/swing/src/main/java/common/javax/swing/text/html/parser/HTMLConstants.java
            classlib/modules/swing/src/main/java/common/javax/swing/text/html/parser/ParserCup.java
            classlib/modules/swing/src/main/java/common/javax/swing/text/html/parser/html32.bdtd
            classlib/modules/swing/src/main/java/common/javax/swing/text/html/parser/DTDConstants.java
            classlib/modules/swing/src/main/java/common/javax/swing/text/html/parser/Asn1Attributes.java
            classlib/modules/swing/src/main/java/common/javax/swing/text/html/parser/ElementsHandler.java
            classlib/modules/swing/src/main/java/common/javax/swing/text/html/parser/DTD.java
            classlib/modules/swing/src/main/java/common/javax/swing/text/html/parser/Asn1Element.java
            classlib/modules/swing/src/main/java/common/javax/swing/text/html/parser/Asn1ContentModel.java
            classlib/modules/swing/src/main/java/common/javax/swing/text/html/parser/HTMLErrorType.java
            classlib/modules/swing/src/main/java/common/javax/swing/text/html/parser/HTMLMarkup.java
            classlib/modules/swing/src/main/java/common/javax/swing/text/html/parser/TagElement.java
            classlib/modules/swing/src/main/java/common/javax/swing/text/html/parser/LexerTextType.java
            classlib/modules/swing/src/main/java/common/javax/swing/text/html/parser/LexerTextStateType.java
            classlib/modules/swing/src/main/java/common/javax/swing/text/html/parser/Element.java
            classlib/modules/swing/src/main/java/common/javax/swing/text/html/parser/Pair.java
            classlib/modules/swing/src/main/java/common/javax/swing/text/html/parser/HTMLObject.java
            classlib/modules/swing/src/main/java/common/javax/swing/text/html/parser/Parser.java
            classlib/modules/swing/src/main/java/common/javax/swing/undo/AbstractUndoableEdit.java
            classlib/modules/swing/src/main/java/common/javax/swing/undo/CompoundEdit.java
            classlib/modules/swing/src/main/java/common/javax/swing/plaf/basic/BasicListUI.java
            classlib/modules/swing/build.xml
            classlib/modules/auth/src/main/native/auth/unix/makefile
            classlib/modules/auth/src/main/native/auth/windows/makefile
            classlib/modules/regex/src/test/java/org/apache/harmony/tests/java/util/regex/MatcherTest.java
            classlib/modules/regex/src/main/java/java/util/regex/AbstractCharClass.java
            classlib/modules/archive/src/main/native/archive/unix/makefile
            classlib/modules/archive/src/main/native/archive/windows/makefile
            classlib/modules/misc/src/main/native/accessors/unix/makefile
            classlib/modules/misc/src/main/native/accessors/windows/makefile
            classlib/modules/awt/src/test/api/java/common/java/awt/ComponentTest.java
            classlib/modules/awt/src/main/java/common/java/awt/Window.java
            classlib/modules/awt/src/main/java/common/java/awt/Font.java
            classlib/modules/awt/src/main/java/common/java/awt/Button.java
            classlib/modules/awt/src/main/java/common/java/awt/Component.java
            classlib/modules/awt/src/main/java/common/java/awt/Label.java
            classlib/modules/awt/src/main/native/gl/unix/makefile
            classlib/modules/awt/src/main/native/gl/windows/makefile
            classlib/modules/awt/src/main/native/oglwrapper/unix/makefile
            classlib/modules/awt/src/main/native/oglwrapper/windows/makefile
            classlib/modules/awt/src/main/native/win32wrapper/windows/makefile
            classlib/modules/awt/src/main/native/winfont/windows/makefile
            classlib/modules/awt/src/main/native/linuxfont/unix/makefile
            classlib/modules/awt/src/main/native/lcmm/unix/makefile
            classlib/modules/awt/src/main/native/lcmm/windows/makefile
            classlib/modules/awt/src/main/native/x11wrapper/unix/makefile
            classlib/modules/awt/src/main/native/jpegdecoder/unix/makefile
            classlib/modules/awt/src/main/native/jpegdecoder/windows/makefile
            classlib/modules/awt/make/exclude.common
            classlib/modules/luni/src/main/native/launcher/unix/makefile
            classlib/modules/luni/src/main/native/launcher/shared/cmain.c
            classlib/modules/luni/src/main/native/launcher/windows/makefile.javae
            classlib/modules/luni/src/main/native/launcher/windows/makefile.javaw
            classlib/modules/luni/src/main/native/include/shared/jsig.h
            classlib/modules/luni/src/main/native/luni/unix/makefile
            classlib/modules/luni/src/main/native/luni/windows/makefile
            classlib/modules/imageio/src/main/native/jpegencoder/unix/makefile
            classlib/modules/imageio/src/main/native/jpegencoder/windows/makefile
            classlib/modules/portlib/src/test/native/hytime/unix/makefile
            classlib/modules/portlib/src/test/native/hytime/windows/makefile
            classlib/modules/portlib/src/test/native/hyfile/unix/makefile
            classlib/modules/portlib/src/test/native/hyfile/windows/makefile
            classlib/modules/portlib/src/test/native/init/unix/makefile
            classlib/modules/portlib/src/test/native/init/windows/makefile
            classlib/modules/portlib/src/test/native/hyerror/unix/makefile
            classlib/modules/portlib/src/test/native/hyerror/windows/makefile
            classlib/modules/portlib/src/main/native/sig/unix/makefile
            classlib/modules/portlib/src/main/native/sig/windows/makefile
            classlib/modules/portlib/src/main/native/include/shared/hyport.h
            classlib/modules/portlib/src/main/native/port/unix/hyosdump.c
            classlib/modules/portlib/src/main/native/port/unix/hyfiletext.c
            classlib/modules/portlib/src/main/native/port/unix/makefile
            classlib/modules/portlib/src/main/native/port/shared/hynls.c
            classlib/modules/portlib/src/main/native/port/shared/hyexit.c
            classlib/modules/portlib/src/main/native/port/shared/hyport.c
            classlib/modules/portlib/src/main/native/port/shared/portpriv.h
            classlib/modules/portlib/src/main/native/port/windows/hyfiletext.c
            classlib/modules/portlib/src/main/native/port/windows/makefile
            classlib/modules/portlib/src/main/native/common/windows/makefile
            classlib/modules/portlib/src/main/native/pool/windows/makefile
            classlib/modules/portlib/build.xml
            classlib/make/properties.xml
        
****************************************************************************
Output:
****************************************************************************
Buildfile: build.xml

svn-prop:

build:
   [delete] Deleting directory /home/hybld/continuum-working-directory/6/classlib/deploy
     [echo] Classlib revision is 507074
     [echo] Post process: true
     [echo] JAPI: true
     [echo] Building with reference jdk/javac
     [exec] Buildfile: build.xml

     [exec] -init-hdk-for-clean:
     [exec]     [mkdir] Created dir: /home/hybld/continuum-working-directory/6/classlib/deploy/build/ant
     [exec]      [copy] Copying 1 file to /home/hybld/continuum-working-directory/6/classlib/deploy/build/ant

...

     [exec]     [junit] Tests run: 12, Failures: 0, Errors: 0, Time elapsed: 0.011 sec
     [exec]     [junit] Tests run: 1, Failures: 0, Errors: 0, Time elapsed: 0.004 sec
     [exec]     [junit] Tests run: 3, Failures: 0, Errors: 0, Time elapsed: 0.017 sec
     [exec]     [junit] Tests run: 45, Failures: 5, Errors: 0, Time elapsed: 65.945 sec
     [exec]     [junit] TEST java.awt.ComponentTest FAILED
     [exec]     [junit] Tests run: 6, Failures: 0, Errors: 0, Time elapsed: 0.016 sec
     [exec]     [junit] Tests run: 1, Failures: 0, Errors: 0, Time elapsed: 0.008 sec
     [exec]     [junit] Read /home/hybld/continuum-working-directory/6/classlib/modules/awt/bin/test/java/awt/serialization/java.awt.Dimension[width=0,height=0]
     [exec]     [junit] Read /home/hybld/continuum-working-directory/6/classlib/modules/awt/bin/test/java/awt/serialization/java.awt.Dimension[width=1,height=2]
     [exec]     [junit] Write /home/hybld/continuum-working-directory/6/classlib/modules/awt/bin/test/java/awt/serialization/java.awt.Dimension[width=0,height=0].actual

...

     [exec]     [junit] Tests run: 4, Failures: 0, Errors: 0, Time elapsed: 0.004 sec
     [exec]     [junit] Tests run: 1, Failures: 0, Errors: 0, Time elapsed: 0.106 sec
     [exec]     [junit] Tests run: 2, Failures: 0, Errors: 0, Time elapsed: 0.004 sec
     [exec]     [junit] Tests run: 1, Failures: 0, Errors: 0, Time elapsed: 0.003 sec
     [exec]     [junit] Tests FAILED

     [exec] touch-failures-file:

     [exec] touch-errors-file:


...

     [exec]      [exec] -Xlinker -rpath-link -Xlinker /home/hybld/continuum-working-directory/6/classlib/deploy/jdk/jre/bin

     [exec] -run-native-tests:
     [exec]      [exec] Result: 1
     [exec]      [echo] init: FAILED
     [exec]      [exec] Result: 1
     [exec]      [echo] hyerror: FAILED
     [exec]      [exec] Result: 1
     [exec]      [echo] hytime: FAILED
     [exec]      [exec] Result: 1
     [exec]      [echo] hyfile: FAILED

     [exec] touch-errors-file:

     [exec] -test-module:


...

     [exec]     [junit] Tests run: 25, Failures: 0, Errors: 0, Time elapsed: 1.043 sec
     [exec]     [junit] Tests run: 8, Failures: 0, Errors: 0, Time elapsed: 0.016 sec
     [exec]     [junit] Tests run: 14, Failures: 0, Errors: 0, Time elapsed: 0.99 sec
     [exec]     [junit] Tests run: 21, Failures: 10, Errors: 0, Time elapsed: 101.545 sec
     [exec]     [junit] TEST javax.swing.JSpinnerTest FAILED
     [exec]     [junit] Tests run: 2, Failures: 2, Errors: 0, Time elapsed: 20.008 sec
     [exec]     [junit] TEST javax.swing.JTabbedPaneRTest FAILED
     [exec]     [junit] Tests run: 1, Failures: 0, Errors: 1, Time elapsed: 0 sec
     [exec]     [junit] Tests FAILED (timeout)

     [exec] touch-failures-file:

     [exec] touch-errors-file:


...

     [exec] gen-report:

     [exec] check-test-result:

     [exec] BUILD FAILED
     [exec] /home/hybld/continuum-working-directory/6/classlib/build.xml:167: The following
error occurred while executing this line:
     [exec] /home/hybld/continuum-working-directory/6/classlib/make/build-test.xml:133: There
were test crashes: /home/hybld/continuum-working-directory/6/classlib/build/test_report/TEST-javax.swing.JTabbedPaneTest.xml

     [exec] Total time: 56 minutes 37 seconds
     [exec] Result: 1
     [echo] Tests.failed is set to true

japi:

     [exec] Processing class java.lang,Object:+
     [exec] Processing package java.lang,:=============================================================================+-++++++++++++++++++++++++-+++++++++++++++++++++++++++++++++++++++++++++++++--^+^+++++++++--++++++++++

...

     [exec] Processing package java.lang.management,:=============================================================================++++-+++++++++++
     [exec] Processing package java.lang.ref,:=============================================================================+++++
     [exec] Processing package java.lang.reflect,:=============================================================================+++++++++++++++++++++
     [exec] Processing class ,java:
     [exec] Failed to Japize java: java.lang.RuntimeException: NoClassDefFoundError: java
     [exec] java.lang.RuntimeException: NoClassDefFoundError: java
     [exec] 	at net.wuffies.japi.ClassFile.forName(ClassFile.java:163)
     [exec] 	at net.wuffies.japi.Japize.getClassWrapper(Japize.java:1425)
     [exec] 	at net.wuffies.japi.Japize.japizeClass(Japize.java:748)
     [exec] 	at net.wuffies.japi.Japize.processClass(Japize.java:516)

...

     [exec] 	at net.wuffies.japi.Japize.doJapize(Japize.java:443)
     [exec] 	at net.wuffies.japi.Japize.main(Japize.java:316)

     [exec] Processing class ,javax:
     [exec] Failed to Japize javax: java.lang.RuntimeException: NoClassDefFoundError: javax
     [exec] java.lang.RuntimeException: NoClassDefFoundError: javax
     [exec] 	at net.wuffies.japi.ClassFile.forName(ClassFile.java:163)
     [exec] 	at net.wuffies.japi.Japize.getClassWrapper(Japize.java:1425)
     [exec] 	at net.wuffies.japi.Japize.japizeClass(Japize.java:748)
     [exec] 	at net.wuffies.japi.Japize.processClass(Japize.java:516)

...

     [exec] 	at net.wuffies.japi.Japize.doJapize(Japize.java:443)
     [exec] 	at net.wuffies.japi.Japize.main(Japize.java:316)

     [exec] Processing class ,org:
     [exec] Failed to Japize org: java.lang.RuntimeException: NoClassDefFoundError: org
     [exec] java.lang.RuntimeException: NoClassDefFoundError: org
     [exec] 	at net.wuffies.japi.ClassFile.forName(ClassFile.java:163)
     [exec] 	at net.wuffies.japi.Japize.getClassWrapper(Japize.java:1425)
     [exec] 	at net.wuffies.japi.Japize.japizeClass(Japize.java:748)
     [exec] 	at net.wuffies.japi.Japize.processClass(Japize.java:516)

...

update-index:

test-result:

BUILD FAILED
/home/hybld/continuum-working-directory/6/build.xml:203: There were test errors.

Total time: 74 minutes 2 seconds

****************************************************************************

...

Mime
View raw message