harmony-alerts mailing list archives

Site index · List index
Message view « Date » · « Thread »
Top « Date » · « Thread »
From nom...@intel.com
Subject [build-test alert] BUILD FAILED Linux SUSE 9 64bit gcc debug: classlib over drlvm
Date Fri, 09 Feb 2007 08:30:41 GMT
BUILD FAILED:
	Ant Error Message:
/export/cruise/trunk/cc/projects/classlib/trunk/build.xml:167: The following error occurred
while executing this line: /export/cruise/trunk/cc/projects/classlib/trunk/make/build-test.xml:138:
There were test errors.

Date of build:	02/09/2007 12:07:35
Time to build:	142 minutes 38 seconds
Last changed:	02/09/2007 11:12:56
Last log entry:	drlvm

***********************************************************
Errors/Warnings:	(317)
            

========================================
Testing class libraries...
========================================
Checking for depends/jars/yoko_M2-20070130/yoko.jar
Checking for depends/jars/yoko_M2-20070130/yoko-core.jar
Checking for depends/jars/yoko_M2-20070130/yoko-rmi-impl.jar
Checking for depends/jars/yoko_M2-20070130/yoko-rmi-spec.jar
Checking for depends/jars/bcel-5.2/bcel-5.2.jar
Checking for depends/jars/xalan-j_2.7.0/xalan.jar
Checking for depends/jars/xerces_2.8.0/resolver.jar
Checking for depends/jars/xerces_2.8.0/xercesImpl.jar
Checking for depends/jars/xerces_2.8.0/xml-apis.jar
Checking for depends/jars/junit_3.8.2/junit.jar
Checking for depends/jars/bcprov-jdk15-134/bcprov.jar
Checking for depends/jars/icu4j_3.4.4/icu4j_3_4_4.jar
Checking for depends/jars/mx4j_3.0.1/mx4j.jar
Checking for depends/jars/mx4j_3.0.1/mx4j-remote.jar
Checking for depends/jars/ecj_3.2/ecj_3.2.jar
Checking for depends/jars/jetty/jetty-6.0.0.jar
Checking for depends/jars/jetty/jetty-util-6.0.0.jar
Checking for depends/jars/jetty/servlet-api-2.5-6.0.0.jar
Checking for depends/libs/build/lcms/icc34.h
Checking for depends/libs/build/lcms/lcms.h
Checking for depends/libs/build/png/pngconf.h
Checking for depends/libs/build/png/png.h
Checking for depends/libs/build/jpeg/jconfig.lnx
Checking for depends/libs/build/jpeg/jpeglib.h
Checking for depends/libs/build/jpeg/jmorecfg.h
Checking for depends/libs/build/jpeg/jerror.h
Checking for depends/libs/build/lcms/liblcms.linux.x86_64
Checking for depends/libs/build/png/libpng.linux.x86_64
Checking for depends/libs/build/jpeg/libjpeg.linux.x86_64
Since fork is false, ignoring memoryMaximumSize setting
Compiling ACCESSIBILITY classes
Compiling ACCESSIBILITY tests
Since fork is false, ignoring memoryMaximumSize setting
Compiling ANNOTATION classes
Compiling ANNOTATION tests
Since fork is false, ignoring memoryMaximumSize setting
Compiling APPLET classes
Compiling APPLET tests
Since fork is false, ignoring memoryMaximumSize setting
Compiling ARCHIVE classes
Compiling ARCHIVE tests
Since fork is false, ignoring memoryMaximumSize setting
Compiling AUTH classes
Compiling AUTH tests
Since fork is false, ignoring memoryMaximumSize setting
Compiling AWT classes
Compiling AWT tests
Since fork is false, ignoring memoryMaximumSize setting
java.lang.RuntimeException: expected from EDT
	at java.awt.EventDispatchThreadRTest$1.run(EventDispatchThreadRTest.java:29)
	at java.awt.event.InvocationEvent.runAndNotify(InvocationEvent.java:98)
	at java.awt.event.InvocationEvent.dispatch(InvocationEvent.java:77)
	at java.awt.EventQueueCore.dispatchEventImpl(EventQueueCore.java:138)
	at java.awt.EventQueue.dispatchEvent(EventQueue.java:144)
	at java.awt.EventDispatchThread.runModalLoop(EventDispatchThread.java:73)
	at java.awt.EventDispatchThread.run(EventDispatchThread.java:45)
Compiling BEANS classes
Compiling support classes for BEANS tests
Compiling internal BEANS tests
Compiling BEANS tests
Since fork is false, ignoring memoryMaximumSize setting
Running internal BEANS tests
Running BEANS tests
Compiling CRYPTO classes
Compiling CRYPTO test support files
Since fork is false, ignoring memoryMaximumSize setting
Compiling CRYPTO api tests
Since fork is false, ignoring memoryMaximumSize setting
Compiling CRYPTO api injected tests
Since fork is false, ignoring memoryMaximumSize setting
Compiling CRYPTO impl injected tests
Since fork is false, ignoring memoryMaximumSize setting
Compiling CRYPTO impl tests
Since fork is false, ignoring memoryMaximumSize setting
Running CRYPTO api tests
Running CRYPTO api.injected tests
Running CRYPTO impl tests
Running CRYPTO impl injected tests
Compiling ImageIO classes
Compiling ImageIO tests
Compiling INSTRUMENT classes
Compiling INSTRUMENT tests
Since fork is false, ignoring memoryMaximumSize setting
Compiling JNDI classes
Compiling JNDI tests
Since fork is false, ignoring memoryMaximumSize setting
Compiling LANG-MANAGEMENT classes
Compiling LANG-MANAGEMENT API tests
Compiling LANG-MANAGEMENT Implementation tests
Compiling LOGGING classes
Compiling LOGGING tests
Since fork is false, ignoring memoryMaximumSize setting
Feb 9, 2007 12:39:10 PM org.apache.harmony.logging.tests.java.util.logging.LogRecordTest testGetSourceDefaultValue
SEVERE: test msg, pls. ignore itb
Feb 9, 2007 12:39:11 PM null null
SEVERE: test msg, pls. ignore itb
Feb 9, 2007 12:39:11 PM null null
SEVERE: test msg, pls. ignore itb
Feb 9, 2007 12:39:11 PM className null
SEVERE: test msg, pls. ignore itb
Feb 9, 2007 12:39:11 PM org.apache.harmony.logging.tests.java.util.logging.LogRecordTest testGetSourceDefaultValue
SEVERE: test msg, pls. ignore itb
Feb 9, 2007 12:39:11 PM org.apache.harmony.logging.tests.java.util.logging.LogRecordTest$RecordFactory
log
SEVERE: test msg, pls. ignore itb
Feb 9, 2007 12:39:11 PM null null
SEVERE: test msg, pls. ignore itb
Compiling LUNI classes
Compiling LUNI JUnit Tests
Since fork is false, ignoring memoryMaximumSize setting
Running LUNI JUnit Tests
java.io.IOException: Stream is closed
	at java.io.BufferedInputStream.read(BufferedInputStream.java:247)
	at java.io.FilterInputStream.read(FilterInputStream.java:137)
	at tests.support.Support_Exec$2.run(Support_Exec.java:199)
	at java.lang.Thread.run(Thread.java:661)
Compiling MATH classes
Compiling MATH tests
Since fork is false, ignoring memoryMaximumSize setting
Compiling MISC classes
Compiling MISC tests
Since fork is false, ignoring memoryMaximumSize setting
Compiling NIO classes
Compiling NIO tests
Since fork is false, ignoring memoryMaximumSize setting
Compiling NIO_CHAR classes
Compiling NIO_CHAR tests
Since fork is false, ignoring memoryMaximumSize setting
Cannot find unmappable byte array for US-ASCII
Cannot find unmappable byte array for gb18030
Cannot find unmappable byte array for ISO-8859-1
Cannot find malform byte array for ISO-8859-1
Cannot find unmappable byte array for UTF-16BE
Cannot find malform byte array for UTF-16BE
Cannot find unmappable byte array for UTF-16LE
Cannot find malform byte array for UTF-16LE
Cannot find unmappable byte array for UTF-8
Compiling PACK200 classes
Compiling PACK200 tests
Since fork is false, ignoring memoryMaximumSize setting
Running PACK200 tests
Compiling PREFS classes
Compiling PREFS tests
Since fork is false, ignoring memoryMaximumSize setting
Compiling PRINT classes
Compiling Print tests
Since fork is false, ignoring memoryMaximumSize setting
java.net.ConnectException: localhost/127.0.0.1:631 - Connection refused
	at org.apache.harmony.luni.net.PlainSocketImpl.connect(PlainSocketImpl.java:229)
	at org.apache.harmony.luni.net.PlainSocketImpl.connect(PlainSocketImpl.java:508)
	at java.net.Socket.connect(Socket.java:932)
	at org.apache.harmony.luni.internal.net.www.protocol.http.HttpURLConnection.getHTTPConnection(HttpURLConnection.java:636)
	at org.apache.harmony.luni.internal.net.www.protocol.http.HttpURLConnection.connect(HttpURLConnection.java:617)
	at org.apache.harmony.x.print.ipp.IppClient.request(IppClient.java:111)
	at org.apache.harmony.x.print.ipp.IppClient.request(IppClient.java:87)
	at org.apache.harmony.x.print.cups.CUPSPrintServiceProvider.findDefaultPrintService(CUPSPrintServiceProvider.java:471)
	at org.apache.harmony.x.print.cups.CUPSPrintServiceProvider.getDefaultPrintService(CUPSPrintServiceProvider.java:168)
	at javax.print.PrintServiceLookup.lookupDefaultPrintService(PrintServiceLookup.java:138)
	at javax.print.attribute.HashAttributeTest.testAdd2(HashAttributeTest.java)
	at java.lang.reflect.VMReflection.invokeMethod(VMReflection.java)
	at java.lang.reflect.Method.invoke(Method.java:381)
	at junit.framework.TestCase.runTest(TestCase.java:154)
	at junit.framework.TestCase.runBare(TestCase.java:125)
	at junit.framework.TestResult$1.protect(TestResult.java:106)
	at junit.framework.TestResult.runProtected(TestResult.java)
	at junit.framework.TestResult.run(TestResult.java:104)
	at junit.framework.TestCase.run(TestCase.java)
	at junit.framework.TestSuite.runTest(TestSuite.java)
	at junit.framework.TestSuite.run(TestSuite.java:202)
	at org.apache.tools.ant.taskdefs.optional.junit.JUnitTestRunner.run(JUnitTestRunner.java:297)
	at org.apache.tools.ant.taskdefs.optional.junit.JUnitTestRunner.launch(JUnitTestRunner.java:670)
	at org.apache.tools.ant.taskdefs.optional.junit.JUnitTestRunner.main(JUnitTestRunner.java:567)
java.net.ConnectException: localhost/127.0.0.1:631 - Connection refused
	at org.apache.harmony.luni.net.PlainSocketImpl.connect(PlainSocketImpl.java:229)
	at org.apache.harmony.luni.net.PlainSocketImpl.connect(PlainSocketImpl.java:508)
	at java.net.Socket.connect(Socket.java:932)
	at org.apache.harmony.luni.internal.net.www.protocol.http.HttpURLConnection.getHTTPConnection(HttpURLConnection.java:636)
	at org.apache.harmony.luni.internal.net.www.protocol.http.HttpURLConnection.connect(HttpURLConnection.java:617)
	at org.apache.harmony.x.print.ipp.IppClient.request(IppClient.java:111)
	at org.apache.harmony.x.print.ipp.IppClient.request(IppClient.java:87)
	at org.apache.harmony.x.print.cups.CUPSPrintServiceProvider.findDefaultPrintService(CUPSPrintServiceProvider.java:471)
	at org.apache.harmony.x.print.cups.CUPSPrintServiceProvider.getDefaultPrintService(CUPSPrintServiceProvider.java:168)
	at javax.print.PrintServiceLookup.lookupDefaultPrintService(PrintServiceLookup.java:138)
	at javax.print.attribute.HashAttributeTest.testEquals(HashAttributeTest.java:283)
	at java.lang.reflect.VMReflection.invokeMethod(VMReflection.java)
	at java.lang.reflect.Method.invoke(Method.java:381)
	at junit.framework.TestCase.runTest(TestCase.java:154)
	at junit.framework.TestCase.runBare(TestCase.java:125)
	at junit.framework.TestResult$1.protect(TestResult.java:106)
	at junit.framework.TestResult.runProtected(TestResult.java)
	at junit.framework.TestResult.run(TestResult.java:104)
	at junit.framework.TestCase.run(TestCase.java)
	at junit.framework.TestSuite.runTest(TestSuite.java)
	at junit.framework.TestSuite.run(TestSuite.java:202)
	at org.apache.tools.ant.taskdefs.optional.junit.JUnitTestRunner.run(JUnitTestRunner.java:297)
	at org.apache.tools.ant.taskdefs.optional.junit.JUnitTestRunner.launch(JUnitTestRunner.java:670)
	at org.apache.tools.ant.taskdefs.optional.junit.JUnitTestRunner.main(JUnitTestRunner.java:567)
java.net.ConnectException: localhost/127.0.0.1:631 - Connection refused
	at org.apache.harmony.luni.net.PlainSocketImpl.connect(PlainSocketImpl.java:229)
	at org.apache.harmony.luni.net.PlainSocketImpl.connect(PlainSocketImpl.java:508)
	at java.net.Socket.connect(Socket.java:932)
	at org.apache.harmony.luni.internal.net.www.protocol.http.HttpURLConnection.getHTTPConnection(HttpURLConnection.java:636)
	at org.apache.harmony.luni.internal.net.www.protocol.http.HttpURLConnection.connect(HttpURLConnection.java:617)
	at org.apache.harmony.x.print.ipp.IppClient.request(IppClient.java:111)
	at org.apache.harmony.x.print.ipp.IppClient.request(IppClient.java:87)
	at org.apache.harmony.x.print.cups.CUPSPrintServiceProvider.findDefaultPrintService(CUPSPrintServiceProvider.java:471)
	at org.apache.harmony.x.print.cups.CUPSPrintServiceProvider.getDefaultPrintService(CUPSPrintServiceProvider.java:168)
	at javax.print.PrintServiceLookup.lookupDefaultPrintService(PrintServiceLookup.java:138)
	at javax.print.attribute.HashAttributeTest.testAdd2(HashAttributeTest.java)
	at java.lang.reflect.VMReflection.invokeMethod(VMReflection.java)
	at java.lang.reflect.Method.invoke(Method.java:381)
	at junit.framework.TestCase.runTest(TestCase.java:154)
	at junit.framework.TestCase.runBare(TestCase.java:125)
	at junit.framework.TestResult$1.protect(TestResult.java:106)
	at junit.framework.TestResult.runProtected(TestResult.java)
	at junit.framework.TestResult.run(TestResult.java:104)
	at junit.framework.TestCase.run(TestCase.java)
	at junit.framework.TestSuite.runTest(TestSuite.java)
	at junit.framework.TestSuite.run(TestSuite.java:202)
	at junit.framework.TestSuite.runTest(TestSuite.java)
	at junit.framework.TestSuite.run(TestSuite.java:202)
	at org.apache.tools.ant.taskdefs.optional.junit.JUnitTestRunner.run(JUnitTestRunner.java:297)
	at org.apache.tools.ant.taskdefs.optional.junit.JUnitTestRunner.launch(JUnitTestRunner.java:670)
	at org.apache.tools.ant.taskdefs.optional.junit.JUnitTestRunner.main(JUnitTestRunner.java:567)
java.net.ConnectException: localhost/127.0.0.1:631 - Connection refused
	at org.apache.harmony.luni.net.PlainSocketImpl.connect(PlainSocketImpl.java:229)
	at org.apache.harmony.luni.net.PlainSocketImpl.connect(PlainSocketImpl.java:508)
	at java.net.Socket.connect(Socket.java:932)
	at org.apache.harmony.luni.internal.net.www.protocol.http.HttpURLConnection.getHTTPConnection(HttpURLConnection.java:636)
	at org.apache.harmony.luni.internal.net.www.protocol.http.HttpURLConnection.connect(HttpURLConnection.java:617)
	at org.apache.harmony.x.print.ipp.IppClient.request(IppClient.java:111)
	at org.apache.harmony.x.print.ipp.IppClient.request(IppClient.java:87)
	at org.apache.harmony.x.print.cups.CUPSPrintServiceProvider.findDefaultPrintService(CUPSPrintServiceProvider.java:471)
	at org.apache.harmony.x.print.cups.CUPSPrintServiceProvider.getDefaultPrintService(CUPSPrintServiceProvider.java:168)
	at javax.print.PrintServiceLookup.lookupDefaultPrintService(PrintServiceLookup.java:138)
	at javax.print.attribute.HashAttributeTest.testEquals(HashAttributeTest.java:283)
	at java.lang.reflect.VMReflection.invokeMethod(VMReflection.java)
	at java.lang.reflect.Method.invoke(Method.java:381)
	at junit.framework.TestCase.runTest(TestCase.java:154)
	at junit.framework.TestCase.runBare(TestCase.java:125)
	at junit.framework.TestResult$1.protect(TestResult.java:106)
	at junit.framework.TestResult.runProtected(TestResult.java)
	at junit.framework.TestResult.run(TestResult.java:104)
	at junit.framework.TestCase.run(TestCase.java)
	at junit.framework.TestSuite.runTest(TestSuite.java)
	at junit.framework.TestSuite.run(TestSuite.java:202)
	at junit.framework.TestSuite.runTest(TestSuite.java)
	at junit.framework.TestSuite.run(TestSuite.java:202)
	at org.apache.tools.ant.taskdefs.optional.junit.JUnitTestRunner.run(JUnitTestRunner.java:297)
	at org.apache.tools.ant.taskdefs.optional.junit.JUnitTestRunner.launch(JUnitTestRunner.java:670)
	at org.apache.tools.ant.taskdefs.optional.junit.JUnitTestRunner.main(JUnitTestRunner.java:567)
Compiling REGEX classes
Compiling REGEX tests
Since fork is false, ignoring memoryMaximumSize setting
Compiling RMI classes
Compiling RMI api tests
Since fork is false, ignoring memoryMaximumSize setting
Running RMI api tests
Unexporting MyRemoteObject1[UnicastServerRef[endpoint:[[127.0.0.2:34406]](local), ObjID[65536,
UID[-6601f0f0:110a5771879:-7fff]]]] ...
Done.
Unexporting MyRemoteObject1[UnicastServerRef[endpoint:[[127.0.0.2:34407]](local), ObjID[65537,
UID[-6601f0f0:110a5771879:-7ffe]]]] ...
Done.
Unexporting MyRemoteObject1[UnicastServerRef[endpoint:[[127.0.0.2:34408]](local), ObjID[65538,
UID[-6601f0f0:110a5771879:-7ffd]]]] ...
Done.
Unexporting MyRemoteObject1[UnicastServerRef[endpoint:[[127.0.0.2:34409]](local), ObjID[65539,
UID[-6601f0f0:110a5771879:-7ffc]]]] ...
Done.
Unexporting MyRemoteObject1[UnicastServerRef[endpoint:[[127.0.0.2:34410]](local), ObjID[65540,
UID[-6601f0f0:110a5771879:-7ffb]]]] ...
Done.
Unexporting MyRemoteObject1[UnicastServerRef[endpoint:[[127.0.0.2:34411]](local), ObjID[65541,
UID[-6601f0f0:110a5771879:-7ffa]]]] ...
Done.
Unexporting MyRemoteObject1[UnicastServerRef[endpoint:[[127.0.0.2:34412]](local), ObjID[65542,
UID[-6601f0f0:110a5771879:-7ff9]]]] ...
Done.
Unexporting MyRemoteObject1[UnicastServerRef[endpoint:[[127.0.0.2:34413]](local), ObjID[65543,
UID[-6601f0f0:110a5771879:-7ff8]]]] ...
Done.
Compiling SECURITY classes
Compiling SECURITY test support files
Since fork is false, ignoring memoryMaximumSize setting
Compiling SECURITY api tests
Since fork is false, ignoring memoryMaximumSize setting
Compiling SECURITY api injected tests
Since fork is false, ignoring memoryMaximumSize setting
Compiling SECURITY impl injected tests
Since fork is false, ignoring memoryMaximumSize setting
Compiling SECURITY impl tests
Since fork is false, ignoring memoryMaximumSize setting
Running SECURITY api tests
Running SECURITY api.injected tests
Running SECURITY impl tests
Running SECURITY impl injected tests
Compiling SOUND classes
Compiling SOUND tests
Since fork is false, ignoring memoryMaximumSize setting
Compiling SQL classes
Compiling SQL tests
Since fork is false, ignoring memoryMaximumSize setting
Compiling Sun Compat classes
Compiling SUNCOMPAT tests
Compiling TEXT classes
Compiling TEXT tests
Since fork is false, ignoring memoryMaximumSize setting
Compiling TOOLS classes
Compiling Tools tests
Since fork is false, ignoring memoryMaximumSize setting
Compiling X-NET classes
Compiling X-NET test support files
Since fork is false, ignoring memoryMaximumSize setting
Compiling X-NET api tests
Since fork is false, ignoring memoryMaximumSize setting
Compiling X-NET impl injected tests
Since fork is false, ignoring memoryMaximumSize setting
Compiling X-NET impl tests
Since fork is false, ignoring memoryMaximumSize setting
Running X-NET api tests
Running X-NET impl tests
Running X-NET impl injected tests
The test report is in /export/cruise/trunk/cc/projects/classlib/trunk/build/test_report/html/index.html

***********************************************************
Unit Tests: (14872)
        
error: unknown org.apache.harmony.luni.tests.java.lang.ClassLoaderTest
Unit Test Error Details:	(1)
                
Test: unknownClass: org.apache.harmony.luni.tests.java.lang.ClassLoaderTestjunit.framework.AssertionFailedError:
Timeout occurred


***********************************************************
Modifications since last successful build:	(4)
            
add cc-drlvm log20070209111256Lbuild.260 02/09/2007 11:12:56drlvm
add cc-classlib log20070209110937Lbuild.223 02/09/2007 11:09:37classlib
modified smishura  /harmony/enhanced/classlib/trunk/modules/security/src/test/api/java/org/apache/harmony/security/tests/java/security/SecurityTest.java
02/09/2007 10:58:47 Merge and refactor tests for Security.insertProviderAt()
modified smishura  /harmony/enhanced/classlib/trunk/modules/security/src/test/api/java/org/apache/harmony/security/tests/java/security/Security2Test.java
02/09/2007 10:58:47 Merge and refactor tests for Security.insertProviderAt()

Mime
View raw message