harmony-alerts mailing list archives

Site index · List index
Message view « Date » · « Thread »
Top « Date » · « Thread »
From nom...@intel.com
Subject [build-test alert] BUILD FAILED Windows XP SP2 msvc debug: drlvm reg.test
Date Wed, 07 Feb 2007 16:08:39 GMT
BUILD FAILED:
	Ant Error Message:
C:\cruise\trunk\cc\projects\drlvm\trunk\build\make\build.xml:438: The following error occurred
while executing this line: C:\cruise\trunk\cc\projects\drlvm\trunk\build\make\targets\reg.test.run.xml:96:
There were test failures

Date of build:	02/07/2007 22:01:44
Time to build:	6 minutes 42 seconds
Last changed:	02/07/2007 20:51:22
Last log entry:	drlvm

***********************************************************
Errors/Warnings:	(176)
            
Configuration:
    classlib root = C:\cruise\trunk\cc\projects\classlib\trunk
               os = Windows
             arch = ia32
              cxx = msvc
              cfg = debug
       components = deploy
[parsing started C:\cruise\trunk\cc\projects\drlvm\trunk\src\test\regression\H0000\DirectByteBufferTest.java]
[parsing completed 47ms]
[parsing started C:\cruise\trunk\cc\projects\drlvm\trunk\src\test\regression\H1578\NaNTest.java]
[parsing completed 0ms]
[parsing started C:\cruise\trunk\cc\projects\drlvm\trunk\src\test\regression\H1694\H1694.java]
[parsing completed 15ms]
[parsing started C:\cruise\trunk\cc\projects\drlvm\trunk\src\test\regression\H1800\ExecTest.java]
[parsing completed 16ms]
[parsing started C:\cruise\trunk\cc\projects\drlvm\trunk\src\test\regression\H2083\Test.java]
[parsing completed 16ms]
[parsing started C:\cruise\trunk\cc\projects\drlvm\trunk\src\test\regression\H2151\VMInit1Test.java]
[parsing completed 0ms]
[parsing started C:\cruise\trunk\cc\projects\drlvm\trunk\src\test\regression\H2259\H2259.java]
[parsing completed 31ms]
[parsing started C:\cruise\trunk\cc\projects\drlvm\trunk\src\test\regression\H2261\RCETest.java]
[parsing completed 15ms]
[parsing started C:\cruise\trunk\cc\projects\drlvm\trunk\src\test\regression\H2335\SimplestLibraryPathTest.java]
[parsing completed 0ms]
[parsing started C:\cruise\trunk\cc\projects\drlvm\trunk\src\test\regression\H2808\finTest.java]
[parsing completed 0ms]
[parsing started C:\cruise\trunk\cc\projects\drlvm\trunk\src\test\regression\H2899\ManyArgsTest.java]
[parsing completed 32ms]
[parsing started C:\cruise\trunk\cc\projects\drlvm\trunk\src\test\regression\H2926\MyException.java]
[parsing completed 0ms]
[parsing started C:\cruise\trunk\cc\projects\drlvm\trunk\src\test\regression\H2926\Test.java]
[parsing completed 0ms]
[parsing started C:\cruise\trunk\cc\projects\drlvm\trunk\src\test\regression\H3027\AgentLibTest.java]
[parsing completed 15ms]
[parsing started C:\cruise\trunk\cc\projects\drlvm\trunk\src\test\regression\H3121\H3121.java]
[parsing completed 16ms]
[parsing started C:\cruise\trunk\cc\projects\drlvm\trunk\src\test\regression\H788\Test.java]
[parsing completed 16ms]
[search path for source files: [C:\cruise\trunk\cc\projects\drlvm\trunk\src\test\regression]]
[search path for class files: [C:\users\tools\jdk1.5.0_08\jre\lib\rt.jar, C:\users\tools\jdk1.5.0_08\jre\lib\jsse.jar,
C:\users\tools\jdk1.5.0_08\jre\lib\jce.jar, C:\users\tools\jdk1.5.0_08\jre\lib\charsets.jar,
C:\users\tools\jdk1.5.0_08\jre\lib\ext\dnsns.jar, C:\users\tools\jdk1.5.0_08\jre\lib\ext\localedata.jar,
C:\users\tools\jdk1.5.0_08\jre\lib\ext\sunjce_provider.jar, C:\users\tools\jdk1.5.0_08\jre\lib\ext\sunpkcs11.jar,
C:\cruise\trunk\cc\projects\drlvm\trunk\build\win_ia32_msvc_debug\semis\reg.tests\classes,
C:\cruise\trunk\cc\lib\ant-launcher.jar, C:\users\tools\jdk1.5.0_08\lib\tools.jar, C:\cruise\trunk\cc\lib\cruisecontrol.jar,
C:\cruise\trunk\cc\lib\..\lib\activation.jar, C:\cruise\trunk\cc\lib\..\lib\comm.jar, C:\cruise\trunk\cc\lib\..\lib\commons-net-1.1.0.jar,
C:\cruise\trunk\cc\lib\..\lib\fast-md5.jar, C:\cruise\trunk\cc\lib\..\lib\jakarta-oro-2.0.3.jar,
C:\cruise\trunk\cc\lib\..\lib\jdom.jar, C:\cruise\trunk\cc\lib\..\lib\log4j.jar, C:\cruise\trunk\cc\lib\..!
 \lib\mail.jar, C:\cruise\trunk\cc\lib\..\lib\mx4j-tools.jar, C:\cruise\trunk\cc\lib\..\lib\mx4j-remote.jar,
C:\cruise\trunk\cc\lib\..\lib\mx4j.jar, C:\cruise\trunk\cc\lib\..\lib\smack.jar, C:\cruise\trunk\cc\lib\..\lib\x10.jar,
C:\cruise\trunk\cc\lib\..\lib\xmlrpc-2.0.1.jar, C:\cruise\trunk\cc\lib\log4j.jar, C:\cruise\trunk\cc\lib\jdom.jar,
C:\cruise\trunk\cc\lib\ant.jar, C:\users\tools\apache-ant-1.6.5\lib\ant-apache-regexp.jar,
C:\users\tools\apache-ant-1.6.5\lib\ecj_3.2.jar, C:\users\tools\apache-ant-1.6.5\lib\ant-nodeps.jar,
C:\users\tools\apache-ant-1.6.5\lib\ant-xslp.jar, C:\users\tools\apache-ant-1.6.5\lib\ant-trax.jar,
C:\cruise\trunk\cc\projects\drlvm\trunk\build\make\tmp\ant-contrib.jar, C:\cruise\trunk\cc\projects\drlvm\trunk\build\make\tmp\cpptasks.jar,
C:\cruise\trunk\cc\projects\drlvm\trunk\build\make\tmp\junit.jar, C:\cruise\trunk\cc\lib\jasper-compiler.jar,
C:\cruise\trunk\cc\lib\jasper-runtime.jar, C:\cruise\trunk\cc\lib\xercesImpl-2.8.0.jar, C:\cruise\trun!
 k\cc\lib\xml-apis-2.8.0.jar, C:\cruise\trunk\cc\lib\xmlrpc-2.0.1.jar, 
C:\cruise\trunk\cc\lib\xalan-2.7.0.jar, C:\cruise\trunk\cc\lib\serializer-2.7.0.jar, C:\cruise\trunk\cc\lib\jakarta-oro-2.0.3.jar,
C:\cruise\trunk\cc\lib\mail.jar, C:\cruise\trunk\cc\lib\junit.jar, C:\cruise\trunk\cc\lib\activation.jar,
C:\cruise\trunk\cc\lib\commons-net-1.1.0.jar, C:\cruise\trunk\cc\lib\mx4j.jar, C:\cruise\trunk\cc\lib\mx4j-tools.jar,
C:\cruise\trunk\cc\lib\mx4j-remote.jar, C:\cruise\trunk\cc\lib\smack.jar, C:\cruise\trunk\cc\lib\comm.jar,
C:\cruise\trunk\cc\lib\x10.jar, C:\cruise\trunk\cc\lib\fast-md5.jar, C:\cruise\trunk\cc\lib\maven-embedder-2.0.3-dep.jar,
C:\cruise\trunk\cc\lib\javax.servlet.jar, C:\cruise\trunk\cc\lib\org.mortbay.jetty.jar, C:\cruise\trunk\cc\lib\commons-logging.jar,
C:\cruise\trunk\cc\lib\commons-el.jar, C:\cruise\trunk\cc\lib\jaxen-1.1-beta-8.jar, C:\cruise\trunk\cc\projects\drlvm\trunk\build\make,
C:\cruise\trunk\cc\lib\ant-junit-1.6.5.jar, C:\cruise\trunk\cc\lib\checkstyle-all-3.1.jar,
C:\cruise\trunk\cc\lib\emma.jar, C:\cruise\tru!
 nk\cc\lib\emma_ant.jar, C:\cruise\trunk\cc\lib\smackx.jar]]
[loading C:\cruise\trunk\cc\projects\drlvm\trunk\build\make\tmp\junit.jar(junit/framework/TestCase.class)]
[loading C:\cruise\trunk\cc\projects\drlvm\trunk\build\make\tmp\junit.jar(junit/framework/Test.class)]
[loading C:\users\tools\jdk1.5.0_08\jre\lib\rt.jar(java/lang/Object.class)]
[loading C:\cruise\trunk\cc\projects\drlvm\trunk\build\make\tmp\junit.jar(junit/framework/Assert.class)]
[loading C:\users\tools\jdk1.5.0_08\jre\lib\rt.jar(java/lang/String.class)]
[loading C:\users\tools\jdk1.5.0_08\jre\lib\rt.jar(java/lang/Exception.class)]
[loading C:\users\tools\jdk1.5.0_08\jre\lib\rt.jar(java/lang/Thread.class)]
[loading C:\users\tools\jdk1.5.0_08\jre\lib\rt.jar(java/lang/Runnable.class)]
[loading C:\users\tools\jdk1.5.0_08\jre\lib\rt.jar(java/lang/reflect/InvocationHandler.class)]
[loading C:\users\tools\jdk1.5.0_08\jre\lib\rt.jar(java/lang/reflect/Method.class)]
[loading C:\users\tools\jdk1.5.0_08\jre\lib\rt.jar(java/lang/reflect/Proxy.class)]
[loading C:\users\tools\jdk1.5.0_08\jre\lib\rt.jar(java/lang/reflect/UndeclaredThrowableException.class)]
[loading C:\users\tools\jdk1.5.0_08\jre\lib\rt.jar(java/lang/Throwable.class)]
[loading C:\users\tools\jdk1.5.0_08\jre\lib\rt.jar(java/io/Serializable.class)]
[checking org.apache.harmony.drlvm.tests.regression.h0000.DirectByteBufferTest]
[loading C:\users\tools\jdk1.5.0_08\jre\lib\rt.jar(java/lang/System.class)]
[wrote C:\cruise\trunk\cc\projects\drlvm\trunk\build\win_ia32_msvc_debug\semis\reg.tests\classes\org\apache\harmony\drlvm\tests\regression\h0000\DirectByteBufferTest.class]
[checking org.apache.harmony.drlvm.tests.regression.H1578.NaNTest]
[loading C:\cruise\trunk\cc\projects\drlvm\trunk\build\win_ia32_msvc_debug\semis\reg.tests\classes\org\apache\harmony\drlvm\tests\regression\H1578\dcmp1.class]
[loading C:\cruise\trunk\cc\projects\drlvm\trunk\build\win_ia32_msvc_debug\semis\reg.tests\classes\org\apache\harmony\drlvm\tests\regression\H1578\fcmp1.class]
[loading C:\users\tools\jdk1.5.0_08\jre\lib\rt.jar(java/lang/Float.class)]
[loading C:\users\tools\jdk1.5.0_08\jre\lib\rt.jar(java/lang/Number.class)]
[loading C:\users\tools\jdk1.5.0_08\jre\lib\rt.jar(java/lang/Double.class)]
[wrote C:\cruise\trunk\cc\projects\drlvm\trunk\build\win_ia32_msvc_debug\semis\reg.tests\classes\org\apache\harmony\drlvm\tests\regression\H1578\NaNTest.class]
[checking org.apache.harmony.drlvm.tests.regression.h1694.H1694]
[loading C:\users\tools\jdk1.5.0_08\jre\lib\rt.jar(java/io/PrintStream.class)]
[loading C:\users\tools\jdk1.5.0_08\jre\lib\rt.jar(java/io/FilterOutputStream.class)]
[loading C:\users\tools\jdk1.5.0_08\jre\lib\rt.jar(java/io/OutputStream.class)]
[loading C:\users\tools\jdk1.5.0_08\jre\lib\rt.jar(java/lang/OutOfMemoryError.class)]
[loading C:\users\tools\jdk1.5.0_08\jre\lib\rt.jar(java/lang/VirtualMachineError.class)]
[loading C:\users\tools\jdk1.5.0_08\jre\lib\rt.jar(java/lang/Error.class)]
[wrote C:\cruise\trunk\cc\projects\drlvm\trunk\build\win_ia32_msvc_debug\semis\reg.tests\classes\org\apache\harmony\drlvm\tests\regression\h1694\H1694.class]
[checking org.apache.harmony.drlvm.tests.regression.h1694.StressTest01Object1]
[wrote C:\cruise\trunk\cc\projects\drlvm\trunk\build\win_ia32_msvc_debug\semis\reg.tests\classes\org\apache\harmony\drlvm\tests\regression\h1694\StressTest01Object1.class]
[checking org.apache.harmony.drlvm.tests.regression.h1800.ExecTest]
[loading C:\users\tools\jdk1.5.0_08\jre\lib\rt.jar(java/io/File.class)]
[loading C:\users\tools\jdk1.5.0_08\jre\lib\rt.jar(java/lang/Process.class)]
[loading C:\users\tools\jdk1.5.0_08\jre\lib\rt.jar(java/lang/Runtime.class)]
[loading C:\users\tools\jdk1.5.0_08\jre\lib\rt.jar(java/io/InputStream.class)]
[loading C:\users\tools\jdk1.5.0_08\jre\lib\rt.jar(java/io/Closeable.class)]
[loading C:\users\tools\jdk1.5.0_08\jre\lib\rt.jar(java/lang/StringBuilder.class)]
[loading C:\users\tools\jdk1.5.0_08\jre\lib\rt.jar(java/lang/StringBuffer.class)]
[loading C:\users\tools\jdk1.5.0_08\jre\lib\rt.jar(java/lang/NullPointerException.class)]
[loading C:\users\tools\jdk1.5.0_08\jre\lib\rt.jar(java/lang/RuntimeException.class)]
[loading C:\users\tools\jdk1.5.0_08\jre\lib\rt.jar(java/io/IOException.class)]
[loading C:\users\tools\jdk1.5.0_08\jre\lib\rt.jar(java/lang/InterruptedException.class)]
[loading C:\users\tools\jdk1.5.0_08\jre\lib\rt.jar(java/lang/AbstractStringBuilder.class)]
[loading C:\users\tools\jdk1.5.0_08\jre\lib\rt.jar(java/lang/CharSequence.class)]
[loading C:\users\tools\jdk1.5.0_08\jre\lib\rt.jar(java/lang/Comparable.class)]
[wrote C:\cruise\trunk\cc\projects\drlvm\trunk\build\win_ia32_msvc_debug\semis\reg.tests\classes\org\apache\harmony\drlvm\tests\regression\h1800\ExecTest.class]
[checking org.apache.harmony.drlvm.tests.regression.h2083.Test]
[wrote C:\cruise\trunk\cc\projects\drlvm\trunk\build\win_ia32_msvc_debug\semis\reg.tests\classes\org\apache\harmony\drlvm\tests\regression\h2083\Test.class]
[checking org.apache.harmony.drlvm.tests.regression.h2083.TestThread]
[wrote C:\cruise\trunk\cc\projects\drlvm\trunk\build\win_ia32_msvc_debug\semis\reg.tests\classes\org\apache\harmony\drlvm\tests\regression\h2083\TestThread.class]
[checking org.apache.harmony.drlvm.tests.regression.h2083.Missed]
[wrote C:\cruise\trunk\cc\projects\drlvm\trunk\build\win_ia32_msvc_debug\semis\reg.tests\classes\org\apache\harmony\drlvm\tests\regression\h2083\Missed.class]
[checking org.apache.harmony.drlvm.tests.regression.h2151.VMInit1Test]
[wrote C:\cruise\trunk\cc\projects\drlvm\trunk\build\win_ia32_msvc_debug\semis\reg.tests\classes\org\apache\harmony\drlvm\tests\regression\h2151\VMInit1Test.class]
[checking org.apache.harmony.drlvm.tests.regression.h2151.Status]
[wrote C:\cruise\trunk\cc\projects\drlvm\trunk\build\win_ia32_msvc_debug\semis\reg.tests\classes\org\apache\harmony\drlvm\tests\regression\h2151\Status.class]
[checking org.apache.harmony.drlvm.tests.regression.h2259.I1]
[wrote C:\cruise\trunk\cc\projects\drlvm\trunk\build\win_ia32_msvc_debug\semis\reg.tests\classes\org\apache\harmony\drlvm\tests\regression\h2259\I1.class]
[checking org.apache.harmony.drlvm.tests.regression.h2259.ParentException]
[wrote C:\cruise\trunk\cc\projects\drlvm\trunk\build\win_ia32_msvc_debug\semis\reg.tests\classes\org\apache\harmony\drlvm\tests\regression\h2259\ParentException.class]
[checking org.apache.harmony.drlvm.tests.regression.h2259.I2]
[wrote C:\cruise\trunk\cc\projects\drlvm\trunk\build\win_ia32_msvc_debug\semis\reg.tests\classes\org\apache\harmony\drlvm\tests\regression\h2259\I2.class]
[checking org.apache.harmony.drlvm.tests.regression.h2259.SubException]
[wrote C:\cruise\trunk\cc\projects\drlvm\trunk\build\win_ia32_msvc_debug\semis\reg.tests\classes\org\apache\harmony\drlvm\tests\regression\h2259\SubException.class]
[checking org.apache.harmony.drlvm.tests.regression.h2259.H2259]
[loading C:\users\tools\jdk1.5.0_08\jre\lib\rt.jar(java/lang/Class.class)]
[loading C:\users\tools\jdk1.5.0_08\jre\lib\rt.jar(java/lang/ClassLoader.class)]
[loading C:\users\tools\jdk1.5.0_08\jre\lib\rt.jar(java/lang/ArrayStoreException.class)]
[loading C:\users\tools\jdk1.5.0_08\jre\lib\rt.jar(java/lang/IllegalArgumentException.class)]
[wrote C:\cruise\trunk\cc\projects\drlvm\trunk\build\win_ia32_msvc_debug\semis\reg.tests\classes\org\apache\harmony\drlvm\tests\regression\h2259\H2259$1.class]
[wrote C:\cruise\trunk\cc\projects\drlvm\trunk\build\win_ia32_msvc_debug\semis\reg.tests\classes\org\apache\harmony\drlvm\tests\regression\h2259\H2259.class]
[checking org.apache.harmony.drlvm.tests.regression.h2261.RCETest]
[loading C:\users\tools\jdk1.5.0_08\jre\lib\rt.jar(java/lang/Integer.class)]
[loading C:\users\tools\jdk1.5.0_08\jre\lib\rt.jar(java/lang/Math.class)]
[wrote C:\cruise\trunk\cc\projects\drlvm\trunk\build\win_ia32_msvc_debug\semis\reg.tests\classes\org\apache\harmony\drlvm\tests\regression\h2261\RCETest.class]
[checking org.apache.harmony.drlvm.tests.regression.h2335.SimplestLibraryPathTest]
[wrote C:\cruise\trunk\cc\projects\drlvm\trunk\build\win_ia32_msvc_debug\semis\reg.tests\classes\org\apache\harmony\drlvm\tests\regression\h2335\SimplestLibraryPathTest.class]
[checking org.apache.harmony.drlvm.tests.regression.h2808.finTest]
[loading C:\cruise\trunk\cc\projects\drlvm\trunk\build\win_ia32_msvc_debug\semis\reg.tests\classes\org\apache\harmony\drlvm\tests\regression\h2808\finTest1.class]
[loading C:\users\tools\jdk1.5.0_08\jre\lib\rt.jar(java/lang/VerifyError.class)]
[loading C:\users\tools\jdk1.5.0_08\jre\lib\rt.jar(java/lang/LinkageError.class)]
[wrote C:\cruise\trunk\cc\projects\drlvm\trunk\build\win_ia32_msvc_debug\semis\reg.tests\classes\org\apache\harmony\drlvm\tests\regression\h2808\finTest.class]
[checking org.apache.harmony.drlvm.tests.regression.h2899.ManyArgsTest]
[wrote C:\cruise\trunk\cc\projects\drlvm\trunk\build\win_ia32_msvc_debug\semis\reg.tests\classes\org\apache\harmony\drlvm\tests\regression\h2899\ManyArgsTest.class]
[checking org.apache.harmony.drlvm.tests.regression.h2926.MyException]
[wrote C:\cruise\trunk\cc\projects\drlvm\trunk\build\win_ia32_msvc_debug\semis\reg.tests\classes\org\apache\harmony\drlvm\tests\regression\h2926\MyException.class]
[checking org.apache.harmony.drlvm.tests.regression.h2926.Test]
[loading C:\cruise\trunk\cc\projects\drlvm\trunk\build\win_ia32_msvc_debug\semis\reg.tests\classes\org\apache\harmony\drlvm\tests\regression\h2926\TestClass.class]
[wrote C:\cruise\trunk\cc\projects\drlvm\trunk\build\win_ia32_msvc_debug\semis\reg.tests\classes\org\apache\harmony\drlvm\tests\regression\h2926\Test.class]
[checking org.apache.harmony.drlvm.tests.regression.h2926.Status]
[wrote C:\cruise\trunk\cc\projects\drlvm\trunk\build\win_ia32_msvc_debug\semis\reg.tests\classes\org\apache\harmony\drlvm\tests\regression\h2926\Status.class]
[checking org.apache.harmony.drlvm.tests.regression.h3027.AgentLibTest]
[wrote C:\cruise\trunk\cc\projects\drlvm\trunk\build\win_ia32_msvc_debug\semis\reg.tests\classes\org\apache\harmony\drlvm\tests\regression\h3027\AgentLibTest.class]
[checking org.apache.harmony.drlvm.tests.regression.h3027.Status]
[wrote C:\cruise\trunk\cc\projects\drlvm\trunk\build\win_ia32_msvc_debug\semis\reg.tests\classes\org\apache\harmony\drlvm\tests\regression\h3027\Status.class]
[checking org.apache.harmony.drlvm.tests.regression.h3121.H3121]
[wrote C:\cruise\trunk\cc\projects\drlvm\trunk\build\win_ia32_msvc_debug\semis\reg.tests\classes\org\apache\harmony\drlvm\tests\regression\h3121\H3121.class]
[checking org.apache.harmony.drlvm.tests.regression.h3121.Intf]
[wrote C:\cruise\trunk\cc\projects\drlvm\trunk\build\win_ia32_msvc_debug\semis\reg.tests\classes\org\apache\harmony\drlvm\tests\regression\h3121\Intf.class]
[checking org.apache.harmony.drlvm.tests.regression.h3121.IntfClass]
[wrote C:\cruise\trunk\cc\projects\drlvm\trunk\build\win_ia32_msvc_debug\semis\reg.tests\classes\org\apache\harmony\drlvm\tests\regression\h3121\IntfClass.class]
[checking org.apache.harmony.drlvm.tests.regression.h788.Test]
[loading C:\users\tools\jdk1.5.0_08\jre\lib\rt.jar(java/lang/ClassNotFoundException.class)]
[loading C:\users\tools\jdk1.5.0_08\jre\lib\rt.jar(java/lang/InstantiationException.class)]
[loading C:\users\tools\jdk1.5.0_08\jre\lib\rt.jar(java/lang/IllegalAccessException.class)]
[wrote C:\cruise\trunk\cc\projects\drlvm\trunk\build\win_ia32_msvc_debug\semis\reg.tests\classes\org\apache\harmony\drlvm\tests\regression\h788\Test.class]
[total 1328ms]
## Compiling reg native ${outname}
## Compiling reg native ${outname}
## Compiling reg native ${outname}
## Compiling reg native ${outname}
## Compiling reg native ${outname}

==================================
     Run regression tests
==================================
        
Running on JET
Running on OPT
Running on interpreter
vf_debug: verifying class org/apache/harmony/drlvm/tests/regression/h2808/finTest1 (method
test()V) couldn't load class "org/apache/harmony/drlvm/tests/regression/h2808/finTest2"
vf_debug: VerifyError: org/apache/harmony/drlvm/tests/regression/h2808/finTest2
Running on JIT
Running on interpreter
Failed to open agent library AgentLib.dll : The specified module could not be found.  
Failed to open agent library AgentLib.dll
Failed to initialize JVMTI.
HMYEXEL062E Internal VM error: Failed to create Java VM
FAILED to invoke JVM.
========================================
Regression testing report was stored in:
========================================
C:\cruise\trunk\cc\projects\drlvm\trunk\build\win_ia32_msvc_debug\semis\reg.tests/reports/html
========================================

***********************************************************
Unit Tests: (16)
        
All Tests Passed

***********************************************************
Modifications since last successful build:	(9)
            
add cc-drlvm log20070207205122Lbuild.106 02/07/2007 20:51:22drlvm
modified gshimansky  /harmony/enhanced/drlvm/trunk/vm/vmcore/src/jvmti/jvmti_event.cpp 02/07/2007
20:28:46 Applied HARMONY-2933 [drlvm][vmcore][jit] Unsynchronized linked list modificationTests
passed on Ubuntu6 x86, Windows 2003 server x86 and SuSE9 x86_64
modified gshimansky  /harmony/enhanced/drlvm/trunk/vm/vmcore/include/environment.h 02/07/2007
20:28:46 Applied HARMONY-2933 [drlvm][vmcore][jit] Unsynchronized linked list modificationTests
passed on Ubuntu6 x86, Windows 2003 server x86 and SuSE9 x86_64
modified gshimansky  /harmony/enhanced/drlvm/trunk/vm/vmcore/src/class_support/Environment.cpp
02/07/2007 20:28:46 Applied HARMONY-2933 [drlvm][vmcore][jit] Unsynchronized linked list modificationTests
passed on Ubuntu6 x86, Windows 2003 server x86 and SuSE9 x86_64
modified gshimansky  /harmony/enhanced/drlvm/trunk/vm/vmcore/src/util/native_stack.cpp 02/07/2007
20:28:46 Applied HARMONY-2933 [drlvm][vmcore][jit] Unsynchronized linked list modificationTests
passed on Ubuntu6 x86, Windows 2003 server x86 and SuSE9 x86_64
modified gshimansky  /harmony/enhanced/drlvm/trunk/vm/vmcore/src/jit/compile.cpp 02/07/2007
20:28:46 Applied HARMONY-2933 [drlvm][vmcore][jit] Unsynchronized linked list modificationTests
passed on Ubuntu6 x86, Windows 2003 server x86 and SuSE9 x86_64
modified varlax  /harmony/enhanced/drlvm/trunk/build/custom/msvc_2003/gc_gen/gc_gen.vcproj
02/07/2007 20:03:35 Updated MSVC 2003 project files
modified varlax  /harmony/enhanced/drlvm/trunk/build/custom/msvc_2003/vmcore/vmcore.vcproj
02/07/2007 20:03:35 Updated MSVC 2003 project files
modified varlax  /harmony/enhanced/drlvm/trunk/build/custom/msvc_2003/jitrino/jitrino.vcproj
02/07/2007 20:03:35 Updated MSVC 2003 project files

Mime
View raw message