harmony-alerts mailing list archives

Site index · List index
Message view « Date » · « Thread »
Top « Date » · « Thread »
From nom...@intel.com
Subject [build-test alert] BUILD FAILED Windows XP SP2 msvc debug: classlib over drlvm
Date Wed, 07 Feb 2007 14:42:26 GMT
BUILD FAILED:
	Ant Error Message:
C:\cruise\trunk\cc\projects\classlib\trunk\build.xml:167: The following error occurred while
executing this line: C:\cruise\trunk\cc\projects\classlib\trunk\make\build-test.xml:133: There
were test crashes: C:\cruise\trunk\cc\projects\classlib\trunk\build\test_report\TEST-org.apache.harmony.luni.tests.java.lang.ClassLoaderTest.xml

Date of build:	02/07/2007 20:05:57
Time to build:	35 minutes 42 seconds
Last changed:	02/07/2007 20:03:35
Last log entry:	Updated MSVC 2003 project files

***********************************************************
Errors/Warnings:	(186)
            

========================================
Testing class libraries...
========================================

Checking for depends/jars/yoko_M2-20070130/yoko.jar
Checking for depends/jars/yoko_M2-20070130/yoko-core.jar
Checking for depends/jars/yoko_M2-20070130/yoko-rmi-impl.jar
Checking for depends/jars/yoko_M2-20070130/yoko-rmi-spec.jar
Checking for depends/jars/bcel-5.2/bcel-5.2.jar
Checking for depends/jars/xalan-j_2.7.0/xalan.jar
Checking for depends/jars/xerces_2.8.0/resolver.jar
Checking for depends/jars/xerces_2.8.0/xercesImpl.jar
Checking for depends/jars/xerces_2.8.0/xml-apis.jar
Checking for depends/jars/junit_3.8.2/junit.jar
Checking for depends/jars/bcprov-jdk15-134/bcprov.jar
Checking for depends/jars/icu4j_3.4.4/icu4j_3_4_4.jar
Checking for depends/jars/mx4j_3.0.1/mx4j.jar
Checking for depends/jars/mx4j_3.0.1/mx4j-remote.jar
Checking for depends/jars/ecj_3.2/ecj_3.2.jar
Checking for depends/jars/jetty/jetty-6.0.0.jar
Checking for depends/jars/jetty/jetty-util-6.0.0.jar
Checking for depends/jars/jetty/servlet-api-2.5-6.0.0.jar
Checking for depends/libs/windows.x86/msvcr71.dll
Checking for depends/libs/windows.x86/swing_awt_deps_winxp_2006-09-28.tgz
Since fork is false, ignoring memoryMaximumSize setting
Compiling ACCESSIBILITY classes
Compiling ACCESSIBILITY tests
Since fork is false, ignoring memoryMaximumSize setting
Compiling ANNOTATION classes
Compiling ANNOTATION tests
Since fork is false, ignoring memoryMaximumSize setting
Compiling APPLET classes
Compiling APPLET tests
Since fork is false, ignoring memoryMaximumSize setting
Compiling ARCHIVE classes
Compiling ARCHIVE tests
Since fork is false, ignoring memoryMaximumSize setting
Compiling AUTH classes
Compiling AUTH tests
Since fork is false, ignoring memoryMaximumSize setting
Compiling AWT classes
Compiling AWT tests
Since fork is false, ignoring memoryMaximumSize setting
java.lang.RuntimeException: expected from EDT
	at java.awt.EventDispatchThreadRTest$1.run(EventDispatchThreadRTest.java:29)
	at java.awt.event.InvocationEvent.runAndNotify(InvocationEvent.java:90)
	at java.awt.event.InvocationEvent.dispatch(InvocationEvent.java:77)
	at java.awt.EventQueueCore.dispatchEventImpl(EventQueueCore.java:138)
	at java.awt.EventQueue.dispatchEvent(EventQueue.java:144)
	at java.awt.EventDispatchThread.runModalLoop(EventDispatchThread.java:73)
	at java.awt.EventDispatchThread.run(EventDispatchThread.java:45)
Compiling BEANS classes
Compiling support classes for BEANS tests
Compiling internal BEANS tests
Compiling BEANS tests
Since fork is false, ignoring memoryMaximumSize setting
Running internal BEANS tests
Running BEANS tests
Compiling CRYPTO classes
Compiling CRYPTO test support files
Since fork is false, ignoring memoryMaximumSize setting
Compiling CRYPTO api tests
Since fork is false, ignoring memoryMaximumSize setting
Compiling CRYPTO api injected tests
Since fork is false, ignoring memoryMaximumSize setting
Compiling CRYPTO impl injected tests
Since fork is false, ignoring memoryMaximumSize setting
Compiling CRYPTO impl tests
Since fork is false, ignoring memoryMaximumSize setting
Running CRYPTO api tests
Running CRYPTO api.injected tests
Running CRYPTO impl tests
Running CRYPTO impl injected tests
Compiling ImageIO classes
Compiling ImageIO tests
Compiling INSTRUMENT classes
Compiling INSTRUMENT tests
Since fork is false, ignoring memoryMaximumSize setting
Compiling JNDI classes
Compiling JNDI tests
Since fork is false, ignoring memoryMaximumSize setting
Compiling LANG-MANAGEMENT classes
Compiling LANG-MANAGEMENT API tests
Compiling LANG-MANAGEMENT Implementation tests
Compiling LOGGING classes
Compiling LOGGING tests
Since fork is false, ignoring memoryMaximumSize setting
Compiling LUNI classes
Compiling LUNI JUnit Tests
Since fork is false, ignoring memoryMaximumSize setting
Running LUNI JUnit Tests
Compiling MATH classes
Compiling MATH tests
Since fork is false, ignoring memoryMaximumSize setting
Compiling MISC classes
Compiling MISC tests
Since fork is false, ignoring memoryMaximumSize setting
Compiling NIO classes
Compiling NIO tests
Since fork is false, ignoring memoryMaximumSize setting
Compiling NIO_CHAR classes
Compiling NIO_CHAR tests
Since fork is false, ignoring memoryMaximumSize setting
Cannot find unmappable byte array for US-ASCII
Cannot find unmappable byte array for gb18030
Cannot find unmappable byte array for ISO-8859-1
Cannot find malform byte array for ISO-8859-1
Cannot find unmappable byte array for UTF-16BE
Cannot find malform byte array for UTF-16BE
Cannot find unmappable byte array for UTF-16LE
Cannot find malform byte array for UTF-16LE
Cannot find unmappable byte array for UTF-8
Compiling PACK200 classes
Compiling PACK200 tests
Since fork is false, ignoring memoryMaximumSize setting
Running PACK200 tests
Compiling PREFS classes
Compiling PREFS tests
Since fork is false, ignoring memoryMaximumSize setting
Compiling PRINT classes
Compiling Print tests
Since fork is false, ignoring memoryMaximumSize setting
Compiling REGEX classes
Compiling REGEX tests
Since fork is false, ignoring memoryMaximumSize setting
Compiling RMI classes
Compiling RMI api tests
Since fork is false, ignoring memoryMaximumSize setting
Running RMI api tests
Unexporting MyRemoteObject1[UnicastServerRef[endpoint:[[10.125.122.37:2894]](local), ObjID[65536,
UID[20b0eb84:1109c9dce24:-7ff7]]]] ...
Done.
Unexporting MyRemoteObject1[UnicastServerRef[endpoint:[[10.125.122.37:2895]](local), ObjID[65537,
UID[20b0eb84:1109c9dce24:-7ff6]]]] ...
Done.
Unexporting MyRemoteObject1[UnicastServerRef[endpoint:[[10.125.122.37:2896]](local), ObjID[65538,
UID[20b0eb84:1109c9dce24:-7ff5]]]] ...
Done.
Unexporting MyRemoteObject1[UnicastServerRef[endpoint:[[10.125.122.37:2897]](local), ObjID[65539,
UID[20b0eb84:1109c9dce24:-7ff4]]]] ...
Done.
Unexporting MyRemoteObject1[UnicastServerRef[endpoint:[[10.125.122.37:2898]](local), ObjID[65540,
UID[20b0eb84:1109c9dce24:-7ff3]]]] ...
Done.
Unexporting MyRemoteObject1[UnicastServerRef[endpoint:[[10.125.122.37:2899]](local), ObjID[65541,
UID[20b0eb84:1109c9dce24:-7ff2]]]] ...
Done.
Unexporting MyRemoteObject1[UnicastServerRef[endpoint:[[10.125.122.37:2900]](local), ObjID[65542,
UID[20b0eb84:1109c9dce24:-7ff1]]]] ...
Done.
Unexporting MyRemoteObject1[UnicastServerRef[endpoint:[[10.125.122.37:2901]](local), ObjID[65543,
UID[20b0eb84:1109c9dce24:-7ff0]]]] ...
Done.
LogStream[tst]:
Compiling SECURITY classes
Compiling SECURITY test support files
Since fork is false, ignoring memoryMaximumSize setting
Compiling SECURITY api tests
Since fork is false, ignoring memoryMaximumSize setting
Compiling SECURITY api injected tests
Since fork is false, ignoring memoryMaximumSize setting
Compiling SECURITY impl injected tests
Since fork is false, ignoring memoryMaximumSize setting
Compiling SECURITY impl tests
Since fork is false, ignoring memoryMaximumSize setting
Running SECURITY api tests
Running SECURITY api.injected tests
Running SECURITY impl tests
Running SECURITY impl injected tests
Compiling SOUND classes
Compiling SOUND tests
Since fork is false, ignoring memoryMaximumSize setting
Compiling SQL classes
Compiling SQL tests
Since fork is false, ignoring memoryMaximumSize setting
Compiling Sun Compat classes
Compiling SUNCOMPAT tests
Compiling TEXT classes
Compiling TEXT tests
Since fork is false, ignoring memoryMaximumSize setting
Compiling TOOLS classes
Compiling Tools tests
Since fork is false, ignoring memoryMaximumSize setting
Compiling X-NET classes
Compiling X-NET test support files
Since fork is false, ignoring memoryMaximumSize setting
Compiling X-NET api tests
Since fork is false, ignoring memoryMaximumSize setting
Compiling X-NET impl injected tests
Since fork is false, ignoring memoryMaximumSize setting
Compiling X-NET impl tests
Since fork is false, ignoring memoryMaximumSize setting
Running X-NET api tests
Running X-NET impl tests
Running X-NET impl injected tests
The test report is in C:\cruise\trunk\cc\projects\classlib\trunk\build\test_report\html\index.html

***********************************************************
Unit Tests: (12255)
        
error: org.apache.harmony.luni.tests.java.lang.ClassLoaderTest vmcrash.CrashedTests
Unit Test Error Details:	(1)
                
Test: org.apache.harmony.luni.tests.java.lang.ClassLoaderTestClass: vmcrash.CrashedTests

***********************************************************
Modifications since last successful build:	(42)
            
modified varlax  /harmony/enhanced/drlvm/trunk/build/custom/msvc_2003/gc_gen/gc_gen.vcproj
02/07/2007 20:03:35 Updated MSVC 2003 project files
modified varlax  /harmony/enhanced/drlvm/trunk/build/custom/msvc_2003/vmcore/vmcore.vcproj
02/07/2007 20:03:35 Updated MSVC 2003 project files
modified varlax  /harmony/enhanced/drlvm/trunk/build/custom/msvc_2003/jitrino/jitrino.vcproj
02/07/2007 20:03:35 Updated MSVC 2003 project files
modified ayza  /harmony/enhanced/classlib/trunk/modules/swing/src/main/java/common/javax/swing/JTabbedPane.java
02/07/2007 20:00:28 Applying patch from HARMONY-2515 ([classlib][swing] javax.swing.JTabbedPane.add(component,
-1) throws unspecified ArrayIndexOutOfBoundsException)
modified ayza  /harmony/enhanced/classlib/trunk/modules/swing/src/test/api/java/common/javax/swing/JTabbedPaneRTest.java
02/07/2007 20:00:28 Applying patch from HARMONY-2515 ([classlib][swing] javax.swing.JTabbedPane.add(component,
-1) throws unspecified ArrayIndexOutOfBoundsException)
modified varlax  /harmony/enhanced/drlvm/trunk/build/make/targets/reg.test.run.xml 02/07/2007
19:57:56 Postfix to HARMONY-2540 [drlvm][testing] Regression Testing Infrastructure implementation.1)
Now target reg.test fails if some testcases failed;2) Indentation fixed.
modified varlax  /harmony/enhanced/drlvm/trunk/vm/vmcore/src/class_support/classloader.cpp
02/07/2007 19:29:08 Applied HARMONY-2264 [drlvm] race condition in ClassLoader::LookupLoader
modified varlax  /harmony/enhanced/drlvm/trunk/vm/vmcore/src/jni/jni_utils.cpp 02/07/2007
19:29:08 Applied HARMONY-2264 [drlvm] race condition in ClassLoader::LookupLoader
modified varlax  /harmony/enhanced/drlvm/trunk/vm/vmcore/include/jni_utils.h 02/07/2007 19:29:08
Applied HARMONY-2264 [drlvm] race condition in ClassLoader::LookupLoader
modified varlax  /harmony/enhanced/drlvm/trunk/vm/jitrino/src/optimizer/devirtualizer.h 02/07/2007
19:19:33 Applied HARMONY-3121 [drlvm][jit][opt] Dacapo.eclipse crashes on the second iteration
in -Xem:server mode.Tested on SUSE10 ia32
modified varlax  /harmony/enhanced/drlvm/trunk/vm/em/src/NValueProfileCollector.cpp 02/07/2007
19:19:33 Applied HARMONY-3121 [drlvm][jit][opt] Dacapo.eclipse crashes on the second iteration
in -Xem:server mode.Tested on SUSE10 ia32
added varlax  /harmony/enhanced/drlvm/trunk/src/test/regression/H3121/H3121.java 02/07/2007
19:19:33 Applied HARMONY-3121 [drlvm][jit][opt] Dacapo.eclipse crashes on the second iteration
in -Xem:server mode.Tested on SUSE10 ia32
modified varlax  /harmony/enhanced/drlvm/trunk/vm/jitrino/src/optimizer/devirtualizer.cpp
02/07/2007 19:19:33 Applied HARMONY-3121 [drlvm][jit][opt] Dacapo.eclipse crashes on the second
iteration in -Xem:server mode.Tested on SUSE10 ia32
added varlax  /harmony/enhanced/drlvm/trunk/src/test/regression/H3121 02/07/2007 19:19:33
Applied HARMONY-3121 [drlvm][jit][opt] Dacapo.eclipse crashes on the second iteration in -Xem:server
mode.Tested on SUSE10 ia32
modified varlax  /harmony/enhanced/drlvm/trunk/vm/jitrino/src/dynopt/ValueProfiler.cpp 02/07/2007
19:19:33 Applied HARMONY-3121 [drlvm][jit][opt] Dacapo.eclipse crashes on the second iteration
in -Xem:server mode.Tested on SUSE10 ia32
added varlax  /harmony/enhanced/drlvm/trunk/src/test/regression/H3121/run.test.xml 02/07/2007
19:19:33 Applied HARMONY-3121 [drlvm][jit][opt] Dacapo.eclipse crashes on the second iteration
in -Xem:server mode.Tested on SUSE10 ia32
added varlax  /harmony/enhanced/drlvm/trunk/src/test/regression/H2899 02/07/2007 19:02:30
Added regression test for HARMONY-2899
added varlax  /harmony/enhanced/drlvm/trunk/src/test/regression/H2899/ManyArgsTest.java 02/07/2007
19:02:30 Added regression test for HARMONY-2899
added varlax  /harmony/enhanced/drlvm/trunk/src/test/regression/H2899/run.test.xml 02/07/2007
19:02:30 Added regression test for HARMONY-2899
added varlax  /harmony/enhanced/drlvm/trunk/src/test/regression/H2899/ManyArgs.cpp 02/07/2007
19:02:30 Added regression test for HARMONY-2899
add cc-drlvm log20070207185201Lbuild.105 02/07/2007 18:52:01drlvm
add cc-classlib log20070207184543Lbuild.90 02/07/2007 18:45:43classlib
modified varlax  /harmony/enhanced/drlvm/trunk/vm/port/src/encoder/ia32_em64t/encoder.inl
02/07/2007 18:36:27 Applied HARMONY-3129 [drlvm][intel64][lil]race condition and buffer overruns
in LIL codegenTested on SUSE9@x64 and SUSE9@ia32
modified varlax  /harmony/enhanced/drlvm/trunk/vm/port/src/lil/em64t/pim/include/lil_code_generator_em64t.h
02/07/2007 18:36:27 Applied HARMONY-3129 [drlvm][intel64][lil]race condition and buffer overruns
in LIL codegenTested on SUSE9@x64 and SUSE9@ia32
modified varlax  /harmony/enhanced/drlvm/trunk/vm/port/src/lil/em64t/pim/lil_code_generator_em64t.cpp
02/07/2007 18:36:27 Applied HARMONY-3129 [drlvm][intel64][lil]race condition and buffer overruns
in LIL codegenTested on SUSE9@x64 and SUSE9@ia32
add cc-drlvm log20070207183008Lbuild.104 02/07/2007 18:30:08drlvm
add cc-classlib log20070207182338Lbuild.89 02/07/2007 18:23:38classlib
modified apetrenko  /harmony/enhanced/classlib/trunk/modules/swing/src/main/java/common/javax/swing/plaf/basic/BasicTextAreaUI.java
02/07/2007 18:04:53 Patch for HARMONY-3132 "[classlib][swing] j.s.plaf.basic.BasicTextAreaUI
has compiler warnings"
modified ayza  /harmony/enhanced/classlib/trunk/modules/swing/src/test/api/java/common/javax/swing/JSeparatorTest.java
02/07/2007 18:04:22 Applying patch from HARMONY-2631 ([classlib][swing] javax.swing.JPopupMenu.Separator.isFocusable()
returns true while RI returns false)
modified ayza  /harmony/enhanced/classlib/trunk/modules/swing/src/test/api/java/common/javax/swing/JPopupMenuTest.java
02/07/2007 18:04:22 Applying patch from HARMONY-2631 ([classlib][swing] javax.swing.JPopupMenu.Separator.isFocusable()
returns true while RI returns false)
modified ayza  /harmony/enhanced/classlib/trunk/modules/swing/make/exclude.common 02/07/2007
18:04:22 Applying patch from HARMONY-2631 ([classlib][swing] javax.swing.JPopupMenu.Separator.isFocusable()
returns true while RI returns false)
modified ayza  /harmony/enhanced/classlib/trunk/modules/swing/src/main/java/common/javax/swing/JSeparator.java
02/07/2007 18:04:22 Applying patch from HARMONY-2631 ([classlib][swing] javax.swing.JPopupMenu.Separator.isFocusable()
returns true while RI returns false)
modified varlax  /harmony/enhanced/drlvm/trunk/vm/vmcore/src/kernel_classes/javasrc/java/lang/Package.java
02/07/2007 17:18:43 Final fix for HARMONY-2470.
modified varlax  /harmony/enhanced/classlib/trunk/modules/luni/src/test/java/org/apache/harmony/luni/tests/java/lang/PackageTest.java
02/07/2007 17:18:43 Final fix for HARMONY-2470.
modified varlax  /harmony/enhanced/drlvm/trunk/vm/vmcore/src/kernel_classes/javasrc/java/lang/Package.java
02/07/2007 17:18:43 Final fix for HARMONY-2470.
modified varlax  /harmony/enhanced/classlib/trunk/modules/luni/src/test/java/org/apache/harmony/luni/tests/java/lang/PackageTest.java
02/07/2007 17:18:43 Final fix for HARMONY-2470.
add cc-drlvm log20070207170414Lbuild.103 02/07/2007 17:04:14drlvm
add cc-classlib log20070207165730Lbuild.88 02/07/2007 16:57:30classlib
add cc-drlvm log20070207153452Lbuild.102 02/07/2007 15:34:52drlvm
add cc-classlib log20070207151703Lbuild.87 02/07/2007 15:17:03classlib
modified apetrenko  /harmony/enhanced/classlib/trunk/modules/swing/src/main/java/common/org/apache/harmony/x/swing/internal/nls/messages.properties
02/07/2007 15:03:40 The patch for HARMONY-1750 has been reverted.The issue covered by more
general patch of HARMONY-2782
modified apetrenko  /harmony/enhanced/classlib/trunk/modules/swing/src/main/java/common/javax/swing/text/DefaultCaret.java
02/07/2007 15:03:40 The patch for HARMONY-1750 has been reverted.The issue covered by more
general patch of HARMONY-2782

Mime
View raw message