harmony-alerts mailing list archives

Site index · List index
Message view « Date » · « Thread »
Top « Date » · « Thread »
From nom...@intel.com
Subject [build-test alert] BUILD FAILED Linux SUSE 9 64bit gcc debug: classlib over drlvm
Date Tue, 06 Feb 2007 16:51:03 GMT
BUILD FAILED:
	Ant Error Message:
/export/cruise/trunk/cc/projects/classlib/trunk/build.xml:167: The following error occurred while executing this line: /export/cruise/trunk/cc/projects/classlib/trunk/make/build-test.xml:138: There were test errors.

Date of build:	02/06/2007 21:28:35
Time to build:	81 minutes 52 seconds
Last changed:	02/06/2007 21:18:31
Last log entry:	Applying patch from HARMONY-2429 ([classlib][math] java.math.BigDecimal(-0.0) returns wrong object)

***********************************************************
Errors/Warnings:	(352)
            
Test java.awt.DimensionTest FAILED
Test java.awt.PointTest FAILED
Test java.awt.PolygonTest FAILED
Test java.awt.RectangleTest FAILED
Test java.awt.geom.AffineTransformTest FAILED
Test java.awt.geom.Arc2DTest FAILED (timeout)
Test java.awt.geom.Ellipse2DTest FAILED
Test java.awt.geom.GeneralPathTest FAILED
Test java.awt.geom.QuadCurve2DTest FAILED
Test java.awt.geom.RectangularShapeTest FAILED
Test java.awt.geom.RoundRectangle2DDoubleTest FAILED
Test java.awt.geom.RoundRectangle2DFloatTest FAILED
Test org.apache.harmony.luni.tests.java.lang.DoubleTest FAILED
Test org.apache.harmony.luni.tests.java.lang.FloatTest FAILED
Test org.apache.harmony.luni.tests.java.lang.MathTest FAILED
Test org.apache.harmony.luni.tests.java.lang.StrictMathTest FAILED
Test org.apache.harmony.luni.tests.java.lang.String2Test FAILED
Test tests.api.java.io.PrintStreamTest FAILED
Test tests.api.java.util.FormatterTest FAILED
Test tests.api.java.util.PriorityQueueTest FAILED
Test org.apache.harmony.tests.java.math.BigDecimalArithmeticTest FAILED
Test org.apache.harmony.tests.java.math.BigDecimalCompareTest FAILED
Test org.apache.harmony.tests.java.math.BigDecimalConstructorsTest FAILED
Test org.apache.harmony.tests.java.math.BigDecimalConvertTest FAILED
Test org.apache.harmony.tests.java.math.BigDecimalScaleOperationsTest FAILED
Test org.apache.harmony.tests.java.math.BigIntegerToStringTest FAILED
Test tests.api.java.math.BigIntegerTest FAILED
Test org.apache.harmony.pack200.tests.CodecTest FAILED
Test javax.print.attribute.ResolutionSyntaxTest FAILED
Test javax.print.attribute.RunAllAttributesTests FAILED
Test javax.print.attribute.Size2DSyntaxTest FAILED
Test javax.print.attribute.standard.MediaPrintableAreaTest FAILED
Test javax.print.attribute.standard.MediaSizeTest FAILED
Test org.apache.harmony.sound.tests.javax.sound.sampled.FloatControlTest FAILED
Test org.apache.harmony.text.tests.java.text.NumberFormatTest FAILED

========================================
Testing class libraries...
========================================
Checking for depends/jars/yoko_M2-20070130/yoko.jar
Checking for depends/jars/yoko_M2-20070130/yoko-core.jar
Checking for depends/jars/yoko_M2-20070130/yoko-rmi-impl.jar
Checking for depends/jars/yoko_M2-20070130/yoko-rmi-spec.jar
Checking for depends/jars/bcel-5.2/bcel-5.2.jar
Checking for depends/jars/xalan-j_2.7.0/xalan.jar
Checking for depends/jars/xerces_2.8.0/resolver.jar
Checking for depends/jars/xerces_2.8.0/xercesImpl.jar
Checking for depends/jars/xerces_2.8.0/xml-apis.jar
Checking for depends/jars/junit_3.8.2/junit.jar
Checking for depends/jars/bcprov-jdk15-134/bcprov.jar
Checking for depends/jars/icu4j_3.4.4/icu4j_3_4_4.jar
Checking for depends/jars/mx4j_3.0.1/mx4j.jar
Checking for depends/jars/mx4j_3.0.1/mx4j-remote.jar
Checking for depends/jars/ecj_3.2/ecj_3.2.jar
Checking for depends/jars/jetty/jetty-6.0.0.jar
Checking for depends/jars/jetty/jetty-util-6.0.0.jar
Checking for depends/jars/jetty/servlet-api-2.5-6.0.0.jar
Checking for depends/libs/build/lcms/icc34.h
Checking for depends/libs/build/lcms/lcms.h
Checking for depends/libs/build/png/pngconf.h
Checking for depends/libs/build/png/png.h
Checking for depends/libs/build/jpeg/jconfig.lnx
Checking for depends/libs/build/jpeg/jpeglib.h
Checking for depends/libs/build/jpeg/jmorecfg.h
Checking for depends/libs/build/jpeg/jerror.h
Checking for depends/libs/build/lcms/liblcms.linux.x86_64
Checking for depends/libs/build/png/libpng.linux.x86_64
Checking for depends/libs/build/jpeg/libjpeg.linux.x86_64
Since fork is false, ignoring memoryMaximumSize setting
Compiling ACCESSIBILITY classes
Compiling ACCESSIBILITY tests
Since fork is false, ignoring memoryMaximumSize setting
Compiling ANNOTATION classes
Compiling ANNOTATION tests
Since fork is false, ignoring memoryMaximumSize setting
Compiling APPLET classes
Compiling APPLET tests
Since fork is false, ignoring memoryMaximumSize setting
Compiling ARCHIVE classes
Compiling ARCHIVE tests
Since fork is false, ignoring memoryMaximumSize setting
Compiling AUTH classes
Compiling AUTH tests
Since fork is false, ignoring memoryMaximumSize setting
Compiling AWT classes
Compiling AWT tests
Since fork is false, ignoring memoryMaximumSize setting
java.lang.RuntimeException: expected from EDT
	at java.awt.EventDispatchThreadRTest$1.run(EventDispatchThreadRTest.java:29)
	at java.awt.event.InvocationEvent.runAndNotify(InvocationEvent.java:98)
	at java.awt.event.InvocationEvent.dispatch(InvocationEvent.java:77)
	at java.awt.EventQueueCore.dispatchEventImpl(EventQueueCore.java:138)
	at java.awt.EventQueue.dispatchEvent(EventQueue.java:144)
	at java.awt.EventDispatchThread.runModalLoop(EventDispatchThread.java:73)
	at java.awt.EventDispatchThread.run(EventDispatchThread.java:45)
Compiling BEANS classes
Compiling support classes for BEANS tests
Compiling internal BEANS tests
Compiling BEANS tests
Since fork is false, ignoring memoryMaximumSize setting
Running internal BEANS tests
Running BEANS tests
Compiling CRYPTO classes
Compiling CRYPTO test support files
Since fork is false, ignoring memoryMaximumSize setting
Compiling CRYPTO api tests
Since fork is false, ignoring memoryMaximumSize setting
Compiling CRYPTO api injected tests
Since fork is false, ignoring memoryMaximumSize setting
Compiling CRYPTO impl injected tests
Since fork is false, ignoring memoryMaximumSize setting
Compiling CRYPTO impl tests
Since fork is false, ignoring memoryMaximumSize setting
Running CRYPTO api tests
Running CRYPTO api.injected tests
Running CRYPTO impl tests
Running CRYPTO impl injected tests
Compiling ImageIO classes
Compiling ImageIO tests
Compiling INSTRUMENT classes
Compiling INSTRUMENT tests
Since fork is false, ignoring memoryMaximumSize setting
Compiling JNDI classes
Compiling JNDI tests
Since fork is false, ignoring memoryMaximumSize setting
Compiling LANG-MANAGEMENT classes
Compiling LANG-MANAGEMENT API tests
Compiling LANG-MANAGEMENT Implementation tests
Compiling LOGGING classes
Compiling LOGGING tests
Since fork is false, ignoring memoryMaximumSize setting
Feb 6, 2007 9:58:43 PM org.apache.harmony.logging.tests.java.util.logging.LogRecordTest testGetSourceDefaultValue
SEVERE: test msg, pls. ignore itb
Feb 6, 2007 9:58:43 PM null null
SEVERE: test msg, pls. ignore itb
Feb 6, 2007 9:58:43 PM null null
SEVERE: test msg, pls. ignore itb
Feb 6, 2007 9:58:43 PM className null
SEVERE: test msg, pls. ignore itb
Feb 6, 2007 9:58:43 PM org.apache.harmony.logging.tests.java.util.logging.LogRecordTest testGetSourceDefaultValue
SEVERE: test msg, pls. ignore itb
Feb 6, 2007 9:58:43 PM org.apache.harmony.logging.tests.java.util.logging.LogRecordTest$RecordFactory log
SEVERE: test msg, pls. ignore itb
Feb 6, 2007 9:58:43 PM null null
SEVERE: test msg, pls. ignore itb
Compiling LUNI classes
Compiling LUNI JUnit Tests
Since fork is false, ignoring memoryMaximumSize setting
Running LUNI JUnit Tests
java.io.IOException: Stream is closed
	at java.io.BufferedInputStream.read(BufferedInputStream.java:247)
	at java.io.FilterInputStream.read(FilterInputStream.java:137)
	at tests.support.Support_Exec$2.run(Support_Exec.java:199)
	at java.lang.Thread.run(Thread.java:661)
Compiling MATH classes
Compiling MATH tests
Since fork is false, ignoring memoryMaximumSize setting
Compiling MISC classes
Compiling MISC tests
Since fork is false, ignoring memoryMaximumSize setting
Compiling NIO classes
Compiling NIO tests
Since fork is false, ignoring memoryMaximumSize setting
Compiling NIO_CHAR classes
Compiling NIO_CHAR tests
Since fork is false, ignoring memoryMaximumSize setting
Cannot find unmappable byte array for US-ASCII
Cannot find unmappable byte array for gb18030
Cannot find unmappable byte array for ISO-8859-1
Cannot find malform byte array for ISO-8859-1
Cannot find unmappable byte array for UTF-16BE
Cannot find malform byte array for UTF-16BE
Cannot find unmappable byte array for UTF-16LE
Cannot find malform byte array for UTF-16LE
Cannot find unmappable byte array for UTF-8
Compiling PACK200 classes
Compiling PACK200 tests
Since fork is false, ignoring memoryMaximumSize setting
Running PACK200 tests
Compiling PREFS classes
Compiling PREFS tests
Since fork is false, ignoring memoryMaximumSize setting
Compiling PRINT classes
Compiling Print tests
Since fork is false, ignoring memoryMaximumSize setting
java.net.ConnectException: localhost/127.0.0.1:631 - Connection refused
	at org.apache.harmony.luni.net.PlainSocketImpl.connect(PlainSocketImpl.java:229)
	at org.apache.harmony.luni.net.PlainSocketImpl.connect(PlainSocketImpl.java:508)
	at java.net.Socket.connect(Socket.java:932)
	at org.apache.harmony.luni.internal.net.www.protocol.http.HttpURLConnection.getHTTPConnection(HttpURLConnection.java:636)
	at org.apache.harmony.luni.internal.net.www.protocol.http.HttpURLConnection.connect(HttpURLConnection.java:617)
	at org.apache.harmony.x.print.ipp.IppClient.request(IppClient.java:111)
	at org.apache.harmony.x.print.ipp.IppClient.request(IppClient.java:87)
	at org.apache.harmony.x.print.cups.CUPSPrintServiceProvider.findDefaultPrintService(CUPSPrintServiceProvider.java:471)
	at org.apache.harmony.x.print.cups.CUPSPrintServiceProvider.getDefaultPrintService(CUPSPrintServiceProvider.java:168)
	at javax.print.PrintServiceLookup.lookupDefaultPrintService(PrintServiceLookup.java:138)
	at javax.print.attribute.HashAttributeTest.testAdd2(HashAttributeTest.java)
	at java.lang.reflect.VMReflection.invokeMethod(VMReflection.java)
	at java.lang.reflect.Method.invoke(Method.java:381)
	at junit.framework.TestCase.runTest(TestCase.java:154)
	at junit.framework.TestCase.runBare(TestCase.java:125)
	at junit.framework.TestResult$1.protect(TestResult.java:106)
	at junit.framework.TestResult.runProtected(TestResult.java)
	at junit.framework.TestResult.run(TestResult.java:104)
	at junit.framework.TestCase.run(TestCase.java)
	at junit.framework.TestSuite.runTest(TestSuite.java)
	at junit.framework.TestSuite.run(TestSuite.java:202)
	at org.apache.tools.ant.taskdefs.optional.junit.JUnitTestRunner.run(JUnitTestRunner.java:297)
	at org.apache.tools.ant.taskdefs.optional.junit.JUnitTestRunner.launch(JUnitTestRunner.java:670)
	at org.apache.tools.ant.taskdefs.optional.junit.JUnitTestRunner.main(JUnitTestRunner.java:567)
java.net.ConnectException: localhost/127.0.0.1:631 - Connection refused
	at org.apache.harmony.luni.net.PlainSocketImpl.connect(PlainSocketImpl.java:229)
	at org.apache.harmony.luni.net.PlainSocketImpl.connect(PlainSocketImpl.java:508)
	at java.net.Socket.connect(Socket.java:932)
	at org.apache.harmony.luni.internal.net.www.protocol.http.HttpURLConnection.getHTTPConnection(HttpURLConnection.java:636)
	at org.apache.harmony.luni.internal.net.www.protocol.http.HttpURLConnection.connect(HttpURLConnection.java:617)
	at org.apache.harmony.x.print.ipp.IppClient.request(IppClient.java:111)
	at org.apache.harmony.x.print.ipp.IppClient.request(IppClient.java:87)
	at org.apache.harmony.x.print.cups.CUPSPrintServiceProvider.findDefaultPrintService(CUPSPrintServiceProvider.java:471)
	at org.apache.harmony.x.print.cups.CUPSPrintServiceProvider.getDefaultPrintService(CUPSPrintServiceProvider.java:168)
	at javax.print.PrintServiceLookup.lookupDefaultPrintService(PrintServiceLookup.java:138)
	at javax.print.attribute.HashAttributeTest.testEquals(HashAttributeTest.java:283)
	at java.lang.reflect.VMReflection.invokeMethod(VMReflection.java)
	at java.lang.reflect.Method.invoke(Method.java:381)
	at junit.framework.TestCase.runTest(TestCase.java:154)
	at junit.framework.TestCase.runBare(TestCase.java:125)
	at junit.framework.TestResult$1.protect(TestResult.java:106)
	at junit.framework.TestResult.runProtected(TestResult.java)
	at junit.framework.TestResult.run(TestResult.java:104)
	at junit.framework.TestCase.run(TestCase.java)
	at junit.framework.TestSuite.runTest(TestSuite.java)
	at junit.framework.TestSuite.run(TestSuite.java:202)
	at org.apache.tools.ant.taskdefs.optional.junit.JUnitTestRunner.run(JUnitTestRunner.java:297)
	at org.apache.tools.ant.taskdefs.optional.junit.JUnitTestRunner.launch(JUnitTestRunner.java:670)
	at org.apache.tools.ant.taskdefs.optional.junit.JUnitTestRunner.main(JUnitTestRunner.java:567)
java.net.ConnectException: localhost/127.0.0.1:631 - Connection refused
	at org.apache.harmony.luni.net.PlainSocketImpl.connect(PlainSocketImpl.java:229)
	at org.apache.harmony.luni.net.PlainSocketImpl.connect(PlainSocketImpl.java:508)
	at java.net.Socket.connect(Socket.java:932)
	at org.apache.harmony.luni.internal.net.www.protocol.http.HttpURLConnection.getHTTPConnection(HttpURLConnection.java:636)
	at org.apache.harmony.luni.internal.net.www.protocol.http.HttpURLConnection.connect(HttpURLConnection.java:617)
	at org.apache.harmony.x.print.ipp.IppClient.request(IppClient.java:111)
	at org.apache.harmony.x.print.ipp.IppClient.request(IppClient.java:87)
	at org.apache.harmony.x.print.cups.CUPSPrintServiceProvider.findDefaultPrintService(CUPSPrintServiceProvider.java:471)
	at org.apache.harmony.x.print.cups.CUPSPrintServiceProvider.getDefaultPrintService(CUPSPrintServiceProvider.java:168)
	at javax.print.PrintServiceLookup.lookupDefaultPrintService(PrintServiceLookup.java:138)
	at javax.print.attribute.HashAttributeTest.testAdd2(HashAttributeTest.java)
	at java.lang.reflect.VMReflection.invokeMethod(VMReflection.java)
	at java.lang.reflect.Method.invoke(Method.java:381)
	at junit.framework.TestCase.runTest(TestCase.java:154)
	at junit.framework.TestCase.runBare(TestCase.java:125)
	at junit.framework.TestResult$1.protect(TestResult.java:106)
	at junit.framework.TestResult.runProtected(TestResult.java)
	at junit.framework.TestResult.run(TestResult.java:104)
	at junit.framework.TestCase.run(TestCase.java)
	at junit.framework.TestSuite.runTest(TestSuite.java)
	at junit.framework.TestSuite.run(TestSuite.java:202)
	at junit.framework.TestSuite.runTest(TestSuite.java)
	at junit.framework.TestSuite.run(TestSuite.java:202)
	at org.apache.tools.ant.taskdefs.optional.junit.JUnitTestRunner.run(JUnitTestRunner.java:297)
	at org.apache.tools.ant.taskdefs.optional.junit.JUnitTestRunner.launch(JUnitTestRunner.java:670)
	at org.apache.tools.ant.taskdefs.optional.junit.JUnitTestRunner.main(JUnitTestRunner.java:567)
java.net.ConnectException: localhost/127.0.0.1:631 - Connection refused
	at org.apache.harmony.luni.net.PlainSocketImpl.connect(PlainSocketImpl.java:229)
	at org.apache.harmony.luni.net.PlainSocketImpl.connect(PlainSocketImpl.java:508)
	at java.net.Socket.connect(Socket.java:932)
	at org.apache.harmony.luni.internal.net.www.protocol.http.HttpURLConnection.getHTTPConnection(HttpURLConnection.java:636)
	at org.apache.harmony.luni.internal.net.www.protocol.http.HttpURLConnection.connect(HttpURLConnection.java:617)
	at org.apache.harmony.x.print.ipp.IppClient.request(IppClient.java:111)
	at org.apache.harmony.x.print.ipp.IppClient.request(IppClient.java:87)
	at org.apache.harmony.x.print.cups.CUPSPrintServiceProvider.findDefaultPrintService(CUPSPrintServiceProvider.java:471)
	at org.apache.harmony.x.print.cups.CUPSPrintServiceProvider.getDefaultPrintService(CUPSPrintServiceProvider.java:168)
	at javax.print.PrintServiceLookup.lookupDefaultPrintService(PrintServiceLookup.java:138)
	at javax.print.attribute.HashAttributeTest.testEquals(HashAttributeTest.java:283)
	at java.lang.reflect.VMReflection.invokeMethod(VMReflection.java)
	at java.lang.reflect.Method.invoke(Method.java:381)
	at junit.framework.TestCase.runTest(TestCase.java:154)
	at junit.framework.TestCase.runBare(TestCase.java:125)
	at junit.framework.TestResult$1.protect(TestResult.java:106)
	at junit.framework.TestResult.runProtected(TestResult.java)
	at junit.framework.TestResult.run(TestResult.java:104)
	at junit.framework.TestCase.run(TestCase.java)
	at junit.framework.TestSuite.runTest(TestSuite.java)
	at junit.framework.TestSuite.run(TestSuite.java:202)
	at junit.framework.TestSuite.runTest(TestSuite.java)
	at junit.framework.TestSuite.run(TestSuite.java:202)
	at org.apache.tools.ant.taskdefs.optional.junit.JUnitTestRunner.run(JUnitTestRunner.java:297)
	at org.apache.tools.ant.taskdefs.optional.junit.JUnitTestRunner.launch(JUnitTestRunner.java:670)
	at org.apache.tools.ant.taskdefs.optional.junit.JUnitTestRunner.main(JUnitTestRunner.java:567)
Compiling REGEX classes
Compiling REGEX tests
Since fork is false, ignoring memoryMaximumSize setting
Compiling RMI classes
Compiling RMI api tests
Since fork is false, ignoring memoryMaximumSize setting
Running RMI api tests
Unexporting MyRemoteObject1[UnicastServerRef[endpoint:[[127.0.0.2:35336]](local), ObjID[65536, UID[-66f19060:11097e18b0b:-7fff]]]] ...
Done.
Unexporting MyRemoteObject1[UnicastServerRef[endpoint:[[127.0.0.2:35337]](local), ObjID[65537, UID[-66f19060:11097e18b0b:-7ffe]]]] ...
Done.
Unexporting MyRemoteObject1[UnicastServerRef[endpoint:[[127.0.0.2:35338]](local), ObjID[65538, UID[-66f19060:11097e18b0b:-7ffd]]]] ...
Done.
Unexporting MyRemoteObject1[UnicastServerRef[endpoint:[[127.0.0.2:35339]](local), ObjID[65539, UID[-66f19060:11097e18b0b:-7ffc]]]] ...
Done.
Unexporting MyRemoteObject1[UnicastServerRef[endpoint:[[127.0.0.2:35340]](local), ObjID[65540, UID[-66f19060:11097e18b0b:-7ffb]]]] ...
Done.
Unexporting MyRemoteObject1[UnicastServerRef[endpoint:[[127.0.0.2:35341]](local), ObjID[65541, UID[-66f19060:11097e18b0b:-7ffa]]]] ...
Done.
Unexporting MyRemoteObject1[UnicastServerRef[endpoint:[[127.0.0.2:35342]](local), ObjID[65542, UID[-66f19060:11097e18b0b:-7ff9]]]] ...
Done.
Unexporting MyRemoteObject1[UnicastServerRef[endpoint:[[127.0.0.2:35343]](local), ObjID[65543, UID[-66f19060:11097e18b0b:-7ff8]]]] ...
Done.
Compiling SECURITY classes
Compiling SECURITY test support files
Since fork is false, ignoring memoryMaximumSize setting
Compiling SECURITY api tests
Since fork is false, ignoring memoryMaximumSize setting
Compiling SECURITY api injected tests
Since fork is false, ignoring memoryMaximumSize setting
Compiling SECURITY impl injected tests
Since fork is false, ignoring memoryMaximumSize setting
Compiling SECURITY impl tests
Since fork is false, ignoring memoryMaximumSize setting
Running SECURITY api tests
Running SECURITY api.injected tests
Running SECURITY impl tests
Running SECURITY impl injected tests
Compiling SOUND classes
Compiling SOUND tests
Since fork is false, ignoring memoryMaximumSize setting
Compiling SQL classes
Compiling SQL tests
Since fork is false, ignoring memoryMaximumSize setting
Compiling Sun Compat classes
Compiling SUNCOMPAT tests
Compiling TEXT classes
Compiling TEXT tests
Since fork is false, ignoring memoryMaximumSize setting
Compiling TOOLS classes
Compiling Tools tests
Since fork is false, ignoring memoryMaximumSize setting
Compiling X-NET classes
Compiling X-NET test support files
Since fork is false, ignoring memoryMaximumSize setting
Compiling X-NET api tests
Since fork is false, ignoring memoryMaximumSize setting
Compiling X-NET impl injected tests
Since fork is false, ignoring memoryMaximumSize setting
Compiling X-NET impl tests
Since fork is false, ignoring memoryMaximumSize setting
Running X-NET api tests
Running X-NET impl tests
Running X-NET impl injected tests
The test report is in /export/cruise/trunk/cc/projects/classlib/trunk/build/test_report/html/index.html

***********************************************************
Unit Tests: (14861)
        
error: unknown java.awt.geom.Arc2DTest
error: testPowMathContext org.apache.harmony.tests.java.math.BigDecimalArithmeticTest
error: testDivideToIntegralValueMathContextUP org.apache.harmony.tests.java.math.BigDecimalArithmeticTest
error: testDivideAndRemainderMathContextUP org.apache.harmony.tests.java.math.BigDecimalArithmeticTest
error: testRemainderMathContextHALF_DOWN org.apache.harmony.tests.java.math.BigDecimalArithmeticTest
error: testValueOfDoubleNeg org.apache.harmony.tests.java.math.BigDecimalConvertTest
error: testValueOfDoublePos1 org.apache.harmony.tests.java.math.BigDecimalConvertTest
error: testValueOfDoublePos2 org.apache.harmony.tests.java.math.BigDecimalConvertTest
error: testValueOfDoublePos3 org.apache.harmony.tests.java.math.BigDecimalConvertTest
error: testRadix10Neg org.apache.harmony.tests.java.math.BigIntegerToStringTest
error: testRadix16Neg org.apache.harmony.tests.java.math.BigIntegerToStringTest
error: testRadix16Pos org.apache.harmony.tests.java.math.BigIntegerToStringTest
error: testRadix24Neg org.apache.harmony.tests.java.math.BigIntegerToStringTest
error: testRadix24Pos org.apache.harmony.tests.java.math.BigIntegerToStringTest
error: testRadix36Neg org.apache.harmony.tests.java.math.BigIntegerToStringTest
error: testRadix36Pos org.apache.harmony.tests.java.math.BigIntegerToStringTest
error: test_formatLjava_lang_String$LBigInteger tests.api.java.util.FormatterTest
error: test_ConstructorLjava_util_Colleciton_from_priorityqueue tests.api.java.util.PriorityQueueTest
error: test_ConstructorLjava_util_Colleciton_from_sortedset tests.api.java.util.PriorityQueueTest
error: test_ConstructorLjava_util_PriorityQueue tests.api.java.util.PriorityQueueTest
error: test_ConstructorLjava_util_SortedSet tests.api.java.util.PriorityQueueTest
failure: testSetSize3 java.awt.DimensionTest
failure: testSetLocationDouble1 java.awt.PointTest
failure: testSetLocationDouble2 java.awt.PointTest
failure: testSetLocationDouble3 java.awt.PointTest
failure: testSetLocationDouble4 java.awt.PointTest
failure: testSetLocationDouble5 java.awt.PointTest
failure: testGetBounds java.awt.PolygonTest
failure: testGetBoundingBox java.awt.PolygonTest
failure: testGetBounds2D java.awt.PolygonTest
failure: testSetRect java.awt.RectangleTest
failure: testSetToRotation1 java.awt.geom.AffineTransformTest
failure: testSetToRotation2 java.awt.geom.AffineTransformTest
failure: testGetRotateInstance1 java.awt.geom.AffineTransformTest
failure: testGetRotateInstance2 java.awt.geom.AffineTransformTest
failure: testRotate1 java.awt.geom.AffineTransformTest
failure: testRotate2 java.awt.geom.AffineTransformTest
failure: testGetPathIterator java.awt.geom.Ellipse2DTest
failure: testGetBounds java.awt.geom.GeneralPathTest
failure: testSolveQuadratic1 java.awt.geom.QuadCurve2DTest
failure: testSolveQuadratic2 java.awt.geom.QuadCurve2DTest
failure: testGetBounds java.awt.geom.QuadCurve2DTest
failure: testGetBounds java.awt.geom.RectangularShapeTest
failure: testSetFrame1 java.awt.geom.RectangularShapeTest
failure: testSetFrame2 java.awt.geom.RectangularShapeTest
failure: testSetFrame3 java.awt.geom.RectangularShapeTest
failure: testSetFrameFromCenterXY1 java.awt.geom.RectangularShapeTest
failure: testSetFrameFromCenterXY2 java.awt.geom.RectangularShapeTest
failure: testSetFrameFromCenterXY3 java.awt.geom.RectangularShapeTest
failure: testSetFrameFromCenterXY4 java.awt.geom.RectangularShapeTest
failure: testSetFrameFromCenterPP1 java.awt.geom.RectangularShapeTest
failure: testSetFrameFromCenterPP2 java.awt.geom.RectangularShapeTest
failure: testSetFrameFromCenterPP3 java.awt.geom.RectangularShapeTest
failure: testSetFrameFromCenterPP4 java.awt.geom.RectangularShapeTest
failure: testSetFrameFromDiagonalXY1 java.awt.geom.RectangularShapeTest
failure: testSetFrameFromDiagonalXY2 java.awt.geom.RectangularShapeTest
failure: testSetFrameFromDiagonalXY3 java.awt.geom.RectangularShapeTest
failure: testSetFrameFromDiagonalXY4 java.awt.geom.RectangularShapeTest
failure: testSetFrameFromDiagonalPP1 java.awt.geom.RectangularShapeTest
failure: testSetFrameFromDiagonalPP2 java.awt.geom.RectangularShapeTest
failure: testSetFrameFromDiagonalPP3 java.awt.geom.RectangularShapeTest
failure: testSetFrameFromDiagonalPP4 java.awt.geom.RectangularShapeTest
failure: testGetBounds java.awt.geom.RoundRectangle2DDoubleTest
failure: testGetBounds java.awt.geom.RoundRectangle2DFloatTest
failure: testGetPathIterator java.awt.geom.RoundRectangle2DTest
failure: testResolutionSyntax javax.print.attribute.ResolutionSyntaxTest
failure: testGetCrossFeedResolution javax.print.attribute.ResolutionSyntaxTest
failure: testGetFeedResolution javax.print.attribute.ResolutionSyntaxTest
failure: testGetFeedResolutionDphi javax.print.attribute.ResolutionSyntaxTest
failure: testGetResolution javax.print.attribute.ResolutionSyntaxTest
failure: testToStringintString javax.print.attribute.ResolutionSyntaxTest
failure: testResolutionSyntax javax.print.attribute.RunAllAttributesTests
failure: testGetCrossFeedResolution javax.print.attribute.RunAllAttributesTests
failure: testGetFeedResolution javax.print.attribute.RunAllAttributesTests
failure: testGetFeedResolutionDphi javax.print.attribute.RunAllAttributesTests
failure: testGetResolution javax.print.attribute.RunAllAttributesTests
failure: testToStringintString javax.print.attribute.RunAllAttributesTests
failure: testSize2DSyntax javax.print.attribute.RunAllAttributesTests
failure: testGetSize javax.print.attribute.RunAllAttributesTests
failure: testGetX javax.print.attribute.RunAllAttributesTests
failure: testGetXMicrometers javax.print.attribute.RunAllAttributesTests
failure: testGetYMicrometers javax.print.attribute.RunAllAttributesTests
failure: testMediaPrintableArea1 javax.print.attribute.RunAllAttributesTests
failure: testFindMedia2 javax.print.attribute.RunAllAttributesTests
failure: testGetMediaSizeForName javax.print.attribute.RunAllAttributesTests
failure: testSize2DSyntax javax.print.attribute.Size2DSyntaxTest
failure: testGetSize javax.print.attribute.Size2DSyntaxTest
failure: testGetX javax.print.attribute.Size2DSyntaxTest
failure: testGetXMicrometers javax.print.attribute.Size2DSyntaxTest
failure: testGetYMicrometers javax.print.attribute.Size2DSyntaxTest
failure: testMediaPrintableArea1 javax.print.attribute.standard.MediaPrintableAreaTest
failure: testFindMedia2 javax.print.attribute.standard.MediaSizeTest
failure: testGetMediaSizeForName javax.print.attribute.standard.MediaSizeTest
failure: test_parseDoubleLjava_lang_String org.apache.harmony.luni.tests.java.lang.DoubleTest
failure: test_toString org.apache.harmony.luni.tests.java.lang.FloatTest
failure: test_toStringF org.apache.harmony.luni.tests.java.lang.FloatTest
failure: test_acosD org.apache.harmony.luni.tests.java.lang.MathTest
failure: test_atanD org.apache.harmony.luni.tests.java.lang.MathTest
failure: test_atan2DD org.apache.harmony.luni.tests.java.lang.MathTest
failure: test_cbrt_D org.apache.harmony.luni.tests.java.lang.MathTest
failure: test_ceilD org.apache.harmony.luni.tests.java.lang.MathTest
failure: test_cosD org.apache.harmony.luni.tests.java.lang.MathTest
failure: test_cosh_D org.apache.harmony.luni.tests.java.lang.MathTest
failure: test_expD org.apache.harmony.luni.tests.java.lang.MathTest
failure: test_expm1_D org.apache.harmony.luni.tests.java.lang.MathTest
failure: test_floorD org.apache.harmony.luni.tests.java.lang.MathTest
failure: test_hypot_DD org.apache.harmony.luni.tests.java.lang.MathTest
failure: test_IEEEremainderDD org.apache.harmony.luni.tests.java.lang.MathTest
failure: test_logD org.apache.harmony.luni.tests.java.lang.MathTest
failure: test_log10_D org.apache.harmony.luni.tests.java.lang.MathTest
failure: test_log1p_D org.apache.harmony.luni.tests.java.lang.MathTest
failure: test_powDD org.apache.harmony.luni.tests.java.lang.MathTest
failure: test_rintD org.apache.harmony.luni.tests.java.lang.MathTest
failure: test_roundD org.apache.harmony.luni.tests.java.lang.MathTest
failure: test_roundF org.apache.harmony.luni.tests.java.lang.MathTest
failure: test_sinD org.apache.harmony.luni.tests.java.lang.MathTest
failure: test_sinh_D org.apache.harmony.luni.tests.java.lang.MathTest
failure: test_sqrtD org.apache.harmony.luni.tests.java.lang.MathTest
failure: test_tanD org.apache.harmony.luni.tests.java.lang.MathTest
failure: test_tanh_D org.apache.harmony.luni.tests.java.lang.MathTest
failure: test_ulp_D org.apache.harmony.luni.tests.java.lang.MathTest
failure: test_ulp_f org.apache.harmony.luni.tests.java.lang.MathTest
failure: test_acosD org.apache.harmony.luni.tests.java.lang.StrictMathTest
failure: test_atanD org.apache.harmony.luni.tests.java.lang.StrictMathTest
failure: test_atan2DD org.apache.harmony.luni.tests.java.lang.StrictMathTest
failure: test_cbrt_D org.apache.harmony.luni.tests.java.lang.StrictMathTest
failure: test_ceilD org.apache.harmony.luni.tests.java.lang.StrictMathTest
failure: test_cosD org.apache.harmony.luni.tests.java.lang.StrictMathTest
failure: test_cosh_D org.apache.harmony.luni.tests.java.lang.StrictMathTest
failure: test_expD org.apache.harmony.luni.tests.java.lang.StrictMathTest
failure: test_expm1_D org.apache.harmony.luni.tests.java.lang.StrictMathTest
failure: test_floorD org.apache.harmony.luni.tests.java.lang.StrictMathTest
failure: test_hypot_DD org.apache.harmony.luni.tests.java.lang.StrictMathTest
failure: test_IEEEremainderDD org.apache.harmony.luni.tests.java.lang.StrictMathTest
failure: test_logD org.apache.harmony.luni.tests.java.lang.StrictMathTest
failure: test_log10_D org.apache.harmony.luni.tests.java.lang.StrictMathTest
failure: test_log1p_D org.apache.harmony.luni.tests.java.lang.StrictMathTest
failure: test_powDD org.apache.harmony.luni.tests.java.lang.StrictMathTest
failure: test_rintD org.apache.harmony.luni.tests.java.lang.StrictMathTest
failure: test_roundD org.apache.harmony.luni.tests.java.lang.StrictMathTest
failure: test_roundF org.apache.harmony.luni.tests.java.lang.StrictMathTest
failure: test_sinh_D org.apache.harmony.luni.tests.java.lang.StrictMathTest
failure: test_sqrtD org.apache.harmony.luni.tests.java.lang.StrictMathTest
failure: test_tanh_D org.apache.harmony.luni.tests.java.lang.StrictMathTest
failure: test_ulp_D org.apache.harmony.luni.tests.java.lang.StrictMathTest
failure: test_ulp_f org.apache.harmony.luni.tests.java.lang.StrictMathTest
failure: test_valueOfF org.apache.harmony.luni.tests.java.lang.String2Test
failure: testCardinality org.apache.harmony.pack200.tests.CodecTest
failure: testUnsigned5 org.apache.harmony.pack200.tests.CodecTest
failure: testFloatControl org.apache.harmony.sound.tests.javax.sound.sampled.FloatControlTest
failure: testAddMathContextEqualScalePosPos org.apache.harmony.tests.java.math.BigDecimalArithmeticTest
failure: testAddMathContextEqualScaleNegNeg org.apache.harmony.tests.java.math.BigDecimalArithmeticTest
failure: testAddMathContextDiffScalePosNeg org.apache.harmony.tests.java.math.BigDecimalArithmeticTest
failure: testSubtractMathContextEqualScalePosPos org.apache.harmony.tests.java.math.BigDecimalArithmeticTest
failure: testSubtractMathContextDiffScalePosNeg org.apache.harmony.tests.java.math.BigDecimalArithmeticTest
failure: testSubtractMathContextDiffScaleNegPos org.apache.harmony.tests.java.math.BigDecimalArithmeticTest
failure: testMultiplyMathContextScalePosPos org.apache.harmony.tests.java.math.BigDecimalArithmeticTest
failure: testMultiplyMathContextDiffScalePosNeg org.apache.harmony.tests.java.math.BigDecimalArithmeticTest
failure: testMultiplyMathContextDiffScaleNegPos org.apache.harmony.tests.java.math.BigDecimalArithmeticTest
failure: testDivideBigDecimalScaleMathContextUP org.apache.harmony.tests.java.math.BigDecimalArithmeticTest
failure: testDivideBigDecimalScaleMathContextDOWN org.apache.harmony.tests.java.math.BigDecimalArithmeticTest
failure: testDivideBigDecimalScaleMathContextCEILING org.apache.harmony.tests.java.math.BigDecimalArithmeticTest
failure: testDivideBigDecimalScaleMathContextFLOOR org.apache.harmony.tests.java.math.BigDecimalArithmeticTest
failure: testDivideBigDecimalScaleMathContextHALF_UP org.apache.harmony.tests.java.math.BigDecimalArithmeticTest
failure: testDivideBigDecimalScaleMathContextHALF_DOWN org.apache.harmony.tests.java.math.BigDecimalArithmeticTest
failure: testDivideBigDecimalScaleMathContextHALF_EVEN org.apache.harmony.tests.java.math.BigDecimalArithmeticTest
failure: testDivideToIntegralValueMathContextDOWN org.apache.harmony.tests.java.math.BigDecimalArithmeticTest
failure: testRoundMathContextHALF_UP org.apache.harmony.tests.java.math.BigDecimalArithmeticTest
failure: testAbsMathContextNeg org.apache.harmony.tests.java.math.BigDecimalCompareTest
failure: testAbsMathContextPos org.apache.harmony.tests.java.math.BigDecimalCompareTest
failure: testPlusMathContextPositive org.apache.harmony.tests.java.math.BigDecimalCompareTest
failure: testPlusMathContextNegative org.apache.harmony.tests.java.math.BigDecimalCompareTest
failure: testNegateMathContextPositive org.apache.harmony.tests.java.math.BigDecimalCompareTest
failure: testNegateMathContextNegative org.apache.harmony.tests.java.math.BigDecimalCompareTest
failure: testConstrBigIntegerMathContext org.apache.harmony.tests.java.math.BigDecimalConstructorsTest
failure: testConstrBigIntegerScaleMathContext org.apache.harmony.tests.java.math.BigDecimalConstructorsTest
failure: testConstrCharIntIntMathContext org.apache.harmony.tests.java.math.BigDecimalConstructorsTest
failure: testConstrDoubleMathContext org.apache.harmony.tests.java.math.BigDecimalConstructorsTest
failure: testConstrLongMathContext org.apache.harmony.tests.java.math.BigDecimalConstructorsTest
failure: testConstrStringMathContext org.apache.harmony.tests.java.math.BigDecimalConstructorsTest
failure: testPrecision org.apache.harmony.tests.java.math.BigDecimalScaleOperationsTest
failure: testRadix10Pos org.apache.harmony.tests.java.math.BigIntegerToStringTest
failure: test_getIntegerInstance org.apache.harmony.text.tests.java.text.NumberFormatTest
failure: test_getIntegerInstanceLjava_util_Locale org.apache.harmony.text.tests.java.text.NumberFormatTest
failure: test_printD tests.api.java.io.PrintStreamTest
failure: test_printF tests.api.java.io.PrintStreamTest
failure: test_printlnD tests.api.java.io.PrintStreamTest
failure: test_printlnF tests.api.java.io.PrintStreamTest
failure: test_isProbablePrimeI tests.api.java.math.BigIntegerTest
failure: test_toStringI tests.api.java.math.BigIntegerTest
failure: test_formatLjava_lang_String$Ljava_lang_Object_BigIntegerPaddingConversion tests.api.java.util.FormatterTest
failure: test_formatLjava_lang_String$Ljava_lang_Object_FloatConversionE tests.api.java.util.FormatterTest
failure: test_formatLjava_lang_String$Ljava_lang_Object_FloatConversionG tests.api.java.util.FormatterTest
failure: test_formatLjava_lang_String$Ljava_lang_Object_FloatConversionG_Overflow tests.api.java.util.FormatterTest
failure: test_formatLjava_lang_String$Ljava_lang_Object_FloatConversionF tests.api.java.util.FormatterTest
failure: test_formatLjava_lang_String$Ljava_lang_Object_BigDecimalConversionG tests.api.java.util.FormatterTest
Unit Test Error Details:	(196)
                
Test: unknownClass: java.awt.geom.Arc2DTestjunit.framework.AssertionFailedError: Timeout occurred

Test: testPowMathContextClass: org.apache.harmony.tests.java.math.BigDecimalArithmeticTestjava.lang.IllegalArgumentException: Digits < 0
	at java.math.MathContext.<init>(MathContext.java:97)
	at java.math.BigDecimal.pow(BigDecimal.java:1111)
	at org.apache.harmony.tests.java.math.BigDecimalArithmeticTest.testPowMathContext(BigDecimalArithmeticTest.java:471)
	at java.lang.reflect.VMReflection.invokeMethod(VMReflection.java)

Test: testDivideToIntegralValueMathContextUPClass: org.apache.harmony.tests.java.math.BigDecimalArithmeticTestjava.lang.ArithmeticException: Division impossible
	at java.math.BigDecimal.divideToIntegralValue(BigDecimal.java:1005)
	at org.apache.harmony.tests.java.math.BigDecimalArithmeticTest.testDivideToIntegralValueMathContextUP(BigDecimalArithmeticTest.java:1321)
	at java.lang.reflect.VMReflection.invokeMethod(VMReflection.java)

Test: testDivideAndRemainderMathContextUPClass: org.apache.harmony.tests.java.math.BigDecimalArithmeticTestjava.lang.ArithmeticException: Division impossible
	at java.math.BigDecimal.divideToIntegralValue(BigDecimal.java:1005)
	at java.math.BigDecimal.divideAndRemainder(BigDecimal.java:1067)
	at org.apache.harmony.tests.java.math.BigDecimalArithmeticTest.testDivideAndRemainderMathContextUP(BigDecimalArithmeticTest.java:1407)
	at java.lang.reflect.VMReflection.invokeMethod(VMReflection.java)

Test: testRemainderMathContextHALF_DOWNClass: org.apache.harmony.tests.java.math.BigDecimalArithmeticTestjava.lang.ArithmeticException: Division impossible
	at java.math.BigDecimal.divideToIntegralValue(BigDecimal.java:1005)
	at java.math.BigDecimal.divideAndRemainder(BigDecimal.java:1067)
	at java.math.BigDecimal.remainder(BigDecimal.java)
	at org.apache.harmony.tests.java.math.BigDecimalArithmeticTest.testRemainderMathContextHALF_DOWN(BigDecimalArithmeticTest.java:1507)
	at java.lang.reflect.VMReflection.invokeMethod(VMReflection.java)

Test: testValueOfDoubleNegClass: org.apache.harmony.tests.java.math.BigDecimalConvertTestjava.lang.NumberFormatException: -@0
	at java.lang.Long.parse(Long.java:389)
	at java.lang.Long.parseLong(Long.java:376)
	at java.lang.Long.parseLong(Long.java)
	at java.math.BigDecimal.<init>(BigDecimal.java:313)
	at java.math.BigDecimal.<init>(BigDecimal.java:343)
	at java.math.BigDecimal.valueOf(BigDecimal.java:482)
	at org.apache.harmony.tests.java.math.BigDecimalConvertTest.testValueOfDoubleNeg(BigDecimalConvertTest.java:514)
	at java.lang.reflect.VMReflection.invokeMethod(VMReflection.java)

Test: testValueOfDoublePos1Class: org.apache.harmony.tests.java.math.BigDecimalConvertTestjava.lang.NumberFormatException: @0
	at java.lang.Long.parse(Long.java:389)
	at java.lang.Long.parseLong(Long.java:376)
	at java.lang.Long.parseLong(Long.java)
	at java.math.BigDecimal.<init>(BigDecimal.java:313)
	at java.math.BigDecimal.<init>(BigDecimal.java:343)
	at java.math.BigDecimal.valueOf(BigDecimal.java:482)
	at org.apache.harmony.tests.java.math.BigDecimalConvertTest.testValueOfDoublePos1(BigDecimalConvertTest.java:526)
	at java.lang.reflect.VMReflection.invokeMethod(VMReflection.java)

Test: testValueOfDoublePos2Class: org.apache.harmony.tests.java.math.BigDecimalConvertTestjava.lang.NumberFormatException: @0
	at java.lang.Long.parse(Long.java:389)
	at java.lang.Long.parseLong(Long.java:376)
	at java.lang.Long.parseLong(Long.java)
	at java.math.BigDecimal.<init>(BigDecimal.java:313)
	at java.math.BigDecimal.<init>(BigDecimal.java:343)
	at java.math.BigDecimal.valueOf(BigDecimal.java:482)
	at org.apache.harmony.tests.java.math.BigDecimalConvertTest.testValueOfDoublePos2(BigDecimalConvertTest.java:538)
	at java.lang.reflect.VMReflection.invokeMethod(VMReflection.java)

Test: testValueOfDoublePos3Class: org.apache.harmony.tests.java.math.BigDecimalConvertTestjava.lang.NumberFormatException: @0
	at java.lang.Long.parse(Long.java:389)
	at java.lang.Long.parseLong(Long.java:376)
	at java.lang.Long.parseLong(Long.java)
	at java.math.BigDecimal.<init>(BigDecimal.java:313)
	at java.math.BigDecimal.<init>(BigDecimal.java:343)
	at java.math.BigDecimal.valueOf(BigDecimal.java:482)
	at org.apache.harmony.tests.java.math.BigDecimalConvertTest.testValueOfDoublePos3(BigDecimalConvertTest.java:550)
	at java.lang.reflect.VMReflection.invokeMethod(VMReflection.java)

Test: testRadix10NegClass: org.apache.harmony.tests.java.math.BigIntegerToStringTestjava.lang.ArrayIndexOutOfBoundsException
	at java.math.Conversion.bigInteger2String(Conversion.java:127)
	at java.math.BigInteger.toString(BigInteger.java)
	at org.apache.harmony.tests.java.math.BigIntegerToStringTest.testRadix10Neg(BigIntegerToStringTest.java:72)
	at java.lang.reflect.VMReflection.invokeMethod(VMReflection.java)

Test: testRadix16NegClass: org.apache.harmony.tests.java.math.BigIntegerToStringTestjava.lang.ArrayIndexOutOfBoundsException
	at java.math.Conversion.bigInteger2String(Conversion.java:127)
	at java.math.BigInteger.toString(BigInteger.java)
	at org.apache.harmony.tests.java.math.BigIntegerToStringTest.testRadix16Neg(BigIntegerToStringTest.java:94)
	at java.lang.reflect.VMReflection.invokeMethod(VMReflection.java)

Test: testRadix16PosClass: org.apache.harmony.tests.java.math.BigIntegerToStringTestjava.lang.ArrayIndexOutOfBoundsException
	at java.math.Conversion.bigInteger2String(Conversion.java:124)
	at java.math.BigInteger.toString(BigInteger.java)
	at org.apache.harmony.tests.java.math.BigIntegerToStringTest.testRadix16Pos(BigIntegerToStringTest.java:105)
	at java.lang.reflect.VMReflection.invokeMethod(VMReflection.java)

Test: testRadix24NegClass: org.apache.harmony.tests.java.math.BigIntegerToStringTestjava.lang.ArrayIndexOutOfBoundsException
	at java.math.Conversion.bigInteger2String(Conversion.java:99)
	at java.math.BigInteger.toString(BigInteger.java)
	at org.apache.harmony.tests.java.math.BigIntegerToStringTest.testRadix24Neg(BigIntegerToStringTest.java:116)
	at java.lang.reflect.VMReflection.invokeMethod(VMReflection.java)

Test: testRadix24PosClass: org.apache.harmony.tests.java.math.BigIntegerToStringTestjava.lang.ArrayIndexOutOfBoundsException
	at java.math.Conversion.bigInteger2String(Conversion.java:99)
	at java.math.BigInteger.toString(BigInteger.java)
	at org.apache.harmony.tests.java.math.BigIntegerToStringTest.testRadix24Pos(BigIntegerToStringTest.java:127)
	at java.lang.reflect.VMReflection.invokeMethod(VMReflection.java)

Test: testRadix36NegClass: org.apache.harmony.tests.java.math.BigIntegerToStringTestjava.lang.ArrayIndexOutOfBoundsException
	at java.math.Conversion.bigInteger2String(Conversion.java:99)
	at java.math.BigInteger.toString(BigInteger.java)
	at org.apache.harmony.tests.java.math.BigIntegerToStringTest.testRadix36Neg(BigIntegerToStringTest.java:138)
	at java.lang.reflect.VMReflection.invokeMethod(VMReflection.java)

Test: testRadix36PosClass: org.apache.harmony.tests.java.math.BigIntegerToStringTestjava.lang.ArrayIndexOutOfBoundsException
	at java.math.Conversion.bigInteger2String(Conversion.java:99)
	at java.math.BigInteger.toString(BigInteger.java)
	at org.apache.harmony.tests.java.math.BigIntegerToStringTest.testRadix36Pos(BigIntegerToStringTest.java:149)
	at java.lang.reflect.VMReflection.invokeMethod(VMReflection.java)

Test: test_formatLjava_lang_String$LBigIntegerClass: tests.api.java.util.FormatterTestjava.lang.ArrayIndexOutOfBoundsException
	at java.math.Conversion.bigInteger2String(Conversion.java:99)
	at java.math.BigInteger.toString(BigInteger.java)
	at java.util.Formatter$Transformer.transformFromBigInteger(Formatter.java:1424)
	at java.util.Formatter$Transformer.transform(Formatter.java:857)
	at java.util.Formatter.format(Formatter.java:547)
	at java.util.Formatter.format(Formatter.java:498)
	at tests.api.java.util.FormatterTest.test_formatLjava_lang_String$LBigInteger(FormatterTest.java:2571)
	at java.lang.reflect.VMReflection.invokeMethod(VMReflection.java)

Test: test_ConstructorLjava_util_Colleciton_from_priorityqueueClass: tests.api.java.util.PriorityQueueTestjava.lang.ArrayIndexOutOfBoundsException: bad arrayCopy
	at java.lang.VMMemoryManager.arrayCopy(VMMemoryManager.java)
	at java.lang.System.arraycopy(System.java)
	at java.util.PriorityQueue.getFromPriorityQueue(PriorityQueue.java:316)
	at java.util.PriorityQueue.<init>(PriorityQueue.java:99)
	at tests.api.java.util.PriorityQueueTest.test_ConstructorLjava_util_Colleciton_from_priorityqueue(PriorityQueueTest.java:310)
	at java.lang.reflect.VMReflection.invokeMethod(VMReflection.java)

Test: test_ConstructorLjava_util_Colleciton_from_sortedsetClass: tests.api.java.util.PriorityQueueTestjava.lang.ArrayIndexOutOfBoundsException
	at java.util.PriorityQueue.getFromSortedSet(PriorityQueue.java:326)
	at java.util.PriorityQueue.<init>(PriorityQueue.java:101)
	at tests.api.java.util.PriorityQueueTest.test_ConstructorLjava_util_Colleciton_from_sortedset(PriorityQueueTest.java:328)
	at java.lang.reflect.VMReflection.invokeMethod(VMReflection.java)

Test: test_ConstructorLjava_util_PriorityQueueClass: tests.api.java.util.PriorityQueueTestjava.lang.ArrayIndexOutOfBoundsException: bad arrayCopy
	at java.lang.VMMemoryManager.arrayCopy(VMMemoryManager.java)
	at java.lang.System.arraycopy(System.java)
	at java.util.PriorityQueue.getFromPriorityQueue(PriorityQueue.java:316)
	at java.util.PriorityQueue.<init>(PriorityQueue.java:117)
	at tests.api.java.util.PriorityQueueTest.test_ConstructorLjava_util_PriorityQueue(PriorityQueueTest.java:347)
	at java.lang.reflect.VMReflection.invokeMethod(VMReflection.java)

Test: test_ConstructorLjava_util_SortedSetClass: tests.api.java.util.PriorityQueueTestjava.lang.ArrayIndexOutOfBoundsException
	at java.util.PriorityQueue.getFromSortedSet(PriorityQueue.java:326)
	at java.util.PriorityQueue.<init>(PriorityQueue.java:130)
	at tests.api.java.util.PriorityQueueTest.test_ConstructorLjava_util_SortedSet(PriorityQueueTest.java:379)
	at java.lang.reflect.VMReflection.invokeMethod(VMReflection.java)

Test: testSetSize3Class: java.awt.DimensionTestjunit.framework.AssertionFailedError: expected:<java.awt.Dimension[width=0,height=0]> but was:<java.awt.Dimension[width=4,height=5]>
	at java.awt.DimensionTest.testSetSize3(DimensionTest.java:97)
	at java.lang.reflect.VMReflection.invokeMethod(VMReflection.java)

Test: testSetLocationDouble1Class: java.awt.PointTestjunit.framework.AssertionFailedError: expected:<java.awt.Point[x=3,y=4]> but was:<java.awt.Point[x=0,y=0]>
	at java.awt.PointTest.testSetLocationDouble1(PointTest.java:71)
	at java.lang.reflect.VMReflection.invokeMethod(VMReflection.java)

Test: testSetLocationDouble2Class: java.awt.PointTestjunit.framework.AssertionFailedError: expected:<java.awt.Point[x=5,y=7]> but was:<java.awt.Point[x=0,y=7]>
	at java.awt.PointTest.testSetLocationDouble2(PointTest.java:77)
	at java.lang.reflect.VMReflection.invokeMethod(VMReflection.java)

Test: testSetLocationDouble3Class: java.awt.PointTestjunit.framework.AssertionFailedError: expected:<java.awt.Point[x=8,y=9]> but was:<java.awt.Point[x=0,y=0]>
	at java.awt.PointTest.testSetLocationDouble3(PointTest.java:83)
	at java.lang.reflect.VMReflection.invokeMethod(VMReflection.java)

Test: testSetLocationDouble4Class: java.awt.PointTestjunit.framework.AssertionFailedError: expected:<java.awt.Point[x=2147483647,y=-2147483648]> but was:<java.awt.Point[x=2147483647,y=-2147483647]>
	at java.awt.PointTest.testSetLocationDouble4(PointTest.java:92)
	at java.lang.reflect.VMReflection.invokeMethod(VMReflection.java)

Test: testSetLocationDouble5Class: java.awt.PointTestjunit.framework.AssertionFailedError: expected:<java.awt.Point[x=2147483647,y=-2147483648]> but was:<java.awt.Point[x=2147483647,y=-2147483647]>
	at java.awt.PointTest.testSetLocationDouble5(PointTest.java:99)
	at java.lang.reflect.VMReflection.invokeMethod(VMReflection.java)

Test: testGetBoundsClass: java.awt.PolygonTestjunit.framework.AssertionFailedError: expected:<java.awt.Rectangle[x=1,y=2,width=2,height=3]> but was:<java.awt.Rectangle[x=0,y=0,width=0,height=0]>
	at java.awt.PolygonTest.testGetBounds(PolygonTest.java:133)
	at java.lang.reflect.VMReflection.invokeMethod(VMReflection.java)

Test: testGetBoundingBoxClass: java.awt.PolygonTestjunit.framework.AssertionFailedError: expected:<java.awt.Rectangle[x=1,y=2,width=2,height=3]> but was:<java.awt.Rectangle[x=0,y=0,width=0,height=0]>
	at java.awt.PolygonTest.testGetBoundingBox(PolygonTest.java:149)
	at java.lang.reflect.VMReflection.invokeMethod(VMReflection.java)

Test: testGetBounds2DClass: java.awt.PolygonTestjunit.framework.AssertionFailedError: expected:<java.awt.geom.Rectangle2D$Double[x=1.0,y=2.0,width=2.0,height=3.0]> but was:<java.awt.Rectangle[x=0,y=0,width=0,height=0]>
	at java.awt.PolygonTest.testGetBounds2D(PolygonTest.java:164)
	at java.lang.reflect.VMReflection.invokeMethod(VMReflection.java)

Test: testSetRectClass: java.awt.RectangleTestjunit.framework.AssertionFailedError: expected:<java.awt.Rectangle[x=5,y=6,width=7,height=8]> but was:<java.awt.Rectangle[x=0,y=0,width=0,height=0]>
	at java.awt.RectangleTest.testSetRect(RectangleTest.java:144)
	at java.lang.reflect.VMReflection.invokeMethod(VMReflection.java)

Test: testSetToRotation1Class: java.awt.geom.AffineTransformTestjunit.framework.AssertionFailedError: [0,1,-1,0,0,0] Type expected:<8> but was:<0>
	at java.awt.geom.AffineTransformTest.assertEquals(AffineTransformTest.java:123)
	at java.awt.geom.AffineTransformTest.testSetToRotation1(AffineTransformTest.java:362)
	at java.lang.reflect.VMReflection.invokeMethod(VMReflection.java)

Test: testSetToRotation2Class: java.awt.geom.AffineTransformTestjunit.framework.AssertionFailedError: [0,1,-1,0,17,1] Type expected:<9> but was:<0>
	at java.awt.geom.AffineTransformTest.assertEquals(AffineTransformTest.java:123)
	at java.awt.geom.AffineTransformTest.testSetToRotation2(AffineTransformTest.java:396)
	at java.lang.reflect.VMReflection.invokeMethod(VMReflection.java)

Test: testGetRotateInstance1Class: java.awt.geom.AffineTransformTestjunit.framework.AssertionFailedError: [0,1,-1,0,0,0] Type expected:<8> but was:<0>
	at java.awt.geom.AffineTransformTest.assertEquals(AffineTransformTest.java:123)
	at java.awt.geom.AffineTransformTest.testGetRotateInstance1(AffineTransformTest.java:449)
	at java.lang.reflect.VMReflection.invokeMethod(VMReflection.java)

Test: testGetRotateInstance2Class: java.awt.geom.AffineTransformTestjunit.framework.AssertionFailedError: [0,1,-1,0,17,1] Type expected:<9> but was:<0>
	at java.awt.geom.AffineTransformTest.assertEquals(AffineTransformTest.java:123)
	at java.awt.geom.AffineTransformTest.testGetRotateInstance2(AffineTransformTest.java:478)
	at java.lang.reflect.VMReflection.invokeMethod(VMReflection.java)

Test: testRotate1Class: java.awt.geom.AffineTransformTestjunit.framework.AssertionFailedError: Matrix expected: <[4.0, 5.0, -2.0, -3.0, 6.0, 7.0]> but was: <[2.0, 3.0, 4.0, 5.0, 6.0, 7.0]>
	at java.awt.geom.GeomTestCase.fail(GeomTestCase.java:37)
	at java.awt.geom.GeomTestCase.assertEquals(GeomTestCase.java:147)
	at java.awt.geom.AffineTransformTest.assertEquals(AffineTransformTest.java:124)
	at java.awt.geom.AffineTransformTest.testRotate1(AffineTransformTest.java:553)
	at java.lang.reflect.VMReflection.invokeMethod(VMReflection.java)

Test: testRotate2Class: java.awt.geom.AffineTransformTestjunit.framework.AssertionFailedError: Matrix expected: <[-4.0, -5.0, 2.0, 3.0, @.0, @.0]> but was: <[2.0, 3.0, 4.0, 5.0, 6.0, 7.0]>
	at java.awt.geom.GeomTestCase.fail(GeomTestCase.java:37)
	at java.awt.geom.GeomTestCase.assertEquals(GeomTestCase.java:147)
	at java.awt.geom.AffineTransformTest.assertEquals(AffineTransformTest.java:124)
	at java.awt.geom.AffineTransformTest.testRotate2(AffineTransformTest.java:575)
	at java.lang.reflect.VMReflection.invokeMethod(VMReflection.java)

Test: testGetPathIteratorClass: java.awt.geom.Ellipse2DTestjunit.framework.AssertionFailedError: Failed 4/4 test(s)
	at java.awt.geom.ShapeTestCase.checkRunner(ShapeTestCase.java:522)
	at java.awt.geom.ShapeTestCase.testGetPathIterator(ShapeTestCase.java:760)
	at java.lang.reflect.VMReflection.invokeMethod(VMReflection.java)

Test: testGetBoundsClass: java.awt.geom.GeneralPathTestjunit.framework.AssertionFailedError: expected: <java.awt.Rectangle[x=1,y=2,width=0,height=0]> but was: <java.awt.Rectangle[x=0,y=0,width=0,height=0]>
	at java.awt.geom.GeomTestCase.fail(GeomTestCase.java:35)
	at java.awt.geom.GeomTestCase.assertEquals(GeomTestCase.java:129)
	at java.awt.geom.GeomTestCase.assertEquals(GeomTestCase.java)
	at java.awt.geom.GeneralPathTest.testGetBounds(GeneralPathTest.java:428)
	at java.lang.reflect.VMReflection.invokeMethod(VMReflection.java)

Test: testSolveQuadratic1Class: java.awt.geom.QuadCurve2DTestjunit.framework.AssertionFailedError: [12,-10,2] root(0) expected:<3.0> but was:<-8.378857803647928E153>
	at java.awt.geom.QuadCurve2DTest.testSolveQuadratic1(QuadCurve2DTest.java:245)
	at java.lang.reflect.VMReflection.invokeMethod(VMReflection.java)

Test: testSolveQuadratic2Class: java.awt.geom.QuadCurve2DTestjunit.framework.AssertionFailedError: [12,-10,2] root(0) expected:<3.0> but was:<-8.378857803647928E153>
	at java.awt.geom.QuadCurve2DTest.testSolveQuadratic2(QuadCurve2DTest.java:263)
	at java.lang.reflect.VMReflection.invokeMethod(VMReflection.java)

Test: testGetBoundsClass: java.awt.geom.QuadCurve2DTestjunit.framework.AssertionFailedError: java.awt.geom.QuadCurve2D$Double[x1=1.0,y1=2.0,x2=3.0,y2=4.0,x3=5.0,y3=6.0] expected:<java.awt.Rectangle[x=1,y=2,width=4,height=4]> but was:<java.awt.Rectangle[x=0,y=0,width=0,height=0]>
	at java.awt.geom.QuadCurve2DTest.testGetBounds(QuadCurve2DTest.java:283)
	at java.lang.reflect.VMReflection.invokeMethod(VMReflection.java)

Test: testGetBoundsClass: java.awt.geom.RectangularShapeTestjunit.framework.AssertionFailedError: expected:<java.awt.Rectangle[x=1,y=2,width=4,height=6]> but was:<java.awt.Rectangle[x=1,y=0,width=-1,height=7]>
	at java.awt.geom.RectangularShapeTest.testGetBounds(RectangularShapeTest.java:83)
	at java.lang.reflect.VMReflection.invokeMethod(VMReflection.java)

Test: testSetFrame1Class: java.awt.geom.RectangularShapeTestjunit.framework.AssertionFailedError: expected:<java.awt.Rectangle[x=5,y=6,width=7,height=8]> but was:<java.awt.Rectangle[x=0,y=0,width=0,height=0]>
	at java.awt.geom.RectangularShapeTest.testSetFrame1(RectangularShapeTest.java:119)
	at java.lang.reflect.VMReflection.invokeMethod(VMReflection.java)

Test: testSetFrame2Class: java.awt.geom.RectangularShapeTestjunit.framework.AssertionFailedError: expected:<java.awt.Rectangle[x=5,y=6,width=7,height=8]> but was:<java.awt.Rectangle[x=0,y=0,width=0,height=0]>
	at java.awt.geom.RectangularShapeTest.testSetFrame2(RectangularShapeTest.java:124)
	at java.lang.reflect.VMReflection.invokeMethod(VMReflection.java)

Test: testSetFrame3Class: java.awt.geom.RectangularShapeTestjunit.framework.AssertionFailedError: expected:<java.awt.Rectangle[x=5,y=6,width=7,height=8]> but was:<java.awt.Rectangle[x=0,y=0,width=0,height=0]>
	at java.awt.geom.RectangularShapeTest.testSetFrame3(RectangularShapeTest.java:129)
	at java.lang.reflect.VMReflection.invokeMethod(VMReflection.java)

Test: testSetFrameFromCenterXY1Class: java.awt.geom.RectangularShapeTestjunit.framework.AssertionFailedError: expected:<java.awt.Rectangle[x=3,y=3,width=4,height=6]> but was:<java.awt.Rectangle[x=0,y=0,width=0,height=0]>
	at java.awt.geom.RectangularShapeTest.testSetFrameFromCenterXY1(RectangularShapeTest.java:134)
	at java.lang.reflect.VMReflection.invokeMethod(VMReflection.java)

Test: testSetFrameFromCenterXY2Class: java.awt.geom.RectangularShapeTestjunit.framework.AssertionFailedError: expected:<java.awt.Rectangle[x=3,y=3,width=4,height=6]> but was:<java.awt.Rectangle[x=0,y=0,width=0,height=0]>
	at java.awt.geom.RectangularShapeTest.testSetFrameFromCenterXY2(RectangularShapeTest.java:139)
	at java.lang.reflect.VMReflection.invokeMethod(VMReflection.java)

Test: testSetFrameFromCenterXY3Class: java.awt.geom.RectangularShapeTestjunit.framework.AssertionFailedError: expected:<java.awt.Rectangle[x=3,y=3,width=4,height=6]> but was:<java.awt.Rectangle[x=0,y=0,width=0,height=0]>
	at java.awt.geom.RectangularShapeTest.testSetFrameFromCenterXY3(RectangularShapeTest.java:144)
	at java.lang.reflect.VMReflection.invokeMethod(VMReflection.java)

Test: testSetFrameFromCenterXY4Class: java.awt.geom.RectangularShapeTestjunit.framework.AssertionFailedError: expected:<java.awt.Rectangle[x=3,y=3,width=4,height=6]> but was:<java.awt.Rectangle[x=0,y=0,width=0,height=0]>
	at java.awt.geom.RectangularShapeTest.testSetFrameFromCenterXY4(RectangularShapeTest.java:149)
	at java.lang.reflect.VMReflection.invokeMethod(VMReflection.java)

Test: testSetFrameFromCenterPP1Class: java.awt.geom.RectangularShapeTestjunit.framework.AssertionFailedError: expected:<java.awt.Rectangle[x=3,y=3,width=4,height=6]> but was:<java.awt.Rectangle[x=0,y=0,width=0,height=0]>
	at java.awt.geom.RectangularShapeTest.testSetFrameFromCenterPP1(RectangularShapeTest.java:154)
	at java.lang.reflect.VMReflection.invokeMethod(VMReflection.java)

Test: testSetFrameFromCenterPP2Class: java.awt.geom.RectangularShapeTestjunit.framework.AssertionFailedError: expected:<java.awt.Rectangle[x=3,y=3,width=4,height=6]> but was:<java.awt.Rectangle[x=0,y=0,width=0,height=0]>
	at java.awt.geom.RectangularShapeTest.testSetFrameFromCenterPP2(RectangularShapeTest.java:159)
	at java.lang.reflect.VMReflection.invokeMethod(VMReflection.java)

Test: testSetFrameFromCenterPP3Class: java.awt.geom.RectangularShapeTestjunit.framework.AssertionFailedError: expected:<java.awt.Rectangle[x=3,y=3,width=4,height=6]> but was:<java.awt.Rectangle[x=0,y=0,width=0,height=0]>
	at java.awt.geom.RectangularShapeTest.testSetFrameFromCenterPP3(RectangularShapeTest.java:164)
	at java.lang.reflect.VMReflection.invokeMethod(VMReflection.java)

Test: testSetFrameFromCenterPP4Class: java.awt.geom.RectangularShapeTestjunit.framework.AssertionFailedError: expected:<java.awt.Rectangle[x=3,y=3,width=4,height=6]> but was:<java.awt.Rectangle[x=0,y=0,width=0,height=0]>
	at java.awt.geom.RectangularShapeTest.testSetFrameFromCenterPP4(RectangularShapeTest.java:169)
	at java.lang.reflect.VMReflection.invokeMethod(VMReflection.java)

Test: testSetFrameFromDiagonalXY1Class: java.awt.geom.RectangularShapeTestjunit.framework.AssertionFailedError: expected:<java.awt.Rectangle[x=5,y=6,width=2,height=3]> but was:<java.awt.Rectangle[x=0,y=0,width=0,height=0]>
	at java.awt.geom.RectangularShapeTest.testSetFrameFromDiagonalXY1(RectangularShapeTest.java:174)
	at java.lang.reflect.VMReflection.invokeMethod(VMReflection.java)

Test: testSetFrameFromDiagonalXY2Class: java.awt.geom.RectangularShapeTestjunit.framework.AssertionFailedError: expected:<java.awt.Rectangle[x=5,y=3,width=2,height=3]> but was:<java.awt.Rectangle[x=0,y=0,width=0,height=0]>
	at java.awt.geom.RectangularShapeTest.testSetFrameFromDiagonalXY2(RectangularShapeTest.java:179)
	at java.lang.reflect.VMReflection.invokeMethod(VMReflection.java)

Test: testSetFrameFromDiagonalXY3Class: java.awt.geom.RectangularShapeTestjunit.framework.AssertionFailedError: expected:<java.awt.Rectangle[x=3,y=3,width=2,height=3]> but was:<java.awt.Rectangle[x=0,y=0,width=0,height=0]>
	at java.awt.geom.RectangularShapeTest.testSetFrameFromDiagonalXY3(RectangularShapeTest.java:184)
	at java.lang.reflect.VMReflection.invokeMethod(VMReflection.java)

Test: testSetFrameFromDiagonalXY4Class: java.awt.geom.RectangularShapeTestjunit.framework.AssertionFailedError: expected:<java.awt.Rectangle[x=3,y=6,width=2,height=3]> but was:<java.awt.Rectangle[x=0,y=0,width=0,height=0]>
	at java.awt.geom.RectangularShapeTest.testSetFrameFromDiagonalXY4(RectangularShapeTest.java:189)
	at java.lang.reflect.VMReflection.invokeMethod(VMReflection.java)

Test: testSetFrameFromDiagonalPP1Class: java.awt.geom.RectangularShapeTestjunit.framework.AssertionFailedError: expected:<java.awt.Rectangle[x=5,y=6,width=2,height=3]> but was:<java.awt.Rectangle[x=0,y=0,width=0,height=0]>
	at java.awt.geom.RectangularShapeTest.testSetFrameFromDiagonalPP1(RectangularShapeTest.java:194)
	at java.lang.reflect.VMReflection.invokeMethod(VMReflection.java)

Test: testSetFrameFromDiagonalPP2Class: java.awt.geom.RectangularShapeTestjunit.framework.AssertionFailedError: expected:<java.awt.Rectangle[x=5,y=3,width=2,height=3]> but was:<java.awt.Rectangle[x=0,y=0,width=0,height=0]>
	at java.awt.geom.RectangularShapeTest.testSetFrameFromDiagonalPP2(RectangularShapeTest.java:199)
	at java.lang.reflect.VMReflection.invokeMethod(VMReflection.java)

Test: testSetFrameFromDiagonalPP3Class: java.awt.geom.RectangularShapeTestjunit.framework.AssertionFailedError: expected:<java.awt.Rectangle[x=3,y=3,width=2,height=3]> but was:<java.awt.Rectangle[x=0,y=0,width=0,height=0]>
	at java.awt.geom.RectangularShapeTest.testSetFrameFromDiagonalPP3(RectangularShapeTest.java:204)
	at java.lang.reflect.VMReflection.invokeMethod(VMReflection.java)

Test: testSetFrameFromDiagonalPP4Class: java.awt.geom.RectangularShapeTestjunit.framework.AssertionFailedError: expected:<java.awt.Rectangle[x=3,y=6,width=2,height=3]> but was:<java.awt.Rectangle[x=0,y=0,width=0,height=0]>
	at java.awt.geom.RectangularShapeTest.testSetFrameFromDiagonalPP4(RectangularShapeTest.java:209)
	at java.lang.reflect.VMReflection.invokeMethod(VMReflection.java)

Test: testGetBoundsClass: java.awt.geom.RoundRectangle2DDoubleTestjunit.framework.AssertionFailedError: expected:<java.awt.geom.Rectangle2D$Double[x=1.0,y=2.0,width=3.0,height=4.0]> but was:<java.awt.Rectangle[x=0,y=0,width=0,height=0]>
	at java.awt.geom.RoundRectangle2DDoubleTest.testGetBounds(RoundRectangle2DDoubleTest.java:92)
	at java.lang.reflect.VMReflection.invokeMethod(VMReflection.java)

Test: testGetBoundsClass: java.awt.geom.RoundRectangle2DFloatTestjunit.framework.AssertionFailedError: expected:<java.awt.geom.Rectangle2D$Float[x=1.0,y=2.0,width=3.0,height=4.0]> but was:<java.awt.Rectangle[x=0,y=0,width=0,height=0]>
	at java.awt.geom.RoundRectangle2DFloatTest.testGetBounds(RoundRectangle2DFloatTest.java:92)
	at java.lang.reflect.VMReflection.invokeMethod(VMReflection.java)

Test: testGetPathIteratorClass: java.awt.geom.RoundRectangle2DTestjunit.framework.AssertionFailedError: Failed 4/4 test(s)
	at java.awt.geom.ShapeTestCase.checkRunner(ShapeTestCase.java:522)
	at java.awt.geom.ShapeTestCase.testGetPathIterator(ShapeTestCase.java:760)
	at java.lang.reflect.VMReflection.invokeMethod(VMReflection.java)

Test: testResolutionSyntaxClass: javax.print.attribute.ResolutionSyntaxTestjunit.framework.AssertionFailedError: expected:<10001> but was:<0>
	at javax.print.attribute.ResolutionSyntaxTest.testResolutionSyntax(ResolutionSyntaxTest.java:67)
	at java.lang.reflect.VMReflection.invokeMethod(VMReflection.java)

Test: testGetCrossFeedResolutionClass: javax.print.attribute.ResolutionSyntaxTestjunit.framework.AssertionFailedError: expected:<1000> but was:<0>
	at javax.print.attribute.ResolutionSyntaxTest.testGetCrossFeedResolution(ResolutionSyntaxTest.java:119)
	at java.lang.reflect.VMReflection.invokeMethod(VMReflection.java)

Test: testGetFeedResolutionClass: javax.print.attribute.ResolutionSyntaxTestjunit.framework.AssertionFailedError: expected:<2000> but was:<0>
	at javax.print.attribute.ResolutionSyntaxTest.testGetFeedResolution(ResolutionSyntaxTest.java:136)
	at java.lang.reflect.VMReflection.invokeMethod(VMReflection.java)

Test: testGetFeedResolutionDphiClass: javax.print.attribute.ResolutionSyntaxTestjunit.framework.AssertionFailedError: bad rounding expected:<63> but was:<0>
	at javax.print.attribute.ResolutionSyntaxTest.testGetFeedResolutionDphi(ResolutionSyntaxTest.java:148)
	at java.lang.reflect.VMReflection.invokeMethod(VMReflection.java)

Test: testGetResolutionClass: javax.print.attribute.ResolutionSyntaxTestjunit.framework.AssertionFailedError: expected:<1000> but was:<0>
	at javax.print.attribute.ResolutionSyntaxTest.testGetResolution(ResolutionSyntaxTest.java:153)
	at java.lang.reflect.VMReflection.invokeMethod(VMReflection.java)

Test: testToStringintStringClass: javax.print.attribute.ResolutionSyntaxTestjunit.framework.ComparisonFailure: expected:<1024x1034...> but was:<0x0...>
	at javax.print.attribute.ResolutionSyntaxTest.testToStringintString(ResolutionSyntaxTest.java:191)
	at java.lang.reflect.VMReflection.invokeMethod(VMReflection.java)

Test: testResolutionSyntaxClass: javax.print.attribute.RunAllAttributesTestsjunit.framework.AssertionFailedError: expected:<10001> but was:<0>
	at javax.print.attribute.ResolutionSyntaxTest.testResolutionSyntax(ResolutionSyntaxTest.java:67)
	at java.lang.reflect.VMReflection.invokeMethod(VMReflection.java)

Test: testGetCrossFeedResolutionClass: javax.print.attribute.RunAllAttributesTestsjunit.framework.AssertionFailedError: expected:<1000> but was:<0>
	at javax.print.attribute.ResolutionSyntaxTest.testGetCrossFeedResolution(ResolutionSyntaxTest.java:119)
	at java.lang.reflect.VMReflection.invokeMethod(VMReflection.java)

Test: testGetFeedResolutionClass: javax.print.attribute.RunAllAttributesTestsjunit.framework.AssertionFailedError: expected:<2000> but was:<0>
	at javax.print.attribute.ResolutionSyntaxTest.testGetFeedResolution(ResolutionSyntaxTest.java:136)
	at java.lang.reflect.VMReflection.invokeMethod(VMReflection.java)

Test: testGetFeedResolutionDphiClass: javax.print.attribute.RunAllAttributesTestsjunit.framework.AssertionFailedError: bad rounding expected:<63> but was:<0>
	at javax.print.attribute.ResolutionSyntaxTest.testGetFeedResolutionDphi(ResolutionSyntaxTest.java:148)
	at java.lang.reflect.VMReflection.invokeMethod(VMReflection.java)

Test: testGetResolutionClass: javax.print.attribute.RunAllAttributesTestsjunit.framework.AssertionFailedError: expected:<1000> but was:<0>
	at javax.print.attribute.ResolutionSyntaxTest.testGetResolution(ResolutionSyntaxTest.java:153)
	at java.lang.reflect.VMReflection.invokeMethod(VMReflection.java)

Test: testToStringintStringClass: javax.print.attribute.RunAllAttributesTestsjunit.framework.ComparisonFailure: expected:<1024x1034...> but was:<0x0...>
	at javax.print.attribute.ResolutionSyntaxTest.testToStringintString(ResolutionSyntaxTest.java:191)
	at java.lang.reflect.VMReflection.invokeMethod(VMReflection.java)

Test: testSize2DSyntaxClass: javax.print.attribute.RunAllAttributesTestsjunit.framework.AssertionFailedError
	at javax.print.attribute.Size2DSyntaxTest.testSize2DSyntax(Size2DSyntaxTest.java:48)
	at java.lang.reflect.VMReflection.invokeMethod(VMReflection.java)

Test: testGetSizeClass: javax.print.attribute.RunAllAttributesTestsjunit.framework.AssertionFailedError: expected:<@.0> but was:<0.0>
	at javax.print.attribute.Size2DSyntaxTest.testGetSize(Size2DSyntaxTest.java:137)
	at java.lang.reflect.VMReflection.invokeMethod(VMReflection.java)

Test: testGetXClass: javax.print.attribute.RunAllAttributesTestsjunit.framework.AssertionFailedError: expected:<@.0> but was:<0.0>
	at javax.print.attribute.Size2DSyntaxTest.testGetX(Size2DSyntaxTest.java:150)
	at java.lang.reflect.VMReflection.invokeMethod(VMReflection.java)

Test: testGetXMicrometersClass: javax.print.attribute.RunAllAttributesTestsjunit.framework.AssertionFailedError: expected:<500> but was:<0>
	at javax.print.attribute.Size2DSyntaxTest.testGetXMicrometers(Size2DSyntaxTest.java:184)
	at java.lang.reflect.VMReflection.invokeMethod(VMReflection.java)

Test: testGetYMicrometersClass: javax.print.attribute.RunAllAttributesTestsjunit.framework.AssertionFailedError: expected:<700> but was:<0>
	at javax.print.attribute.Size2DSyntaxTest.testGetYMicrometers(Size2DSyntaxTest.java:195)
	at java.lang.reflect.VMReflection.invokeMethod(VMReflection.java)

Test: testMediaPrintableArea1Class: javax.print.attribute.RunAllAttributesTestsjunit.framework.AssertionFailedError: expected:<1.0> but was:<0.0>
	at javax.print.attribute.standard.MediaPrintableAreaTest.testMediaPrintableArea1(MediaPrintableAreaTest.java:67)
	at java.lang.reflect.VMReflection.invokeMethod(VMReflection.java)

Test: testFindMedia2Class: javax.print.attribute.RunAllAttributesTestsjunit.framework.AssertionFailedError: expected:<executive> but was:<jis-b5>
	at javax.print.attribute.standard.MediaSizeTest.testFindMedia2(MediaSizeTest.java:106)
	at java.lang.reflect.VMReflection.invokeMethod(VMReflection.java)

Test: testGetMediaSizeForNameClass: javax.print.attribute.RunAllAttributesTestsjunit.framework.AssertionFailedError: findMedia(8.5, 11, MediaSize.INCH) = null
	at javax.print.attribute.standard.MediaSizeTest.testGetMediaSizeForName(MediaSizeTest.java:180)
	at java.lang.reflect.VMReflection.invokeMethod(VMReflection.java)

Test: testSize2DSyntaxClass: javax.print.attribute.Size2DSyntaxTestjunit.framework.AssertionFailedError
	at javax.print.attribute.Size2DSyntaxTest.testSize2DSyntax(Size2DSyntaxTest.java:48)
	at java.lang.reflect.VMReflection.invokeMethod(VMReflection.java)

Test: testGetSizeClass: javax.print.attribute.Size2DSyntaxTestjunit.framework.AssertionFailedError: expected:<@.0> but was:<0.0>
	at javax.print.attribute.Size2DSyntaxTest.testGetSize(Size2DSyntaxTest.java:137)
	at java.lang.reflect.VMReflection.invokeMethod(VMReflection.java)

Test: testGetXClass: javax.print.attribute.Size2DSyntaxTestjunit.framework.AssertionFailedError: expected:<@.0> but was:<0.0>
	at javax.print.attribute.Size2DSyntaxTest.testGetX(Size2DSyntaxTest.java:150)
	at java.lang.reflect.VMReflection.invokeMethod(VMReflection.java)

Test: testGetXMicrometersClass: javax.print.attribute.Size2DSyntaxTestjunit.framework.AssertionFailedError: expected:<500> but was:<0>
	at javax.print.attribute.Size2DSyntaxTest.testGetXMicrometers(Size2DSyntaxTest.java:184)
	at java.lang.reflect.VMReflection.invokeMethod(VMReflection.java)

Test: testGetYMicrometersClass: javax.print.attribute.Size2DSyntaxTestjunit.framework.AssertionFailedError: expected:<700> but was:<0>
	at javax.print.attribute.Size2DSyntaxTest.testGetYMicrometers(Size2DSyntaxTest.java:195)
	at java.lang.reflect.VMReflection.invokeMethod(VMReflection.java)

Test: testMediaPrintableArea1Class: javax.print.attribute.standard.MediaPrintableAreaTestjunit.framework.AssertionFailedError: expected:<1.0> but was:<0.0>
	at javax.print.attribute.standard.MediaPrintableAreaTest.testMediaPrintableArea1(MediaPrintableAreaTest.java:67)
	at java.lang.reflect.VMReflection.invokeMethod(VMReflection.java)

Test: testFindMedia2Class: javax.print.attribute.standard.MediaSizeTestjunit.framework.AssertionFailedError: expected:<executive> but was:<jis-b5>
	at javax.print.attribute.standard.MediaSizeTest.testFindMedia2(MediaSizeTest.java:106)
	at java.lang.reflect.VMReflection.invokeMethod(VMReflection.java)

Test: testGetMediaSizeForNameClass: javax.print.attribute.standard.MediaSizeTestjunit.framework.AssertionFailedError: findMedia(8.5, 11, MediaSize.INCH) = null
	at javax.print.attribute.standard.MediaSizeTest.testGetMediaSizeForName(MediaSizeTest.java:180)
	at java.lang.reflect.VMReflection.invokeMethod(VMReflection.java)

Test: test_parseDoubleLjava_lang_StringClass: org.apache.harmony.luni.tests.java.lang.DoubleTestjunit.framework.ComparisonFailure: expected:<12...> but was:<<...>
	at org.apache.harmony.luni.tests.java.lang.DoubleTest.doTestCompareRawBits(DoubleTest.java:195)
	at org.apache.harmony.luni.tests.java.lang.DoubleTest.test_parseDoubleLjava_lang_String(DoubleTest.java:438)
	at java.lang.reflect.VMReflection.invokeMethod(VMReflection.java)

Test: test_toStringClass: org.apache.harmony.luni.tests.java.lang.FloatTestjunit.framework.AssertionFailedError: Incorrect String representation want 12.90898, got (<.90898)
	at org.apache.harmony.luni.tests.java.lang.FloatTest.test_toString(FloatTest.java:895)
	at org.apache.harmony.luni.tests.java.lang.FloatTest.test_toString(FloatTest.java:802)
	at java.lang.reflect.VMReflection.invokeMethod(VMReflection.java)

Test: test_toStringFClass: org.apache.harmony.luni.tests.java.lang.FloatTestjunit.framework.AssertionFailedError: Incorrect String representation want 12.90898, got <.90898
	at org.apache.harmony.luni.tests.java.lang.FloatTest.test_toStringF(FloatTest.java:819)
	at java.lang.reflect.VMReflection.invokeMethod(VMReflection.java)

Test: test_acosDClass: org.apache.harmony.luni.tests.java.lang.MathTestjunit.framework.AssertionFailedError: Returned incorrect arc cosine
	at org.apache.harmony.luni.tests.java.lang.MathTest.test_acosD(MathTest.java:83)
	at java.lang.reflect.VMReflection.invokeMethod(VMReflection.java)

Test: test_atanDClass: org.apache.harmony.luni.tests.java.lang.MathTestjunit.framework.AssertionFailedError: Returned incorrect arc tangent: 1.5574073770599086
	at org.apache.harmony.luni.tests.java.lang.MathTest.test_atanD(MathTest.java:105)
	at java.lang.reflect.VMReflection.invokeMethod(VMReflection.java)

Test: test_atan2DDClass: org.apache.harmony.luni.tests.java.lang.MathTestjunit.framework.AssertionFailedError: Returned incorrect arc tangent: -1.5707963267948966
	at org.apache.harmony.luni.tests.java.lang.MathTest.test_atan2DD(MathTest.java:115)
	at java.lang.reflect.VMReflection.invokeMethod(VMReflection.java)

Test: test_cbrt_DClass: org.apache.harmony.luni.tests.java.lang.MathTestjunit.framework.AssertionFailedError: Should return Double.POSITIVE_INFINITY expected:<Infinity> but was:<NaN>
	at org.apache.harmony.luni.tests.java.lang.MathTest.test_cbrt_D(MathTest.java:127)
	at java.lang.reflect.VMReflection.invokeMethod(VMReflection.java)

Test: test_ceilDClass: org.apache.harmony.luni.tests.java.lang.MathTestjunit.framework.AssertionFailedError: Incorrect ceiling for double expected:<@.0> but was:<@.0>
	at org.apache.harmony.luni.tests.java.lang.MathTest.test_ceilD(MathTest.java:159)
	at java.lang.reflect.VMReflection.invokeMethod(VMReflection.java)

Test: test_cosDClass: org.apache.harmony.luni.tests.java.lang.MathTestjunit.framework.AssertionFailedError: Incorrect answer expected:<0.5403023058681398> but was:<0.5403023058681378>
	at org.apache.harmony.luni.tests.java.lang.MathTest.test_cosD(MathTest.java:170)
	at java.lang.reflect.VMReflection.invokeMethod(VMReflection.java)

Test: test_cosh_DClass: org.apache.harmony.luni.tests.java.lang.MathTestjunit.framework.AssertionFailedError: Should return POSITIVE_INFINITY expected:<Infinity> but was:<NaN>
	at org.apache.harmony.luni.tests.java.lang.MathTest.test_cosh_D(MathTest.java:180)
	at java.lang.reflect.VMReflection.invokeMethod(VMReflection.java)

Test: test_expDClass: org.apache.harmony.luni.tests.java.lang.MathTestjunit.framework.AssertionFailedError: Incorrect answer returned for simple power
	at org.apache.harmony.luni.tests.java.lang.MathTest.test_expD(MathTest.java:207)
	at java.lang.reflect.VMReflection.invokeMethod(VMReflection.java)

Test: test_expm1_DClass: org.apache.harmony.luni.tests.java.lang.MathTestjunit.framework.AssertionFailedError: Should return POSITIVE_INFINITY expected:<Infinity> but was:<NaN>
	at org.apache.harmony.luni.tests.java.lang.MathTest.test_expm1_D(MathTest.java:221)
	at java.lang.reflect.VMReflection.invokeMethod(VMReflection.java)

Test: test_floorDClass: org.apache.harmony.luni.tests.java.lang.MathTestjunit.framework.AssertionFailedError: Incorrect floor for double expected:<@.0> but was:<@.0>
	at org.apache.harmony.luni.tests.java.lang.MathTest.test_floorD(MathTest.java:250)
	at java.lang.reflect.VMReflection.invokeMethod(VMReflection.java)

Test: test_hypot_DDClass: org.apache.harmony.luni.tests.java.lang.MathTestjunit.framework.AssertionFailedError: Should return POSITIVE_INFINITY expected:<Infinity> but was:<3.613795236439605E83>
	at org.apache.harmony.luni.tests.java.lang.MathTest.test_hypot_DD(MathTest.java:262)
	at java.lang.reflect.VMReflection.invokeMethod(VMReflection.java)

Test: test_IEEEremainderDDClass: org.apache.harmony.luni.tests.java.lang.MathTestjunit.framework.AssertionFailedError: Incorrect remainder returned
	at org.apache.harmony.luni.tests.java.lang.MathTest.test_IEEEremainderDD(MathTest.java:302)
	at java.lang.reflect.VMReflection.invokeMethod(VMReflection.java)

Test: test_logDClass: org.apache.harmony.luni.tests.java.lang.MathTestjunit.framework.AssertionFailedError: Answer does not equal expected answer for d = :.0 answer = 2.5936795869276536E51
	at org.apache.harmony.luni.tests.java.lang.MathTest.test_logD(MathTest.java:313)
	at java.lang.reflect.VMReflection.invokeMethod(VMReflection.java)

Test: test_log10_DClass: org.apache.harmony.luni.tests.java.lang.MathTestjunit.framework.AssertionFailedError
	at org.apache.harmony.luni.tests.java.lang.MathTest.test_log10_D(MathTest.java:325)
	at java.lang.reflect.VMReflection.invokeMethod(VMReflection.java)

Test: test_log1p_DClass: org.apache.harmony.luni.tests.java.lang.MathTestjunit.framework.AssertionFailedError: Should return -0.2941782295312541 expected:<-0.2941782295312541> but was:<NaN>
	at org.apache.harmony.luni.tests.java.lang.MathTest.test_log1p_D(MathTest.java:358)
	at java.lang.reflect.VMReflection.invokeMethod(VMReflection.java)

Test: test_powDDClass: org.apache.harmony.luni.tests.java.lang.MathTestjunit.framework.AssertionFailedError: pow returned incorrect value
	at org.apache.harmony.luni.tests.java.lang.MathTest.test_powDD(MathTest.java:479)
	at java.lang.reflect.VMReflection.invokeMethod(VMReflection.java)

Test: test_rintDClass: org.apache.harmony.luni.tests.java.lang.MathTestjunit.framework.AssertionFailedError: Failed to round properly down  to even expected:<2.0> but was:<2.1>
	at org.apache.harmony.luni.tests.java.lang.MathTest.test_rintD(MathTest.java:496)
	at java.lang.reflect.VMReflection.invokeMethod(VMReflection.java)

Test: test_roundDClass: org.apache.harmony.luni.tests.java.lang.MathTestjunit.framework.AssertionFailedError: Incorrect rounding of a float expected:<-91> but was:<-90>
	at org.apache.harmony.luni.tests.java.lang.MathTest.test_roundD(MathTest.java:506)
	at java.lang.reflect.VMReflection.invokeMethod(VMReflection.java)

Test: test_roundFClass: org.apache.harmony.luni.tests.java.lang.MathTestjunit.framework.AssertionFailedError: Incorrect rounding of a float expected:<-91> but was:<0>
	at org.apache.harmony.luni.tests.java.lang.MathTest.test_roundF(MathTest.java:514)
	at java.lang.reflect.VMReflection.invokeMethod(VMReflection.java)

Test: test_sinDClass: org.apache.harmony.luni.tests.java.lang.MathTestjunit.framework.AssertionFailedError: Incorrect answer expected:<0.8414709848078965> but was:<0.8414709848079371>
	at org.apache.harmony.luni.tests.java.lang.MathTest.test_sinD(MathTest.java:574)
	at java.lang.reflect.VMReflection.invokeMethod(VMReflection.java)

Test: test_sinh_DClass: org.apache.harmony.luni.tests.java.lang.MathTestjunit.framework.AssertionFailedError: Should return NEGATIVE_INFINITY expected:<-Infinity> but was:<NaN>
	at org.apache.harmony.luni.tests.java.lang.MathTest.test_sinh_D(MathTest.java:586)
	at java.lang.reflect.VMReflection.invokeMethod(VMReflection.java)

Test: test_sqrtDClass: org.apache.harmony.luni.tests.java.lang.MathTestjunit.framework.AssertionFailedError: Incorrect root returned2 expected:<7.0> but was:<3.3684129994665856E233>
	at org.apache.harmony.luni.tests.java.lang.MathTest.test_sqrtD(MathTest.java:615)
	at java.lang.reflect.VMReflection.invokeMethod(VMReflection.java)

Test: test_tanDClass: org.apache.harmony.luni.tests.java.lang.MathTestjunit.framework.AssertionFailedError: Incorrect answer expected:<1.5574077246549023> but was:<1.5574073770599086>
	at org.apache.harmony.luni.tests.java.lang.MathTest.test_tanD(MathTest.java:624)
	at java.lang.reflect.VMReflection.invokeMethod(VMReflection.java)

Test: test_tanh_DClass: org.apache.harmony.luni.tests.java.lang.MathTestjunit.framework.AssertionFailedError: Should return +1.0 expected:<1.0> but was:<Infinity>
	at org.apache.harmony.luni.tests.java.lang.MathTest.test_tanh_D(MathTest.java:635)
	at java.lang.reflect.VMReflection.invokeMethod(VMReflection.java)

Test: test_ulp_DClass: org.apache.harmony.luni.tests.java.lang.MathTestjunit.framework.AssertionFailedError: Returned incorrect value expected:<4.9E-324> but was:<1.7976931348623157E308>
	at org.apache.harmony.luni.tests.java.lang.MathTest.test_ulp_D(MathTest.java:707)
	at java.lang.reflect.VMReflection.invokeMethod(VMReflection.java)

Test: test_ulp_fClass: org.apache.harmony.luni.tests.java.lang.MathTestjunit.framework.AssertionFailedError: Returned incorrect value expected:<2.028241E31> but was:<0.0>
	at org.apache.harmony.luni.tests.java.lang.MathTest.test_ulp_f(MathTest.java:748)
	at java.lang.reflect.VMReflection.invokeMethod(VMReflection.java)

Test: test_acosDClass: org.apache.harmony.luni.tests.java.lang.StrictMathTestjunit.framework.AssertionFailedError: Returned incorrect arc cosine
	at org.apache.harmony.luni.tests.java.lang.StrictMathTest.test_acosD(StrictMathTest.java:81)
	at java.lang.reflect.VMReflection.invokeMethod(VMReflection.java)

Test: test_atanDClass: org.apache.harmony.luni.tests.java.lang.StrictMathTestjunit.framework.AssertionFailedError: Returned incorrect arc tangent: 1.5574073770599086
	at org.apache.harmony.luni.tests.java.lang.StrictMathTest.test_atanD(StrictMathTest.java:101)
	at java.lang.reflect.VMReflection.invokeMethod(VMReflection.java)

Test: test_atan2DDClass: org.apache.harmony.luni.tests.java.lang.StrictMathTestjunit.framework.AssertionFailedError: Returned incorrect arc tangent: -1.5707963267948966
	at org.apache.harmony.luni.tests.java.lang.StrictMathTest.test_atan2DD(StrictMathTest.java:111)
	at java.lang.reflect.VMReflection.invokeMethod(VMReflection.java)

Test: test_cbrt_DClass: org.apache.harmony.luni.tests.java.lang.StrictMathTestjunit.framework.AssertionFailedError: Should return Double.POSITIVE_INFINITY expected:<Infinity> but was:<NaN>
	at org.apache.harmony.luni.tests.java.lang.StrictMathTest.test_cbrt_D(StrictMathTest.java:124)
	at java.lang.reflect.VMReflection.invokeMethod(VMReflection.java)

Test: test_ceilDClass: org.apache.harmony.luni.tests.java.lang.StrictMathTestjunit.framework.AssertionFailedError: Incorrect ceiling for double expected:<@.0> but was:<@.0>
	at org.apache.harmony.luni.tests.java.lang.StrictMathTest.test_ceilD(StrictMathTest.java:163)
	at java.lang.reflect.VMReflection.invokeMethod(VMReflection.java)

Test: test_cosDClass: org.apache.harmony.luni.tests.java.lang.StrictMathTestjunit.framework.AssertionFailedError: Returned incorrect cosine
	at org.apache.harmony.luni.tests.java.lang.StrictMathTest.test_cosD(StrictMathTest.java:174)
	at java.lang.reflect.VMReflection.invokeMethod(VMReflection.java)

Test: test_cosh_DClass: org.apache.harmony.luni.tests.java.lang.StrictMathTestjunit.framework.AssertionFailedError: Should return POSITIVE_INFINITY expected:<Infinity> but was:<NaN>
	at org.apache.harmony.luni.tests.java.lang.StrictMathTest.test_cosh_D(StrictMathTest.java:188)
	at java.lang.reflect.VMReflection.invokeMethod(VMReflection.java)

Test: test_expDClass: org.apache.harmony.luni.tests.java.lang.StrictMathTestjunit.framework.AssertionFailedError: Incorrect answer returned for simple power
	at org.apache.harmony.luni.tests.java.lang.StrictMathTest.test_expD(StrictMathTest.java:217)
	at java.lang.reflect.VMReflection.invokeMethod(VMReflection.java)

Test: test_expm1_DClass: org.apache.harmony.luni.tests.java.lang.StrictMathTestjunit.framework.AssertionFailedError: Should return POSITIVE_INFINITY expected:<Infinity> but was:<NaN>
	at org.apache.harmony.luni.tests.java.lang.StrictMathTest.test_expm1_D(StrictMathTest.java:232)
	at java.lang.reflect.VMReflection.invokeMethod(VMReflection.java)

Test: test_floorDClass: org.apache.harmony.luni.tests.java.lang.StrictMathTestjunit.framework.AssertionFailedError: Incorrect floor for double expected:<@.0> but was:<@.0>
	at org.apache.harmony.luni.tests.java.lang.StrictMathTest.test_floorD(StrictMathTest.java:262)
	at java.lang.reflect.VMReflection.invokeMethod(VMReflection.java)

Test: test_hypot_DDClass: org.apache.harmony.luni.tests.java.lang.StrictMathTestjunit.framework.AssertionFailedError: Should return POSITIVE_INFINITY expected:<Infinity> but was:<3.613795236439605E83>
	at org.apache.harmony.luni.tests.java.lang.StrictMathTest.test_hypot_DD(StrictMathTest.java:275)
	at java.lang.reflect.VMReflection.invokeMethod(VMReflection.java)

Test: test_IEEEremainderDDClass: org.apache.harmony.luni.tests.java.lang.StrictMathTestjunit.framework.AssertionFailedError: Incorrect remainder returned
	at org.apache.harmony.luni.tests.java.lang.StrictMathTest.test_IEEEremainderDD(StrictMathTest.java:318)
	at java.lang.reflect.VMReflection.invokeMethod(VMReflection.java)

Test: test_logDClass: org.apache.harmony.luni.tests.java.lang.StrictMathTestjunit.framework.AssertionFailedError: Answer does not equal expected answer for d = :.0 answer = 2.5936795869276536E51
	at org.apache.harmony.luni.tests.java.lang.StrictMathTest.test_logD(StrictMathTest.java:330)
	at java.lang.reflect.VMReflection.invokeMethod(VMReflection.java)

Test: test_log10_DClass: org.apache.harmony.luni.tests.java.lang.StrictMathTestjunit.framework.AssertionFailedError: Should return NaN
	at org.apache.harmony.luni.tests.java.lang.StrictMathTest.test_log10_D(StrictMathTest.java:343)
	at java.lang.reflect.VMReflection.invokeMethod(VMReflection.java)

Test: test_log1p_DClass: org.apache.harmony.luni.tests.java.lang.StrictMathTestjunit.framework.AssertionFailedError: Should return -0.2941782295312541 expected:<-0.2941782295312541> but was:<NaN>
	at org.apache.harmony.luni.tests.java.lang.StrictMathTest.test_log1p_D(StrictMathTest.java:390)
	at java.lang.reflect.VMReflection.invokeMethod(VMReflection.java)

Test: test_powDDClass: org.apache.harmony.luni.tests.java.lang.StrictMathTestjunit.framework.AssertionFailedError: pow returned incorrect value
	at org.apache.harmony.luni.tests.java.lang.StrictMathTest.test_powDD(StrictMathTest.java:513)
	at java.lang.reflect.VMReflection.invokeMethod(VMReflection.java)

Test: test_rintDClass: org.apache.harmony.luni.tests.java.lang.StrictMathTestjunit.framework.AssertionFailedError: Failed to round properly down  to even expected:<2.0> but was:<2.1>
	at org.apache.harmony.luni.tests.java.lang.StrictMathTest.test_rintD(StrictMathTest.java:528)
	at java.lang.reflect.VMReflection.invokeMethod(VMReflection.java)

Test: test_roundDClass: org.apache.harmony.luni.tests.java.lang.StrictMathTestjunit.framework.AssertionFailedError: Incorrect rounding of a float expected:<-91> but was:<-90>
	at org.apache.harmony.luni.tests.java.lang.StrictMathTest.test_roundD(StrictMathTest.java:539)
	at java.lang.reflect.VMReflection.invokeMethod(VMReflection.java)

Test: test_roundFClass: org.apache.harmony.luni.tests.java.lang.StrictMathTestjunit.framework.AssertionFailedError: Incorrect rounding of a float expected:<-91> but was:<0>
	at org.apache.harmony.luni.tests.java.lang.StrictMathTest.test_roundF(StrictMathTest.java:548)
	at java.lang.reflect.VMReflection.invokeMethod(VMReflection.java)

Test: test_sinh_DClass: org.apache.harmony.luni.tests.java.lang.StrictMathTestjunit.framework.AssertionFailedError: Should return NEGATIVE_INFINITY expected:<-Infinity> but was:<NaN>
	at org.apache.harmony.luni.tests.java.lang.StrictMathTest.test_sinh_D(StrictMathTest.java:622)
	at java.lang.reflect.VMReflection.invokeMethod(VMReflection.java)

Test: test_sqrtDClass: org.apache.harmony.luni.tests.java.lang.StrictMathTestjunit.framework.AssertionFailedError: Incorrect root returned1 expected:<2.0> but was:<0.0>
	at org.apache.harmony.luni.tests.java.lang.StrictMathTest.test_sqrtD(StrictMathTest.java:652)
	at java.lang.reflect.VMReflection.invokeMethod(VMReflection.java)

Test: test_tanh_DClass: org.apache.harmony.luni.tests.java.lang.StrictMathTestjunit.framework.AssertionFailedError: Should return +1.0 expected:<1.0> but was:<Infinity>
	at org.apache.harmony.luni.tests.java.lang.StrictMathTest.test_tanh_D(StrictMathTest.java:674)
	at java.lang.reflect.VMReflection.invokeMethod(VMReflection.java)

Test: test_ulp_DClass: org.apache.harmony.luni.tests.java.lang.StrictMathTestjunit.framework.AssertionFailedError: Returned incorrect value expected:<4.9E-324> but was:<1.7976931348623157E308>
	at org.apache.harmony.luni.tests.java.lang.StrictMathTest.test_ulp_D(StrictMathTest.java:748)
	at java.lang.reflect.VMReflection.invokeMethod(VMReflection.java)

Test: test_ulp_fClass: org.apache.harmony.luni.tests.java.lang.StrictMathTestjunit.framework.AssertionFailedError: Returned incorrect value expected:<2.028241E31> but was:<0.0>
	at org.apache.harmony.luni.tests.java.lang.StrictMathTest.test_ulp_f(StrictMathTest.java:789)
	at java.lang.reflect.VMReflection.invokeMethod(VMReflection.java)

Test: test_valueOfFClass: org.apache.harmony.luni.tests.java.lang.String2Testjunit.framework.AssertionFailedError: incorrect float string returned--got: @.0 wanted: 109.567
	at org.apache.harmony.luni.tests.java.lang.String2Test.test_valueOfF(String2Test.java:849)
	at java.lang.reflect.VMReflection.invokeMethod(VMReflection.java)

Test: testCardinalityClass: org.apache.harmony.pack200.tests.CodecTestjunit.framework.AssertionFailedError: expected:<256> but was:<0>
	at org.apache.harmony.pack200.tests.CodecTest.testCardinality(CodecTest.java:113)
	at java.lang.reflect.VMReflection.invokeMethod(VMReflection.java)

Test: testUnsigned5Class: org.apache.harmony.pack200.tests.CodecTestjunit.framework.AssertionFailedError: expected:<256> but was:<192>
	at org.apache.harmony.pack200.tests.CodecTest.decode(CodecTest.java:227)
	at org.apache.harmony.pack200.tests.CodecTest.testUnsigned5(CodecTest.java:188)
	at java.lang.reflect.VMReflection.invokeMethod(VMReflection.java)

Test: testFloatControlClass: org.apache.harmony.sound.tests.javax.sound.sampled.FloatControlTestjunit.framework.ComparisonFailure: expected:<...10...> but was:<...:...>
	at org.apache.harmony.sound.tests.javax.sound.sampled.FloatControlTest.testFloatControl(FloatControlTest.java:48)
	at java.lang.reflect.VMReflection.invokeMethod(VMReflection.java)

Test: testAddMathContextEqualScalePosPosClass: org.apache.harmony.tests.java.math.BigDecimalArithmeticTestjunit.framework.ComparisonFailure: incorrect value expected:<....2313E+41> but was:<...23121247898748373566323807282924555312937.1991359555>
	at org.apache.harmony.tests.java.math.BigDecimalArithmeticTest.testAddMathContextEqualScalePosPos(BigDecimalArithmeticTest.java:63)
	at java.lang.reflect.VMReflection.invokeMethod(VMReflection.java)

Test: testAddMathContextEqualScaleNegNegClass: org.apache.harmony.tests.java.math.BigDecimalArithmeticTestjunit.framework.ComparisonFailure: incorrect value  expected:<......> but was:<...12478987483735663238072829245553129371991359555...>
	at org.apache.harmony.tests.java.math.BigDecimalArithmeticTest.testAddMathContextEqualScaleNegNeg(BigDecimalArithmeticTest.java:98)
	at java.lang.reflect.VMReflection.invokeMethod(VMReflection.java)

Test: testAddMathContextDiffScalePosNegClass: org.apache.harmony.tests.java.math.BigDecimalArithmeticTestjunit.framework.AssertionFailedError: incorrect scale expected:<-31> but was:<-168>
	at org.apache.harmony.tests.java.math.BigDecimalArithmeticTest.testAddMathContextDiffScalePosNeg(BigDecimalArithmeticTest.java:134)
	at java.lang.reflect.VMReflection.invokeMethod(VMReflection.java)

Test: testSubtractMathContextEqualScalePosPosClass: org.apache.harmony.tests.java.math.BigDecimalArithmeticTestjunit.framework.ComparisonFailure: incorrect value expected:<....23121247898749E+41> but was:<...23121247898748224119637948679166971643339.7522230419>
	at org.apache.harmony.tests.java.math.BigDecimalArithmeticTest.testSubtractMathContextEqualScalePosPos(BigDecimalArithmeticTest.java:202)
	at java.lang.reflect.VMReflection.invokeMethod(VMReflection.java)

Test: testSubtractMathContextDiffScalePosNegClass: org.apache.harmony.tests.java.math.BigDecimalArithmeticTestjunit.framework.ComparisonFailure: incorrect value expected:<-7.4723342916989754E+4...> but was:<0E+16...>
	at org.apache.harmony.tests.java.math.BigDecimalArithmeticTest.testSubtractMathContextDiffScalePosNeg(BigDecimalArithmeticTest.java:255)
	at java.lang.reflect.VMReflection.invokeMethod(VMReflection.java)

Test: testSubtractMathContextDiffScaleNegPosClass: org.apache.harmony.tests.java.math.BigDecimalArithmeticTestjunit.framework.ComparisonFailure: incorrect value expected:<....867986566767897666787678760787798104576347813847567949870000000000000E+71> but was:<...86798656676789766678767876078779810457634781384756794986999999999999999.9999252766570706981212081652012765435432>
	at org.apache.harmony.tests.java.math.BigDecimalArithmeticTest.testSubtractMathContextDiffScaleNegPos(BigDecimalArithmeticTest.java:291)
	at java.lang.reflect.VMReflection.invokeMethod(VMReflection.java)

Test: testMultiplyMathContextScalePosPosClass: org.apache.harmony.tests.java.math.BigDecimalArithmeticTestjunit.framework.ComparisonFailure: incorrect value expected:<...8...> but was:<...7715621302423751586911997316588140334730994072541889755...>
	at org.apache.harmony.tests.java.math.BigDecimalArithmeticTest.testMultiplyMathContextScalePosPos(BigDecimalArithmeticTest.java:326)
	at java.lang.reflect.VMReflection.invokeMethod(VMReflection.java)

Test: testMultiplyMathContextDiffScalePosNegClass: org.apache.harmony.tests.java.math.BigDecimalArithmeticTestjunit.framework.ComparisonFailure: incorrect value expected:<....3801839465418518653942222612429081498248509257207477E+68> but was:<...38018394654185186539422226124290814982485092572074767671287731980581.893091880727173060570190220616>
	at org.apache.harmony.tests.java.math.BigDecimalArithmeticTest.testMultiplyMathContextDiffScalePosNeg(BigDecimalArithmeticTest.java:378)
	at java.lang.reflect.VMReflection.invokeMethod(VMReflection.java)

Test: testMultiplyMathContextDiffScaleNegPosClass: org.apache.harmony.tests.java.math.BigDecimalArithmeticTestjunit.framework.ComparisonFailure: incorrect value expected:<....6521591193960361339707130098174381429788164316E+98> but was:<...65215911939603613397071300981743814297881643158331741266855087130714619091880727173060570190220616>
	at org.apache.harmony.tests.java.math.BigDecimalArithmeticTest.testMultiplyMathContextDiffScaleNegPos(BigDecimalArithmeticTest.java:413)
	at java.lang.reflect.VMReflection.invokeMethod(VMReflection.java)

Test: testDivideBigDecimalScaleMathContextUPClass: org.apache.harmony.tests.java.math.BigDecimalArithmeticTestjunit.framework.ComparisonFailure: incorrect value expected:<...6> but was:<...5884>
	at org.apache.harmony.tests.java.math.BigDecimalArithmeticTest.testDivideBigDecimalScaleMathContextUP(BigDecimalArithmeticTest.java:1166)
	at java.lang.reflect.VMReflection.invokeMethod(VMReflection.java)

Test: testDivideBigDecimalScaleMathContextDOWNClass: org.apache.harmony.tests.java.math.BigDecimalArithmeticTestjunit.framework.ComparisonFailure: incorrect value expected:<......> but was:<...884...>
	at org.apache.harmony.tests.java.math.BigDecimalArithmeticTest.testDivideBigDecimalScaleMathContextDOWN(BigDecimalArithmeticTest.java:1186)
	at java.lang.reflect.VMReflection.invokeMethod(VMReflection.java)

Test: testDivideBigDecimalScaleMathContextCEILINGClass: org.apache.harmony.tests.java.math.BigDecimalArithmeticTestjunit.framework.ComparisonFailure: incorrect value expected:<...6...> but was:<...5884...>
	at org.apache.harmony.tests.java.math.BigDecimalArithmeticTest.testDivideBigDecimalScaleMathContextCEILING(BigDecimalArithmeticTest.java:1206)
	at java.lang.reflect.VMReflection.invokeMethod(VMReflection.java)

Test: testDivideBigDecimalScaleMathContextFLOORClass: org.apache.harmony.tests.java.math.BigDecimalArithmeticTestjunit.framework.ComparisonFailure: incorrect value expected:<......> but was:<...884...>
	at org.apache.harmony.tests.java.math.BigDecimalArithmeticTest.testDivideBigDecimalScaleMathContextFLOOR(BigDecimalArithmeticTest.java:1226)
	at java.lang.reflect.VMReflection.invokeMethod(VMReflection.java)

Test: testDivideBigDecimalScaleMathContextHALF_UPClass: org.apache.harmony.tests.java.math.BigDecimalArithmeticTestjunit.framework.ComparisonFailure: incorrect value expected:<2.77923185514690367475E+26> but was:<0E+289>
	at org.apache.harmony.tests.java.math.BigDecimalArithmeticTest.testDivideBigDecimalScaleMathContextHALF_UP(BigDecimalArithmeticTest.java:1246)
	at java.lang.reflect.VMReflection.invokeMethod(VMReflection.java)

Test: testDivideBigDecimalScaleMathContextHALF_DOWNClass: org.apache.harmony.tests.java.math.BigDecimalArithmeticTestjunit.framework.ComparisonFailure: incorrect value expected:<2.77923185514690367475E+26> but was:<0E+289>
	at org.apache.harmony.tests.java.math.BigDecimalArithmeticTest.testDivideBigDecimalScaleMathContextHALF_DOWN(BigDecimalArithmeticTest.java:1266)
	at java.lang.reflect.VMReflection.invokeMethod(VMReflection.java)

Test: testDivideBigDecimalScaleMathContextHALF_EVENClass: org.apache.harmony.tests.java.math.BigDecimalArithmeticTestjunit.framework.ComparisonFailure: incorrect value expected:<2.77923185514690367475E+26> but was:<0E+289>
	at org.apache.harmony.tests.java.math.BigDecimalArithmeticTest.testDivideBigDecimalScaleMathContextHALF_EVEN(BigDecimalArithmeticTest.java:1286)
	at java.lang.reflect.VMReflection.invokeMethod(VMReflection.java)

Test: testDivideToIntegralValueMathContextDOWNClass: org.apache.harmony.tests.java.math.BigDecimalArithmeticTestjunit.framework.ComparisonFailure: incorrect value expected:<2.7792318551469036747477068339450205874992634417590178670822889E+62> but was:<0E+25>
	at org.apache.harmony.tests.java.math.BigDecimalArithmeticTest.testDivideToIntegralValueMathContextDOWN(BigDecimalArithmeticTest.java:1343)
	at java.lang.reflect.VMReflection.invokeMethod(VMReflection.java)

Test: testRoundMathContextHALF_UPClass: org.apache.harmony.tests.java.math.BigDecimalArithmeticTestjunit.framework.ComparisonFailure: incorrect quotient value expected:<3736186567876.88> but was:<0E+190>
	at org.apache.harmony.tests.java.math.BigDecimalArithmeticTest.testRoundMathContextHALF_UP(BigDecimalArithmeticTest.java:1543)
	at java.lang.reflect.VMReflection.invokeMethod(VMReflection.java)

Test: testAbsMathContextNegClass: org.apache.harmony.tests.java.math.BigDecimalCompareTestjunit.framework.ComparisonFailure: incorrect value expected:<....23809648392385E+53> but was:<...23809648392384754573567356745735635678902957849027687.87678287>
	at org.apache.harmony.tests.java.math.BigDecimalCompareTest.testAbsMathContextNeg(BigDecimalCompareTest.java:69)
	at java.lang.reflect.VMReflection.invokeMethod(VMReflection.java)

Test: testAbsMathContextPosClass: org.apache.harmony.tests.java.math.BigDecimalCompareTestjunit.framework.ComparisonFailure: incorrect value expected:<....2380964839238475457356735674573563567890E+53> but was:<...23809648392384754573567356745735635678902957849027687.87678287>
	at org.apache.harmony.tests.java.math.BigDecimalCompareTest.testAbsMathContextPos(BigDecimalCompareTest.java:85)
	at java.lang.reflect.VMReflection.invokeMethod(VMReflection.java)

Test: testPlusMathContextPositiveClass: org.apache.harmony.tests.java.math.BigDecimalCompareTestjunit.framework.ComparisonFailure: incorrect value expected:<...> but was:<...9808779810457634781384756794987>
	at org.apache.harmony.tests.java.math.BigDecimalCompareTest.testPlusMathContextPositive(BigDecimalCompareTest.java:381)
	at java.lang.reflect.VMReflection.invokeMethod(VMReflection.java)

Test: testPlusMathContextNegativeClass: org.apache.harmony.tests.java.math.BigDecimalCompareTestjunit.framework.ComparisonFailure: incorrect value expected:<...> but was:<...0457634781384756794987>
	at org.apache.harmony.tests.java.math.BigDecimalCompareTest.testPlusMathContextNegative(BigDecimalCompareTest.java:411)
	at java.lang.reflect.VMReflection.invokeMethod(VMReflection.java)

Test: testNegateMathContextPositiveClass: org.apache.harmony.tests.java.math.BigDecimalCompareTestjunit.framework.ComparisonFailure: incorrect value expected:<...> but was:<...9808779810457634781384756794987>
	at org.apache.harmony.tests.java.math.BigDecimalCompareTest.testNegateMathContextPositive(BigDecimalCompareTest.java:441)
	at java.lang.reflect.VMReflection.invokeMethod(VMReflection.java)

Test: testNegateMathContextNegativeClass: org.apache.harmony.tests.java.math.BigDecimalCompareTestjunit.framework.ComparisonFailure: incorrect value expected:<...> but was:<...0457634781384756794987>
	at org.apache.harmony.tests.java.math.BigDecimalCompareTest.testNegateMathContextNegative(BigDecimalCompareTest.java:471)
	at java.lang.reflect.VMReflection.invokeMethod(VMReflection.java)

Test: testConstrBigIntegerMathContextClass: org.apache.harmony.tests.java.math.BigDecimalConstructorsTestjunit.framework.ComparisonFailure: incorrect value expected:<......> but was:<...679498...>
	at org.apache.harmony.tests.java.math.BigDecimalConstructorsTest.testConstrBigIntegerMathContext(BigDecimalConstructorsTest.java:108)
	at java.lang.reflect.VMReflection.invokeMethod(VMReflection.java)

Test: testConstrBigIntegerScaleMathContextClass: org.apache.harmony.tests.java.math.BigDecimalConstructorsTestjunit.framework.ComparisonFailure: incorrect value expected:<......> but was:<...679498...>
	at org.apache.harmony.tests.java.math.BigDecimalConstructorsTest.testConstrBigIntegerScaleMathContext(BigDecimalConstructorsTest.java:125)
	at java.lang.reflect.VMReflection.invokeMethod(VMReflection.java)

Test: testConstrCharIntIntMathContextClass: org.apache.harmony.tests.java.math.BigDecimalConstructorsTestjunit.framework.ComparisonFailure: incorrect value expected:<...5...> but was:<......>
	at org.apache.harmony.tests.java.math.BigDecimalConstructorsTest.testConstrCharIntIntMathContext(BigDecimalConstructorsTest.java:182)
	at java.lang.reflect.VMReflection.invokeMethod(VMReflection.java)

Test: testConstrDoubleMathContextClass: org.apache.harmony.tests.java.math.BigDecimalConstructorsTestjunit.framework.ComparisonFailure: incorrect value expected:<732546982374982285074> but was:<0>
	at org.apache.harmony.tests.java.math.BigDecimalConstructorsTest.testConstrDoubleMathContext(BigDecimalConstructorsTest.java:304)
	at java.lang.reflect.VMReflection.invokeMethod(VMReflection.java)

Test: testConstrLongMathContextClass: org.apache.harmony.tests.java.math.BigDecimalConstructorsTestjunit.framework.ComparisonFailure: incorrect value expected:<...6> but was:<...578677732546982>
	at org.apache.harmony.tests.java.math.BigDecimalConstructorsTest.testConstrLongMathContext(BigDecimalConstructorsTest.java:394)
	at java.lang.reflect.VMReflection.invokeMethod(VMReflection.java)

Test: testConstrStringMathContextClass: org.apache.harmony.tests.java.math.BigDecimalConstructorsTestjunit.framework.ComparisonFailure: incorrect value expected:<...6> but was:<...>
	at org.apache.harmony.tests.java.math.BigDecimalConstructorsTest.testConstrStringMathContext(BigDecimalConstructorsTest.java:690)
	at java.lang.reflect.VMReflection.invokeMethod(VMReflection.java)

Test: testPrecisionClass: org.apache.harmony.tests.java.math.BigDecimalScaleOperationsTestjunit.framework.AssertionFailedError: expected:<68> but was:<0>
	at org.apache.harmony.tests.java.math.BigDecimalScaleOperationsTest.testPrecision(BigDecimalScaleOperationsTest.java:347)
	at java.lang.reflect.VMReflection.invokeMethod(VMReflection.java)

Test: testRadix10PosClass: org.apache.harmony.tests.java.math.BigIntegerToStringTestjunit.framework.AssertionFailedError
	at org.apache.harmony.tests.java.math.BigIntegerToStringTest.testRadix10Pos(BigIntegerToStringTest.java:85)
	at java.lang.reflect.VMReflection.invokeMethod(VMReflection.java)

Test: test_getIntegerInstanceClass: org.apache.harmony.text.tests.java.text.NumberFormatTestjunit.framework.ComparisonFailure: Test2: NumberFormat.getIntegerInstance().format(35.76) returned wrong value expected:<36> but was:<@>
	at org.apache.harmony.text.tests.java.text.NumberFormatTest.test_getIntegerInstance(NumberFormatTest.java:105)
	at java.lang.reflect.VMReflection.invokeMethod(VMReflection.java)

Test: test_getIntegerInstanceLjava_util_LocaleClass: org.apache.harmony.text.tests.java.text.NumberFormatTestjunit.framework.ComparisonFailure: Test2: NumberFormat.getIntegerInstance().format(-35.76) returned wrong value expected:<...36> but was:<...@>
	at org.apache.harmony.text.tests.java.text.NumberFormatTest.test_getIntegerInstanceLjava_util_Locale(NumberFormatTest.java:132)
	at java.lang.reflect.VMReflection.invokeMethod(VMReflection.java)

Test: test_printDClass: tests.api.java.io.PrintStreamTestjunit.framework.ComparisonFailure: Incorrect double written expected:<2345.76834720202> but was:<@.0>
	at tests.api.java.io.PrintStreamTest.test_printD(PrintStreamTest.java:153)
	at java.lang.reflect.VMReflection.invokeMethod(VMReflection.java)

Test: test_printFClass: tests.api.java.io.PrintStreamTestjunit.framework.ComparisonFailure: Incorrect float written expected:<29.08764> but was:<@.0>
	at tests.api.java.io.PrintStreamTest.test_printF(PrintStreamTest.java:168)
	at java.lang.reflect.VMReflection.invokeMethod(VMReflection.java)

Test: test_printlnDClass: tests.api.java.io.PrintStreamTestjunit.framework.ComparisonFailure: Incorrect double written expected:<2345.76834720202> but was:<@.0
>
	at tests.api.java.io.PrintStreamTest.test_printlnD(PrintStreamTest.java:335)
	at java.lang.reflect.VMReflection.invokeMethod(VMReflection.java)

Test: test_printlnFClass: tests.api.java.io.PrintStreamTestjunit.framework.ComparisonFailure: Incorrect float written expected:<29.08764> but was:<@.0
>
	at tests.api.java.io.PrintStreamTest.test_printlnF(PrintStreamTest.java:351)
	at java.lang.reflect.VMReflection.invokeMethod(VMReflection.java)

Test: test_isProbablePrimeIClass: tests.api.java.math.BigIntegerTestjunit.framework.AssertionFailedError: false negative on prime number <1000
	at tests.api.java.math.BigIntegerTest.test_isProbablePrimeI(BigIntegerTest.java:213)
	at java.lang.reflect.VMReflection.invokeMethod(VMReflection.java)

Test: test_toStringIClass: tests.api.java.math.BigIntegerTestjunit.framework.AssertionFailedError: ABF345678901234.toString(16)
	at tests.api.java.math.BigIntegerTest.test_toStringI(BigIntegerTest.java:768)
	at java.lang.reflect.VMReflection.invokeMethod(VMReflection.java)

Test: test_formatLjava_lang_String$Ljava_lang_Object_BigIntegerPaddingConversionClass: tests.api.java.util.FormatterTestjunit.framework.ComparisonFailure: expected:<...+18ee90ff6c373e0ee4e3f0ad...> but was:<...                        +...>
	at tests.api.java.util.FormatterTest.test_formatLjava_lang_String$Ljava_lang_Object_BigIntegerPaddingConversion(FormatterTest.java:2623)
	at java.lang.reflect.VMReflection.invokeMethod(VMReflection.java)

Test: test_formatLjava_lang_String$Ljava_lang_Object_FloatConversionEClass: tests.api.java.util.FormatterTestjunit.framework.AssertionFailedError: triple[30]:@.0,pattern[30]:%e expected:<3.412346e+01> but was:<@.000000e+00>
	at tests.api.java.util.FormatterTest.test_formatLjava_lang_String$Ljava_lang_Object_FloatConversionE(FormatterTest.java:2995)
	at java.lang.reflect.VMReflection.invokeMethod(VMReflection.java)

Test: test_formatLjava_lang_String$Ljava_lang_Object_FloatConversionGClass: tests.api.java.util.FormatterTestjunit.framework.AssertionFailedError: triple[0]:@.0,pattern[0]:%g expected:<1001.00> but was:<1.00100e+03>
	at tests.api.java.util.FormatterTest.test_formatLjava_lang_String$Ljava_lang_Object_FloatConversionG(FormatterTest.java:3183)
	at java.lang.reflect.VMReflection.invokeMethod(VMReflection.java)

Test: test_formatLjava_lang_String$Ljava_lang_Object_FloatConversionG_OverflowClass: tests.api.java.util.FormatterTestjunit.framework.ComparisonFailure: expected:<1.00000e+06> but was:<@.00000e+00>
	at tests.api.java.util.FormatterTest.test_formatLjava_lang_String$Ljava_lang_Object_FloatConversionG_Overflow(FormatterTest.java:3223)
	at java.lang.reflect.VMReflection.invokeMethod(VMReflection.java)

Test: test_formatLjava_lang_String$Ljava_lang_Object_FloatConversionFClass: tests.api.java.util.FormatterTestjunit.framework.AssertionFailedError: triple[35]:@.0,pattern[35]:%f expected:<345,123444> but was:<@,000000>
	at tests.api.java.util.FormatterTest.test_formatLjava_lang_String$Ljava_lang_Object_FloatConversionF(FormatterTest.java:3487)
	at java.lang.reflect.VMReflection.invokeMethod(VMReflection.java)

Test: test_formatLjava_lang_String$Ljava_lang_Object_BigDecimalConversionGClass: tests.api.java.util.FormatterTestjunit.framework.AssertionFailedError: triple[6]:1,pattern[6]:%g expected:<1.00000> but was:<1.00000e+00>
	at tests.api.java.util.FormatterTest.test_formatLjava_lang_String$Ljava_lang_Object_BigDecimalConversionG(FormatterTest.java:3810)
	at java.lang.reflect.VMReflection.invokeMethod(VMReflection.java)


***********************************************************
Modifications since last successful build:	(19)
            
modified ayza  /harmony/enhanced/classlib/trunk/modules/math/src/main/java/java/math/BigDecimal.java 02/06/2007 21:18:31 Applying patch from HARMONY-2429 ([classlib][math] java.math.BigDecimal(-0.0) returns wrong object)
modified ayza  /harmony/enhanced/classlib/trunk/modules/math/src/test/java/tests/api/java/math/BigDecimalTest.java 02/06/2007 21:18:31 Applying patch from HARMONY-2429 ([classlib][math] java.math.BigDecimal(-0.0) returns wrong object)
add cc-drlvm log20070206204109Lbuild.242 02/06/2007 20:41:09drlvm
modified hindessm  /harmony/enhanced/classlib/trunk/modules/luni/src/main/native/luni/shared/fltconst.h 02/06/2007 20:32:44 Adding defines for 64bit and big endian platforms.
modified hindessm  /harmony/enhanced/classlib/trunk/modules/portlib/src/main/native/include/shared/hycomp.h 02/06/2007 20:32:44 Adding defines for 64bit and big endian platforms.
modified hindessm  /harmony/enhanced/classlib/trunk/modules/luni/src/main/native/luni/shared/bigint.c 02/06/2007 20:32:44 Adding defines for 64bit and big endian platforms.
modified hindessm  /harmony/enhanced/classlib/trunk/modules/luni/src/main/native/luni/shared/cbigint.c 02/06/2007 20:32:44 Adding defines for 64bit and big endian platforms.
modified hindessm  /harmony/enhanced/classlib/trunk/modules/luni/src/main/native/luni/shared/fltparse.c 02/06/2007 20:32:44 Adding defines for 64bit and big endian platforms.
add cc-classlib log20070206203029Lbuild.208 02/06/2007 20:30:29classlib
modified apetrenko  /harmony/enhanced/classlib/trunk/modules/swing/src/main/java/common/javax/swing/plaf/basic/BasicTextAreaUI.java 02/06/2007 20:27:42 Updated patch for HARMONY-2602 "[classlib][swing][plaf] javax.swing.plaf.basic.BasicTextAreaUI.create(null) doesn't throw NPE"
modified tellison  /harmony/enhanced/classlib/trunk/modules/luni/src/main/java/java/net/InetAddress.java 02/06/2007 20:19:13 Apply patch HARMONY-2973 ([classlib] [luni] Concerns about synchronization in java.net.InetAddress)
modified apetrenko  /harmony/enhanced/classlib/trunk/modules/swing/src/main/java/common/javax/swing/colorchooser/SwatchesPanel.java 02/06/2007 20:15:00 Patch for HARMONY-2711 "[classlib][swing] j.s.JColorChooser should use "ColorChooser.swatchesDefaultRecentColor" L&F key"
modified ayza  /harmony/enhanced/classlib/trunk/modules/swing/src/main/java/common/javax/swing/DefaultListCellRenderer.java 02/06/2007 20:02:52 Applying patch from HARMONY-2572 ([classlib][swing] javax.swing.DefaultListCellRenderer.isOpaque()returns false)
modified ayza  /harmony/enhanced/classlib/trunk/modules/swing/src/test/api/java/common/javax/swing/DefaultListCellRendererTest.java 02/06/2007 20:02:52 Applying patch from HARMONY-2572 ([classlib][swing] javax.swing.DefaultListCellRenderer.isOpaque()returns false)
modified apetrenko  /harmony/enhanced/classlib/trunk/modules/swing/src/main/java/common/javax/swing/text/AWTCaret.java 02/06/2007 19:29:39 Patch for HARMONY-2782 "[classlib][swing] j.s.text.DefaultCaret.install doesn't throw NPE whereas RI does"
modified apetrenko  /harmony/enhanced/classlib/trunk/modules/swing/src/main/java/common/javax/swing/text/JTextComponent.java 02/06/2007 19:29:39 Patch for HARMONY-2782 "[classlib][swing] j.s.text.DefaultCaret.install doesn't throw NPE whereas RI does"
modified apetrenko  /harmony/enhanced/classlib/trunk/modules/swing/src/main/java/common/javax/swing/text/DefaultCaret.java 02/06/2007 19:29:39 Patch for HARMONY-2782 "[classlib][swing] j.s.text.DefaultCaret.install doesn't throw NPE whereas RI does"
modified apetrenko  /harmony/enhanced/classlib/trunk/modules/awt/src/main/java/common/org/apache/harmony/awt/text/TextCaret.java 02/06/2007 19:29:39 Patch for HARMONY-2782 "[classlib][swing] j.s.text.DefaultCaret.install doesn't throw NPE whereas RI does"
modified ayza  /harmony/enhanced/classlib/trunk/modules/swing/make/exclude.common 02/06/2007 19:22:03 Removing JEditorPaneTest from the exclude list since I cannot reproduce any failures neither on Windows nor on Linux (on IA32)

Mime
View raw message