harmony-alerts mailing list archives

Site index · List index
Message view « Date » · « Thread »
Top « Date » · « Thread »
From nom...@hursley.ibm.com
Subject [continuum] BUILD FAILURE: Classlib/linux.ia32 Build/Test
Date Mon, 05 Feb 2007 10:43:38 GMT
Online report : http://people.apache.org/~hindessm/continuum/classlib/linux.ia32/2007/02/05/20070205-104338.failure.log.gz
Build statistics:
  State: Failed
  Previous State: Error
  Started at: Mon, 5 Feb 2007 09:31:11 +0000
  Finished at: Mon, 5 Feb 2007 10:43:35 +0000
  Total time: 1h 12m 24s
  Build Trigger: Forced
  Exit code: 1
  Building machine hostname: hy2
  Operating system : Linux(unknown)
  Java version : 1.5.0_06(Sun Microsystems Inc.)

Changes
                            classlib/modules/awt/src/main/native/oglwrapper/unix/liboglwrapper.exp
            classlib/modules/x-net/.classpath
            classlib/modules/x-net/META-INF/MANIFEST.MF
            classlib/modules/x-net/src/test/impl/java/org/apache/harmony/xnet/tests/provider/jsse/TrustManagerFactoryImplTest.java
            classlib/modules/x-net/src/test/impl/java/org/apache/harmony/xnet/tests/provider/jsse/ProtocolVersionTest.java
            classlib/modules/x-net/src/test/impl/java/org/apache/harmony/xnet/tests/provider/jsse/KeyManagerFactoryImplTest.java
            classlib/modules/x-net/src/test/impl/java.injected/org/apache/harmony/xnet/provider/jsse/DigitalSignatureTest.java
            classlib/modules/x-net/src/test/impl/java.injected/org/apache/harmony/xnet/provider/jsse/ServerHandshakeImplTest.java
            classlib/modules/x-net/src/test/impl/java.injected/org/apache/harmony/xnet/provider/jsse/DelegatedTaskTest.java
            classlib/modules/x-net/src/test/impl/java.injected/org/apache/harmony/xnet/provider/jsse/KeyManagerImplTest.java
            classlib/modules/x-net/src/test/impl/java.injected/org/apache/harmony/xnet/provider/jsse/SSLStreamedInputTest.java
            classlib/modules/x-net/src/test/impl/java.injected/org/apache/harmony/xnet/provider/jsse/HandshakeProtocolTest.java
            classlib/modules/x-net/src/test/impl/java.injected/org/apache/harmony/xnet/provider/jsse/SSLEngineImplTest.java
            classlib/modules/x-net/src/test/impl/java.injected/org/apache/harmony/xnet/provider/jsse/SSLSocketFactoriesTest.java
            classlib/modules/x-net/src/test/impl/java.injected/org/apache/harmony/xnet/provider/jsse/SSLServerSocketImplTest.java
            classlib/modules/x-net/src/test/impl/java.injected/org/apache/harmony/xnet/provider/jsse/CipherSuiteTest.java
            classlib/modules/x-net/src/test/impl/java.injected/org/apache/harmony/xnet/provider/jsse/SSLSessionImplTest.java
            classlib/modules/x-net/src/test/impl/java.injected/org/apache/harmony/xnet/provider/jsse/SSLSessionContextImplTest.java
            classlib/modules/x-net/src/test/impl/java.injected/org/apache/harmony/xnet/provider/jsse/SSLSocketImplTest.java
            classlib/modules/x-net/src/test/impl/java.injected/org/apache/harmony/xnet/provider/jsse/SSLSocketFunctionalTest.java
            classlib/modules/x-net/src/test/impl/java.injected/org/apache/harmony/xnet/provider/jsse/TrustManagerImplTest.java
            classlib/modules/x-net/src/test/api/java/org/apache/harmony/xnet/tests/javax/net/ssl/TrustManagerFactory1Test.java
            classlib/modules/x-net/src/test/api/java/org/apache/harmony/xnet/tests/javax/net/ssl/TrustManagerFactory2Test.java
            classlib/modules/x-net/src/test/api/java/org/apache/harmony/xnet/tests/javax/net/ssl/SSLContext1Test.java
            classlib/modules/x-net/src/test/api/java/org/apache/harmony/xnet/tests/javax/net/ssl/SSLContext2Test.java
            classlib/modules/x-net/src/test/api/java/org/apache/harmony/xnet/tests/javax/net/ssl/KeyManagerFactory1Test.java
            classlib/modules/x-net/src/test/api/java/org/apache/harmony/xnet/tests/javax/net/ssl/KeyManagerFactory2Test.java
            classlib/modules/x-net/src/test/resources/key_store.bks
            classlib/modules/x-net/src/test/support/common/java/org/apache/harmony/xnet/tests/support/MyTrustManagerFactorySpi.java
            classlib/modules/x-net/src/test/support/common/java/org/apache/harmony/xnet/tests/support/MySSLContextSpi.java
            classlib/modules/x-net/src/test/support/common/java/org/apache/harmony/xnet/tests/support/MyKeyManagerFactorySpi.java
            classlib/modules/x-net/src/test/support/common/java/org/apache/harmony/xnet/provider/jsse/JSSETestData.java
            classlib/modules/x-net/src/main/java/org/apache/harmony/xnet/provider/jsse/SSLParameters.java
            classlib/modules/x-net/src/main/java/org/apache/harmony/xnet/provider/jsse/SSLContextImpl.java
            classlib/modules/x-net/build.xml
            classlib/modules/luni/src/main/java/java/net/Socket.java
            classlib/modules/luni/src/main/java/java/io/File.java
            classlib/modules/luni/src/main/java/org/apache/harmony/luni/internal/net/www/protocol/http/HttpURLConnection.java
            classlib/modules/portlib/src/main/native/port/unix/hyfile.c
            classlib/modules/portlib/src/main/native/port/windows/hyfile.c
        
****************************************************************************
Output:
****************************************************************************
Buildfile: build.xml

svn-prop:

build:
   [delete] Deleting directory /home/hybld/continuum-working-directory/6/classlib/deploy
     [echo] Classlib revision is 503601
     [echo] Post process: true
     [echo] JAPI: true
     [echo] Building with reference jdk/javac
     [exec] Buildfile: build.xml

     [exec] -init-hdk-for-clean:
     [exec]     [mkdir] Created dir: /home/hybld/continuum-working-directory/6/classlib/deploy/build/ant
     [exec]      [copy] Copying 1 file to /home/hybld/continuum-working-directory/6/classlib/deploy/build/ant

     [exec] clean-java:

     [exec] -modules-clean-bin:

     [exec] clean:
     [exec]    [delete] Deleting 30 files from /home/hybld/continuum-working-directory/6/classlib/build/classes
     [exec]    [delete] Deleting 12 files from /home/hybld/continuum-working-directory/6/classlib/modules/accessibility/bin/test

     [exec] clean:
     [exec]    [delete] Deleting 13 files from /home/hybld/continuum-working-directory/6/classlib/build/classes
     [exec]    [delete] Deleting 1 files from /home/hybld/continuum-working-directory/6/classlib/modules/annotation/bin/test

     [exec] clean:
     [exec]    [delete] Deleting 35 files from /home/hybld/continuum-working-directory/6/classlib/build/classes
     [exec]    [delete] Deleting 1 files from /home/hybld/continuum-working-directory/6/classlib/modules/applet/bin/test

     [exec] clean:
     [exec]    [delete] Deleting 41 files from /home/hybld/continuum-working-directory/6/classlib/build/classes
     [exec]    [delete] Deleting 34 files from /home/hybld/continuum-working-directory/6/classlib/modules/archive/bin/test

     [exec] clean-native-includes:
     [exec]    [delete] /home/hybld/continuum-working-directory/6/classlib/deploy/include
not found.

     [exec] clean:
     [exec]    [delete] Deleting 112 files from /home/hybld/continuum-working-directory/6/classlib/build/classes
     [exec]    [delete] Deleting 226 files from /home/hybld/continuum-working-directory/6/classlib/modules/auth/bin/test

     [exec] clean:
     [exec]    [delete] Deleting 901 files from /home/hybld/continuum-working-directory/6/classlib/build/classes
     [exec]    [delete] Deleting 611 files from /home/hybld/continuum-working-directory/6/classlib/modules/awt/bin/test

     [exec] clean:
     [exec]    [delete] Deleting 107 files from /home/hybld/continuum-working-directory/6/classlib/build/classes
     [exec]    [delete] Deleting 238 files from /home/hybld/continuum-working-directory/6/classlib/modules/beans/bin/test

     [exec] clean:
     [exec]    [delete] Deleting 125 files from /home/hybld/continuum-working-directory/6/classlib/build/classes
     [exec]    [delete] /home/hybld/continuum-working-directory/6/classlib/modules/concurrent/bin/test
not found.

     [exec] clean:
     [exec]    [delete] Deleting 48 files from /home/hybld/continuum-working-directory/6/classlib/build/classes
     [exec]    [delete] Deleting 90 files from /home/hybld/continuum-working-directory/6/classlib/modules/crypto/bin/test

     [exec] clean:
     [exec]    [delete] Deleting 87 files from /home/hybld/continuum-working-directory/6/classlib/build/classes

     [exec] clean:
     [exec]    [delete] Deleting 9 files from /home/hybld/continuum-working-directory/6/classlib/build/classes
     [exec]    [delete] Deleting 20 files from /home/hybld/continuum-working-directory/6/classlib/modules/instrument/bin/test

     [exec] clean:
     [exec]    [delete] Deleting 154 files from /home/hybld/continuum-working-directory/6/classlib/build/classes
     [exec]    [delete] Deleting 163 files from /home/hybld/continuum-working-directory/6/classlib/modules/jndi/bin/test

     [exec] clean:
     [exec]    [delete] Deleting 43 files from /home/hybld/continuum-working-directory/6/classlib/build/classes
     [exec]    [delete] /home/hybld/continuum-working-directory/6/classlib/modules/lang-management/${hy.lang-management.bin.test}
not found.

     [exec] clean:
     [exec]    [delete] Deleting 34 files from /home/hybld/continuum-working-directory/6/classlib/build/classes
     [exec]    [delete] Deleting 100 files from /home/hybld/continuum-working-directory/6/classlib/modules/logging/bin/test

     [exec] clean:
     [exec]    [delete] Deleting 963 files from /home/hybld/continuum-working-directory/6/classlib/build/classes
     [exec]    [delete] Deleting 910 files from /home/hybld/continuum-working-directory/6/classlib/modules/luni/bin/test

     [exec] clean-native-includes:
     [exec]    [delete] /home/hybld/continuum-working-directory/6/classlib/deploy/include
not found.
     [exec]    [delete] /home/hybld/continuum-working-directory/6/classlib/deploy/jdk/include
not found.

     [exec] clean:
     [exec]    [delete] Deleting 29 files from /home/hybld/continuum-working-directory/6/classlib/build/classes

     [exec] clean:
     [exec]    [delete] Deleting 14 files from /home/hybld/continuum-working-directory/6/classlib/build/classes
     [exec]    [delete] Deleting 25 files from /home/hybld/continuum-working-directory/6/classlib/modules/math/bin/test

     [exec] clean:
     [exec]    [delete] Deleting 14 files from /home/hybld/continuum-working-directory/6/classlib/build/classes

...

     [exec]     [junit] Tests run: 25, Failures: 0, Errors: 0, Time elapsed: 1.002 sec
     [exec]     [junit] Tests run: 7, Failures: 0, Errors: 0, Time elapsed: 0.016 sec
     [exec]     [junit] Tests run: 14, Failures: 0, Errors: 0, Time elapsed: 0.777 sec
     [exec]     [junit] Tests run: 21, Failures: 2, Errors: 0, Time elapsed: 21.994 sec
     [exec]     [junit] TEST javax.swing.JSpinnerTest FAILED
     [exec]     [junit] Tests run: 1, Failures: 1, Errors: 0, Time elapsed: 10.007 sec
     [exec]     [junit] TEST javax.swing.JTabbedPaneRTest FAILED
     [exec]     [junit] Tests run: 1, Failures: 0, Errors: 1, Time elapsed: 0 sec
     [exec]     [junit] Tests FAILED (timeout)

     [exec] touch-failures-file:

     [exec] touch-errors-file:


...

     [exec] gen-report:

     [exec] check-test-result:

     [exec] BUILD FAILED
     [exec] /home/hybld/continuum-working-directory/6/classlib/build.xml:167: The following
error occurred while executing this line:
     [exec] /home/hybld/continuum-working-directory/6/classlib/make/build-test.xml:133: There
were test crashes: /home/hybld/continuum-working-directory/6/classlib/build/test_report/TEST-javax.swing.JTabbedPaneTest.xml

     [exec] Total time: 54 minutes 42 seconds
     [exec] Result: 1
     [echo] Tests.failed is set to true

japi:
   [delete] Deleting: /home/hybld/continuum-working-directory/6/classlib/harmony.japi.gz

     [exec] Processing class java.lang,Object:+

...

     [exec] Processing package java.lang.management,:=============================================================================++++-+++++++++++
     [exec] Processing package java.lang.ref,:=============================================================================+++++
     [exec] Processing package java.lang.reflect,:=============================================================================+++++++++++++++++++++
     [exec] Processing class ,java:
     [exec] Failed to Japize java: java.lang.RuntimeException: NoClassDefFoundError: java
     [exec] java.lang.RuntimeException: NoClassDefFoundError: java
     [exec] 	at net.wuffies.japi.ClassFile.forName(ClassFile.java:163)
     [exec] 	at net.wuffies.japi.Japize.getClassWrapper(Japize.java:1425)
     [exec] 	at net.wuffies.japi.Japize.japizeClass(Japize.java:748)
     [exec] 	at net.wuffies.japi.Japize.processClass(Japize.java:516)

...

     [exec] 	at net.wuffies.japi.Japize.doJapize(Japize.java:443)
     [exec] 	at net.wuffies.japi.Japize.main(Japize.java:316)

     [exec] Processing class ,javax:
     [exec] Failed to Japize javax: java.lang.RuntimeException: NoClassDefFoundError: javax
     [exec] java.lang.RuntimeException: NoClassDefFoundError: javax
     [exec] 	at net.wuffies.japi.ClassFile.forName(ClassFile.java:163)
     [exec] 	at net.wuffies.japi.Japize.getClassWrapper(Japize.java:1425)
     [exec] 	at net.wuffies.japi.Japize.japizeClass(Japize.java:748)
     [exec] 	at net.wuffies.japi.Japize.processClass(Japize.java:516)

...

     [exec] 	at net.wuffies.japi.Japize.doJapize(Japize.java:443)
     [exec] 	at net.wuffies.japi.Japize.main(Japize.java:316)

     [exec] Processing class ,org:
     [exec] Failed to Japize org: java.lang.RuntimeException: NoClassDefFoundError: org
     [exec] java.lang.RuntimeException: NoClassDefFoundError: org
     [exec] 	at net.wuffies.japi.ClassFile.forName(ClassFile.java:163)
     [exec] 	at net.wuffies.japi.Japize.getClassWrapper(Japize.java:1425)
     [exec] 	at net.wuffies.japi.Japize.japizeClass(Japize.java:748)
     [exec] 	at net.wuffies.japi.Japize.processClass(Japize.java:516)

...

     [exec] Processing package javax.print,:=============================================================================++++-+++++++++++;;++;;++--++++++
     [exec] Processing package javax.print.attribute,:=============================================================================+;;++----------++;;+++++++++;;++;;++;;++++++++
     [exec] Processing package javax.print.attribute.standard,:=============================================================================++++++++++++++++++++++++++++++++++++++++++++++++++++++++++++++++++++++++++
     [exec] Processing package javax.print.event,:=============================================================================
     [exec] Failed to Japize javax.print.event.PrintEvent: java.lang.ArrayIndexOutOfBoundsException
     [exec] java.lang.ArrayIndexOutOfBoundsException
     [exec] 	at java.util.Arrays.mergeSort(Arrays.java:2460)
     [exec] 	at java.util.Arrays.sort(Arrays.java:2369)
     [exec] 	at java.util.Arrays.sort(Arrays.java:2329)
     [exec] 	at net.wuffies.japi.BoundMemberSet.getCalls(BoundMemberSet.java:46)

...

     [exec] 	at net.wuffies.japi.Japize.processRootSet(Japize.java:471)
     [exec] 	at net.wuffies.japi.Japize.doJapize(Japize.java:443)
     [exec] 	at net.wuffies.japi.Japize.main(Japize.java:316)

     [exec] Failed to Japize javax.print.event.PrintJobAdapter: java.lang.ArrayIndexOutOfBoundsException
     [exec] java.lang.ArrayIndexOutOfBoundsException
     [exec] 	at java.util.Arrays.mergeSort(Arrays.java:2452)
     [exec] 	at java.util.Arrays.sort(Arrays.java:2369)
     [exec] 	at java.util.Arrays.sort(Arrays.java:2329)
     [exec] 	at net.wuffies.japi.BoundMemberSet.getCalls(BoundMemberSet.java:46)

...

     [exec] 	at net.wuffies.japi.Japize.processRootSet(Japize.java:471)
     [exec] 	at net.wuffies.japi.Japize.doJapize(Japize.java:443)
     [exec] 	at net.wuffies.japi.Japize.main(Japize.java:316)

     [exec] Failed to Japize javax.print.event.PrintJobAttributeEvent: java.lang.ArrayIndexOutOfBoundsException
     [exec] java.lang.ArrayIndexOutOfBoundsException
     [exec] 	at java.util.Arrays.mergeSort(Arrays.java:2460)
     [exec] 	at java.util.Arrays.sort(Arrays.java:2369)
     [exec] 	at java.util.Arrays.sort(Arrays.java:2329)
     [exec] 	at net.wuffies.japi.BoundMemberSet.getCalls(BoundMemberSet.java:46)

...

     [exec] 	at net.wuffies.japi.Japize.processRootSet(Japize.java:471)
     [exec] 	at net.wuffies.japi.Japize.doJapize(Japize.java:443)
     [exec] 	at net.wuffies.japi.Japize.main(Japize.java:316)
     [exec] +
     [exec] Failed to Japize javax.print.event.PrintJobEvent: java.lang.ArrayIndexOutOfBoundsException
     [exec] java.lang.ArrayIndexOutOfBoundsException
     [exec] 	at java.util.Arrays.mergeSort(Arrays.java:2460)
     [exec] 	at java.util.Arrays.sort(Arrays.java:2369)
     [exec] 	at java.util.Arrays.sort(Arrays.java:2329)
     [exec] 	at net.wuffies.japi.BoundMemberSet.getCalls(BoundMemberSet.java:46)

...

     [exec] 	at net.wuffies.japi.Japize.processRootSet(Japize.java:471)
     [exec] 	at net.wuffies.japi.Japize.doJapize(Japize.java:443)
     [exec] 	at net.wuffies.japi.Japize.main(Japize.java:316)
     [exec] +
     [exec] Failed to Japize javax.print.event.PrintServiceAttributeEvent: java.lang.ArrayIndexOutOfBoundsException
     [exec] java.lang.ArrayIndexOutOfBoundsException
     [exec] 	at java.util.Arrays.mergeSort(Arrays.java:2460)
     [exec] 	at java.util.Arrays.sort(Arrays.java:2369)
     [exec] 	at java.util.Arrays.sort(Arrays.java:2329)
     [exec] 	at net.wuffies.japi.BoundMemberSet.getCalls(BoundMemberSet.java:46)

...

update-index:

test-result:

BUILD FAILED
/home/hybld/continuum-working-directory/6/build.xml:203: There were test errors.

Total time: 72 minutes 22 seconds

****************************************************************************

...

Mime
View raw message