harmony-alerts mailing list archives

Site index · List index
Message view « Date » · « Thread »
Top « Date » · « Thread »
From nom...@intel.com
Subject [build-test alert] BUILD FAILED Linux SUSE 9 gcc debug: classlib over drlvm
Date Sun, 04 Feb 2007 10:57:05 GMT
BUILD FAILED:
	Ant Error Message:
/export/cruise/trunk/cc/projects/classlib/trunk/build.xml:167: The following error occurred
while executing this line: /export/cruise/trunk/cc/projects/classlib/trunk/make/build-test.xml:138:
There were test errors.

Date of build:	02/04/2007 16:16:36
Time to build:	39 minutes 55 seconds
Last changed:	02/04/2007 15:08:02
Last log entry:	drlvm

***********************************************************
Errors/Warnings:	(320)
            

========================================
Testing class libraries...
========================================
Checking for depends/jars/yoko_M2-20070130/yoko.jar
Checking for depends/jars/yoko_M2-20070130/yoko-core.jar
Checking for depends/jars/yoko_M2-20070130/yoko-rmi-impl.jar
Checking for depends/jars/yoko_M2-20070130/yoko-rmi-spec.jar
Checking for depends/jars/bcel-5.2/bcel-5.2.jar
Checking for depends/jars/xalan-j_2.7.0/xalan.jar
Checking for depends/jars/xerces_2.8.0/resolver.jar
Checking for depends/jars/xerces_2.8.0/xercesImpl.jar
Checking for depends/jars/xerces_2.8.0/xml-apis.jar
Checking for depends/jars/junit_3.8.2/junit.jar
Checking for depends/jars/bcprov-jdk15-134/bcprov.jar
Checking for depends/jars/icu4j_3.4.4/icu4j_3_4_4.jar
Checking for depends/jars/mx4j_3.0.1/mx4j.jar
Checking for depends/jars/mx4j_3.0.1/mx4j-remote.jar
Checking for depends/jars/ecj_3.2/ecj_3.2.jar
Checking for depends/jars/jetty/jetty-6.0.0.jar
Checking for depends/jars/jetty/jetty-util-6.0.0.jar
Checking for depends/jars/jetty/servlet-api-2.5-6.0.0.jar
Checking for depends/libs/build/lcms/icc34.h
Checking for depends/libs/build/lcms/lcms.h
Checking for depends/libs/build/png/pngconf.h
Checking for depends/libs/build/png/png.h
Checking for depends/libs/build/jpeg/jconfig.lnx
Checking for depends/libs/build/jpeg/jpeglib.h
Checking for depends/libs/build/jpeg/jmorecfg.h
Checking for depends/libs/build/jpeg/jerror.h
Checking for depends/libs/build/lcms/liblcms.linux.x86
Checking for depends/libs/build/png/libpng.linux.x86
Checking for depends/libs/build/jpeg/libjpeg.linux.x86
Since fork is false, ignoring memoryMaximumSize setting
Compiling ACCESSIBILITY classes
Compiling ACCESSIBILITY tests
Since fork is false, ignoring memoryMaximumSize setting
Compiling ANNOTATION classes
Compiling ANNOTATION tests
Since fork is false, ignoring memoryMaximumSize setting
Compiling APPLET classes
Compiling APPLET tests
Since fork is false, ignoring memoryMaximumSize setting
Compiling ARCHIVE classes
Compiling ARCHIVE tests
Since fork is false, ignoring memoryMaximumSize setting
Compiling AUTH classes
Compiling AUTH tests
Since fork is false, ignoring memoryMaximumSize setting
Compiling AWT classes
Compiling AWT tests
Since fork is false, ignoring memoryMaximumSize setting
java.lang.RuntimeException: expected from EDT
	at java.awt.EventDispatchThreadRTest$1.run(EventDispatchThreadRTest.java:29)
	at java.awt.event.InvocationEvent.runAndNotify(InvocationEvent.java:90)
	at java.awt.event.InvocationEvent.dispatch(InvocationEvent.java:77)
	at java.awt.EventQueueCore.dispatchEventImpl(EventQueueCore.java:138)
	at java.awt.EventQueue.dispatchEvent(EventQueue.java:144)
	at java.awt.EventDispatchThread.runModalLoop(EventDispatchThread.java:73)
	at java.awt.EventDispatchThread.run(EventDispatchThread.java:45)
Compiling BEANS classes
Compiling support classes for BEANS tests
Compiling internal BEANS tests
Compiling BEANS tests
Since fork is false, ignoring memoryMaximumSize setting
Running internal BEANS tests
Running BEANS tests
Compiling CRYPTO classes
Compiling CRYPTO test support files
Since fork is false, ignoring memoryMaximumSize setting
Compiling CRYPTO api tests
Since fork is false, ignoring memoryMaximumSize setting
Compiling CRYPTO api injected tests
Since fork is false, ignoring memoryMaximumSize setting
Compiling CRYPTO impl injected tests
Since fork is false, ignoring memoryMaximumSize setting
Compiling CRYPTO impl tests
Since fork is false, ignoring memoryMaximumSize setting
Running CRYPTO api tests
Running CRYPTO api.injected tests
Running CRYPTO impl tests
Running CRYPTO impl injected tests
Compiling ImageIO classes
Compiling ImageIO tests
Compiling INSTRUMENT classes
Compiling INSTRUMENT tests
Since fork is false, ignoring memoryMaximumSize setting
Compiling JNDI classes
Compiling JNDI tests
Since fork is false, ignoring memoryMaximumSize setting
Compiling LANG-MANAGEMENT classes
Compiling LANG-MANAGEMENT API tests
Compiling LANG-MANAGEMENT Implementation tests
Compiling LOGGING classes
Compiling LOGGING tests
Since fork is false, ignoring memoryMaximumSize setting
Compiling LUNI classes
Compiling LUNI JUnit Tests
Since fork is false, ignoring memoryMaximumSize setting
Running LUNI JUnit Tests
java.io.IOException: Stream is closed
	at java.io.BufferedInputStream.read(BufferedInputStream.java:247)
	at java.io.FilterInputStream.read(FilterInputStream.java:137)
	at tests.support.Support_Exec$2.run(Support_Exec.java:199)
	at java.lang.Thread.run(Thread.java:660)
Compiling MATH classes
Compiling MATH tests
Since fork is false, ignoring memoryMaximumSize setting
Compiling MISC classes
Compiling MISC tests
Since fork is false, ignoring memoryMaximumSize setting
Compiling NIO classes
Compiling NIO tests
Since fork is false, ignoring memoryMaximumSize setting
Compiling NIO_CHAR classes
Compiling NIO_CHAR tests
Since fork is false, ignoring memoryMaximumSize setting
Cannot find unmappable byte array for US-ASCII
Cannot find unmappable byte array for gb18030
Cannot find unmappable byte array for ISO-8859-1
Cannot find malform byte array for ISO-8859-1
Cannot find unmappable byte array for UTF-16BE
Cannot find malform byte array for UTF-16BE
Cannot find unmappable byte array for UTF-16LE
Cannot find malform byte array for UTF-16LE
Cannot find unmappable byte array for UTF-8
Compiling PACK200 classes
Compiling PACK200 tests
Since fork is false, ignoring memoryMaximumSize setting
Running PACK200 tests
init: passed
hyerror: passed
hytime: passed
hyfile: passed
Compiling PREFS classes
Compiling PREFS tests
Since fork is false, ignoring memoryMaximumSize setting
Compiling PRINT classes
Compiling Print tests
Since fork is false, ignoring memoryMaximumSize setting
java.net.ConnectException: localhost/127.0.0.1:631 - Connection refused
	at org.apache.harmony.luni.net.PlainSocketImpl.connect(PlainSocketImpl.java:229)
	at org.apache.harmony.luni.net.PlainSocketImpl.connect(PlainSocketImpl.java:508)
	at java.net.Socket.connect(Socket.java:930)
	at org.apache.harmony.luni.internal.net.www.protocol.http.HttpURLConnection.getHTTPConnection(HttpURLConnection.java:635)
	at org.apache.harmony.luni.internal.net.www.protocol.http.HttpURLConnection.connect(HttpURLConnection.java:616)
	at org.apache.harmony.x.print.ipp.IppClient.request(IppClient.java:110)
	at org.apache.harmony.x.print.ipp.IppClient.request(IppClient.java:87)
	at org.apache.harmony.x.print.cups.CUPSPrintServiceProvider.findDefaultPrintService(CUPSPrintServiceProvider.java:471)
	at org.apache.harmony.x.print.cups.CUPSPrintServiceProvider.getDefaultPrintService(CUPSPrintServiceProvider.java:168)
	at javax.print.PrintServiceLookup.lookupDefaultPrintService(PrintServiceLookup.java:138)
	at javax.print.attribute.HashAttributeTest.testAdd2(HashAttributeTest.java)
	at java.lang.reflect.VMReflection.invokeMethod(VMReflection.java)
	at java.lang.reflect.Method.invoke(Method.java:381)
	at junit.framework.TestCase.runTest(TestCase.java:164)
	at junit.framework.TestCase.runBare(TestCase.java:128)
	at junit.framework.TestResult$1.protect(TestResult.java)
	at junit.framework.TestResult.runProtected(TestResult.java)
	at junit.framework.TestResult.run(TestResult.java:104)
	at junit.framework.TestCase.run(TestCase.java)
	at junit.framework.TestSuite.runTest(TestSuite.java)
	at junit.framework.TestSuite.run(TestSuite.java:224)
	at org.apache.tools.ant.taskdefs.optional.junit.JUnitTestRunner.run(JUnitTestRunner.java:294)
	at org.apache.tools.ant.taskdefs.optional.junit.JUnitTestRunner.launch(JUnitTestRunner.java:670)
	at org.apache.tools.ant.taskdefs.optional.junit.JUnitTestRunner.main(JUnitTestRunner.java:545)
java.net.ConnectException: localhost/127.0.0.1:631 - Connection refused
	at org.apache.harmony.luni.net.PlainSocketImpl.connect(PlainSocketImpl.java:229)
	at org.apache.harmony.luni.net.PlainSocketImpl.connect(PlainSocketImpl.java:508)
	at java.net.Socket.connect(Socket.java:930)
	at org.apache.harmony.luni.internal.net.www.protocol.http.HttpURLConnection.getHTTPConnection(HttpURLConnection.java:635)
	at org.apache.harmony.luni.internal.net.www.protocol.http.HttpURLConnection.connect(HttpURLConnection.java:616)
	at org.apache.harmony.x.print.ipp.IppClient.request(IppClient.java:110)
	at org.apache.harmony.x.print.ipp.IppClient.request(IppClient.java:87)
	at org.apache.harmony.x.print.cups.CUPSPrintServiceProvider.findDefaultPrintService(CUPSPrintServiceProvider.java:471)
	at org.apache.harmony.x.print.cups.CUPSPrintServiceProvider.getDefaultPrintService(CUPSPrintServiceProvider.java:168)
	at javax.print.PrintServiceLookup.lookupDefaultPrintService(PrintServiceLookup.java:138)
	at javax.print.attribute.HashAttributeTest.testEquals(HashAttributeTest.java:283)
	at java.lang.reflect.VMReflection.invokeMethod(VMReflection.java)
	at java.lang.reflect.Method.invoke(Method.java:381)
	at junit.framework.TestCase.runTest(TestCase.java:164)
	at junit.framework.TestCase.runBare(TestCase.java:128)
	at junit.framework.TestResult$1.protect(TestResult.java)
	at junit.framework.TestResult.runProtected(TestResult.java)
	at junit.framework.TestResult.run(TestResult.java:104)
	at junit.framework.TestCase.run(TestCase.java)
	at junit.framework.TestSuite.runTest(TestSuite.java)
	at junit.framework.TestSuite.run(TestSuite.java:224)
	at org.apache.tools.ant.taskdefs.optional.junit.JUnitTestRunner.run(JUnitTestRunner.java:294)
	at org.apache.tools.ant.taskdefs.optional.junit.JUnitTestRunner.launch(JUnitTestRunner.java:670)
	at org.apache.tools.ant.taskdefs.optional.junit.JUnitTestRunner.main(JUnitTestRunner.java:545)
java.net.ConnectException: localhost/127.0.0.1:631 - Connection refused
	at org.apache.harmony.luni.net.PlainSocketImpl.connect(PlainSocketImpl.java:229)
	at org.apache.harmony.luni.net.PlainSocketImpl.connect(PlainSocketImpl.java:508)
	at java.net.Socket.connect(Socket.java:930)
	at org.apache.harmony.luni.internal.net.www.protocol.http.HttpURLConnection.getHTTPConnection(HttpURLConnection.java:635)
	at org.apache.harmony.luni.internal.net.www.protocol.http.HttpURLConnection.connect(HttpURLConnection.java:616)
	at org.apache.harmony.x.print.ipp.IppClient.request(IppClient.java:110)
	at org.apache.harmony.x.print.ipp.IppClient.request(IppClient.java:87)
	at org.apache.harmony.x.print.cups.CUPSPrintServiceProvider.findDefaultPrintService(CUPSPrintServiceProvider.java:471)
	at org.apache.harmony.x.print.cups.CUPSPrintServiceProvider.getDefaultPrintService(CUPSPrintServiceProvider.java:168)
	at javax.print.PrintServiceLookup.lookupDefaultPrintService(PrintServiceLookup.java:138)
	at javax.print.attribute.HashAttributeTest.testAdd2(HashAttributeTest.java)
	at java.lang.reflect.VMReflection.invokeMethod(VMReflection.java)
	at java.lang.reflect.Method.invoke(Method.java:381)
	at junit.framework.TestCase.runTest(TestCase.java:164)
	at junit.framework.TestCase.runBare(TestCase.java:128)
	at junit.framework.TestResult$1.protect(TestResult.java)
	at junit.framework.TestResult.runProtected(TestResult.java)
	at junit.framework.TestResult.run(TestResult.java:104)
	at junit.framework.TestCase.run(TestCase.java)
	at junit.framework.TestSuite.runTest(TestSuite.java)
	at junit.framework.TestSuite.run(TestSuite.java:224)
	at junit.framework.TestSuite.runTest(TestSuite.java)
	at junit.framework.TestSuite.run(TestSuite.java:224)
	at org.apache.tools.ant.taskdefs.optional.junit.JUnitTestRunner.run(JUnitTestRunner.java:294)
	at org.apache.tools.ant.taskdefs.optional.junit.JUnitTestRunner.launch(JUnitTestRunner.java:670)
	at org.apache.tools.ant.taskdefs.optional.junit.JUnitTestRunner.main(JUnitTestRunner.java:545)
java.net.ConnectException: localhost/127.0.0.1:631 - Connection refused
	at org.apache.harmony.luni.net.PlainSocketImpl.connect(PlainSocketImpl.java:229)
	at org.apache.harmony.luni.net.PlainSocketImpl.connect(PlainSocketImpl.java:508)
	at java.net.Socket.connect(Socket.java:930)
	at org.apache.harmony.luni.internal.net.www.protocol.http.HttpURLConnection.getHTTPConnection(HttpURLConnection.java:635)
	at org.apache.harmony.luni.internal.net.www.protocol.http.HttpURLConnection.connect(HttpURLConnection.java:616)
	at org.apache.harmony.x.print.ipp.IppClient.request(IppClient.java:110)
	at org.apache.harmony.x.print.ipp.IppClient.request(IppClient.java:87)
	at org.apache.harmony.x.print.cups.CUPSPrintServiceProvider.findDefaultPrintService(CUPSPrintServiceProvider.java:471)
	at org.apache.harmony.x.print.cups.CUPSPrintServiceProvider.getDefaultPrintService(CUPSPrintServiceProvider.java:168)
	at javax.print.PrintServiceLookup.lookupDefaultPrintService(PrintServiceLookup.java:138)
	at javax.print.attribute.HashAttributeTest.testEquals(HashAttributeTest.java:283)
	at java.lang.reflect.VMReflection.invokeMethod(VMReflection.java)
	at java.lang.reflect.Method.invoke(Method.java:381)
	at junit.framework.TestCase.runTest(TestCase.java:164)
	at junit.framework.TestCase.runBare(TestCase.java:128)
	at junit.framework.TestResult$1.protect(TestResult.java)
	at junit.framework.TestResult.runProtected(TestResult.java)
	at junit.framework.TestResult.run(TestResult.java:104)
	at junit.framework.TestCase.run(TestCase.java)
	at junit.framework.TestSuite.runTest(TestSuite.java)
	at junit.framework.TestSuite.run(TestSuite.java:224)
	at junit.framework.TestSuite.runTest(TestSuite.java)
	at junit.framework.TestSuite.run(TestSuite.java:224)
	at org.apache.tools.ant.taskdefs.optional.junit.JUnitTestRunner.run(JUnitTestRunner.java:294)
	at org.apache.tools.ant.taskdefs.optional.junit.JUnitTestRunner.launch(JUnitTestRunner.java:670)
	at org.apache.tools.ant.taskdefs.optional.junit.JUnitTestRunner.main(JUnitTestRunner.java:545)
Compiling REGEX classes
Compiling REGEX tests
Since fork is false, ignoring memoryMaximumSize setting
Compiling RMI classes
Compiling RMI api tests
Since fork is false, ignoring memoryMaximumSize setting
Running RMI api tests
Unexporting MyRemoteObject1[UnicastServerRef[endpoint:[[10.125.122.35:60181]](local), ObjID[65536,
UID[4206a674:1108c54ee0a:-7ff7]]]] ...
Done.
Unexporting MyRemoteObject1[UnicastServerRef[endpoint:[[10.125.122.35:60182]](local), ObjID[65537,
UID[4206a674:1108c54ee0a:-7ff6]]]] ...
Done.
Unexporting MyRemoteObject1[UnicastServerRef[endpoint:[[10.125.122.35:60183]](local), ObjID[65538,
UID[4206a674:1108c54ee0a:-7ff5]]]] ...
Done.
Unexporting MyRemoteObject1[UnicastServerRef[endpoint:[[10.125.122.35:60184]](local), ObjID[65539,
UID[4206a674:1108c54ee0a:-7ff4]]]] ...
Done.
Unexporting MyRemoteObject1[UnicastServerRef[endpoint:[[10.125.122.35:60185]](local), ObjID[65540,
UID[4206a674:1108c54ee0a:-7ff3]]]] ...
Done.
Unexporting MyRemoteObject1[UnicastServerRef[endpoint:[[10.125.122.35:60186]](local), ObjID[65541,
UID[4206a674:1108c54ee0a:-7ff2]]]] ...
Done.
Unexporting MyRemoteObject1[UnicastServerRef[endpoint:[[10.125.122.35:60187]](local), ObjID[65542,
UID[4206a674:1108c54ee0a:-7ff1]]]] ...
Done.
Unexporting MyRemoteObject1[UnicastServerRef[endpoint:[[10.125.122.35:60188]](local), ObjID[65543,
UID[4206a674:1108c54ee0a:-7ff0]]]] ...
Done.
LogStream[tst]:
Compiling SECURITY classes
Compiling SECURITY test support files
Since fork is false, ignoring memoryMaximumSize setting
Compiling SECURITY api tests
Since fork is false, ignoring memoryMaximumSize setting
Compiling SECURITY api injected tests
Since fork is false, ignoring memoryMaximumSize setting
Compiling SECURITY impl injected tests
Since fork is false, ignoring memoryMaximumSize setting
Compiling SECURITY impl tests
Since fork is false, ignoring memoryMaximumSize setting
Running SECURITY api tests
Running SECURITY api.injected tests
Running SECURITY impl tests
Running SECURITY impl injected tests
Compiling SOUND classes
Compiling SOUND tests
Since fork is false, ignoring memoryMaximumSize setting
Compiling SQL classes
Compiling SQL tests
Since fork is false, ignoring memoryMaximumSize setting
Compiling Sun Compat classes
Compiling SUNCOMPAT tests
Compiling SWING classes
Compiling SWING tests
Since fork is false, ignoring memoryMaximumSize setting
Uncaught exception in AWT-NativeEventThread:
java.lang.NullPointerException
	at org.apache.harmony.awt.wtk.linux.LinuxEvent.processConfigureEvent(LinuxEvent.java:359)
	at org.apache.harmony.awt.wtk.linux.LinuxEvent.setEvent(LinuxEvent.java:142)
	at org.apache.harmony.awt.wtk.linux.LinuxEvent.<init>(LinuxEvent.java:79)
	at org.apache.harmony.awt.wtk.linux.LinuxEventQueue.enqueue(LinuxEventQueue.java:94)
	at org.apache.harmony.awt.wtk.linux.LinuxEventQueue.dispatchEvent(LinuxEventQueue.java)
	at org.apache.harmony.awt.wtk.NativeEventThread.runModalLoop(NativeEventThread.java:58)
	at org.apache.harmony.awt.wtk.NativeEventThread.run(NativeEventThread.java:45)
Compiling TEXT classes
Compiling TEXT tests
Since fork is false, ignoring memoryMaximumSize setting
Compiling TOOLS classes
Compiling Tools tests
Since fork is false, ignoring memoryMaximumSize setting
Compiling X-NET classes
Compiling X-NET test support files
Since fork is false, ignoring memoryMaximumSize setting
Compiling X-NET api tests
Since fork is false, ignoring memoryMaximumSize setting
Compiling X-NET impl injected tests
Since fork is false, ignoring memoryMaximumSize setting
Compiling X-NET impl tests
Since fork is false, ignoring memoryMaximumSize setting
Running X-NET api tests
Running X-NET impl tests
Running X-NET impl injected tests
The test report is in /export/cruise/trunk/cc/projects/classlib/trunk/build/test_report/html/index.html

***********************************************************
Unit Tests: (19498)
        
error: testDigitalSignature_1 org.apache.harmony.xnet.provider.jsse.DigitalSignatureTest
error: testDigitalSignature_2 org.apache.harmony.xnet.provider.jsse.DigitalSignatureTest
error: testKeyManagerImpl2 org.apache.harmony.xnet.provider.jsse.KeyManagerImplTest
error: testSelfInteraction org.apache.harmony.xnet.provider.jsse.SSLEngineImplTest
error: testHandshake org.apache.harmony.xnet.provider.jsse.SSLEngineImplTest
error: testSetGetNeedClientAuth org.apache.harmony.xnet.provider.jsse.SSLEngineImplTest
error: testSetGetWantClientAuth org.apache.harmony.xnet.provider.jsse.SSLEngineImplTest
error: testGetSupportedCipherSuites org.apache.harmony.xnet.provider.jsse.SSLEngineImplTest
error: testGetEnabledCipherSuites org.apache.harmony.xnet.provider.jsse.SSLEngineImplTest
error: testSetEnabledCipherSuites org.apache.harmony.xnet.provider.jsse.SSLEngineImplTest
error: testGetSupportedProtocols org.apache.harmony.xnet.provider.jsse.SSLEngineImplTest
error: testGetEnabledProtocols org.apache.harmony.xnet.provider.jsse.SSLEngineImplTest
error: testSetGetUseClientMode org.apache.harmony.xnet.provider.jsse.SSLEngineImplTest
error: testSetGetEnableSessionCreation org.apache.harmony.xnet.provider.jsse.SSLEngineImplTest
error: testGetSession org.apache.harmony.xnet.provider.jsse.SSLEngineImplTest
error: testBeginHandshake org.apache.harmony.xnet.provider.jsse.SSLEngineImplTest
error: testCloseOutbound org.apache.harmony.xnet.provider.jsse.SSLEngineImplTest
error: testCloseInbound org.apache.harmony.xnet.provider.jsse.SSLEngineImplTest
error: testCloseInbound2 org.apache.harmony.xnet.provider.jsse.SSLEngineImplTest
error: testErrorProcessing org.apache.harmony.xnet.provider.jsse.SSLEngineImplTest
error: testSSLServerSocketImpl1 org.apache.harmony.xnet.provider.jsse.SSLServerSocketImplTest
error: testSSLServerSocketImpl2 org.apache.harmony.xnet.provider.jsse.SSLServerSocketImplTest
error: testSSLServerSocketImpl3 org.apache.harmony.xnet.provider.jsse.SSLServerSocketImplTest
error: testSSLServerSocketImpl4 org.apache.harmony.xnet.provider.jsse.SSLServerSocketImplTest
error: testGetSupportedCipherSuites org.apache.harmony.xnet.provider.jsse.SSLServerSocketImplTest
error: testGetEnabledCipherSuites org.apache.harmony.xnet.provider.jsse.SSLServerSocketImplTest
error: testSetEnabledCipherSuites org.apache.harmony.xnet.provider.jsse.SSLServerSocketImplTest
error: testGetSupportedProtocols org.apache.harmony.xnet.provider.jsse.SSLServerSocketImplTest
error: testGetEnabledProtocols org.apache.harmony.xnet.provider.jsse.SSLServerSocketImplTest
error: testSetEnabledProtocols org.apache.harmony.xnet.provider.jsse.SSLServerSocketImplTest
error: testSetGetUseClientMode org.apache.harmony.xnet.provider.jsse.SSLServerSocketImplTest
error: testSetGetNeedClientAuth org.apache.harmony.xnet.provider.jsse.SSLServerSocketImplTest
error: testSetGetWantClientAuth org.apache.harmony.xnet.provider.jsse.SSLServerSocketImplTest
error: testSetGetEnableSessionCreation org.apache.harmony.xnet.provider.jsse.SSLServerSocketImplTest
error: testToString org.apache.harmony.xnet.provider.jsse.SSLServerSocketImplTest
error: testSocketCreation org.apache.harmony.xnet.provider.jsse.SSLSocketFactoriesTest
error: testGetSupportedCipherSuites1 org.apache.harmony.xnet.provider.jsse.SSLSocketFactoriesTest
error: testGetSupportedCipherSuites2 org.apache.harmony.xnet.provider.jsse.SSLSocketFactoriesTest
error: testGetDefaultCipherSuites1 org.apache.harmony.xnet.provider.jsse.SSLSocketFactoriesTest
error: testGetDefaultCipherSuites2 org.apache.harmony.xnet.provider.jsse.SSLSocketFactoriesTest
error: testContextInitialized2 org.apache.harmony.xnet.provider.jsse.SSLSocketFunctionalTest
error: testSSLSocketImpl1 org.apache.harmony.xnet.provider.jsse.SSLSocketImplTest
error: testSSLSocketImpl2 org.apache.harmony.xnet.provider.jsse.SSLSocketImplTest
error: testSSLSocketImpl3 org.apache.harmony.xnet.provider.jsse.SSLSocketImplTest
error: testSSLSocketImpl4 org.apache.harmony.xnet.provider.jsse.SSLSocketImplTest
error: testSSLSocketImpl5 org.apache.harmony.xnet.provider.jsse.SSLSocketImplTest
error: testGetSupportedCipherSuites org.apache.harmony.xnet.provider.jsse.SSLSocketImplTest
error: testGetEnabledCipherSuites org.apache.harmony.xnet.provider.jsse.SSLSocketImplTest
error: testSetEnabledCipherSuites org.apache.harmony.xnet.provider.jsse.SSLSocketImplTest
error: testGetSupportedProtocols org.apache.harmony.xnet.provider.jsse.SSLSocketImplTest
error: testGetEnabledProtocols org.apache.harmony.xnet.provider.jsse.SSLSocketImplTest
error: testSetEnabledProtocols org.apache.harmony.xnet.provider.jsse.SSLSocketImplTest
error: testSetGetUseClientMode org.apache.harmony.xnet.provider.jsse.SSLSocketImplTest
error: testSetGetNeedClientAuth org.apache.harmony.xnet.provider.jsse.SSLSocketImplTest
error: testSetGetWantClientAuth org.apache.harmony.xnet.provider.jsse.SSLSocketImplTest
error: testSetGetEnableSessionCreation org.apache.harmony.xnet.provider.jsse.SSLSocketImplTest
error: testGetSession org.apache.harmony.xnet.provider.jsse.SSLSocketImplTest
error: testAddRemoveHandshakeCompletedListener org.apache.harmony.xnet.provider.jsse.SSLSocketImplTest
error: testStartHandshake org.apache.harmony.xnet.provider.jsse.SSLSocketImplTest
error: testGetInputStream org.apache.harmony.xnet.provider.jsse.SSLSocketImplTest
error: testGetOutputStream org.apache.harmony.xnet.provider.jsse.SSLSocketImplTest
error: testSendUrgentData org.apache.harmony.xnet.provider.jsse.SSLSocketImplTest
error: testSetOOBInline org.apache.harmony.xnet.provider.jsse.SSLSocketImplTest
error: testShutdownOutput org.apache.harmony.xnet.provider.jsse.SSLSocketImplTest
error: testShutdownInput org.apache.harmony.xnet.provider.jsse.SSLSocketImplTest
error: testToString org.apache.harmony.xnet.provider.jsse.SSLSocketImplTest
error: testUnwrap org.apache.harmony.xnet.provider.jsse.ServerHandshakeImplTest
error: testServerHandshakeImpl org.apache.harmony.xnet.provider.jsse.ServerHandshakeImplTest
error: testTrustManagerImpl_2 org.apache.harmony.xnet.provider.jsse.TrustManagerImplTest
Unit Test Error Details:	(69)
                
Test: testDigitalSignature_1Class: org.apache.harmony.xnet.provider.jsse.DigitalSignatureTestjava.lang.NoClassDefFoundError:
org/apache/harmony/xnet/provider/jsse/JSSETestData

Test: testDigitalSignature_2Class: org.apache.harmony.xnet.provider.jsse.DigitalSignatureTestjava.lang.NoClassDefFoundError:
org/apache/harmony/xnet/provider/jsse/JSSETestData

Test: testKeyManagerImpl2Class: org.apache.harmony.xnet.provider.jsse.KeyManagerImplTestjava.lang.NoClassDefFoundError:
org/apache/harmony/xnet/provider/jsse/JSSETestData
	at java.lang.reflect.VMReflection.invokeMethod(VMReflection.java)

Test: testSelfInteractionClass: org.apache.harmony.xnet.provider.jsse.SSLEngineImplTestjava.lang.NoClassDefFoundError:
org/apache/harmony/xnet/provider/jsse/JSSETestData
	at org.apache.harmony.xnet.provider.jsse.SSLEngineImplTest.testSelfInteraction(SSLEngineImplTest.java:70)
	at java.lang.reflect.VMReflection.invokeMethod(VMReflection.java)

Test: testHandshakeClass: org.apache.harmony.xnet.provider.jsse.SSLEngineImplTestjava.lang.NoClassDefFoundError:
org/apache/harmony/xnet/provider/jsse/JSSETestData
	at org.apache.harmony.xnet.provider.jsse.SSLEngineImplTest.testSelfInteraction(SSLEngineImplTest.java:70)
	at java.lang.reflect.VMReflection.invokeMethod(VMReflection.java)

Test: testSetGetNeedClientAuthClass: org.apache.harmony.xnet.provider.jsse.SSLEngineImplTestjava.lang.NoClassDefFoundError:
org/apache/harmony/xnet/provider/jsse/JSSETestData
	at org.apache.harmony.xnet.provider.jsse.SSLEngineImplTest.testSelfInteraction(SSLEngineImplTest.java:70)
	at java.lang.reflect.VMReflection.invokeMethod(VMReflection.java)

Test: testSetGetWantClientAuthClass: org.apache.harmony.xnet.provider.jsse.SSLEngineImplTestjava.lang.NoClassDefFoundError:
org/apache/harmony/xnet/provider/jsse/JSSETestData
	at org.apache.harmony.xnet.provider.jsse.SSLEngineImplTest.testSelfInteraction(SSLEngineImplTest.java:70)
	at java.lang.reflect.VMReflection.invokeMethod(VMReflection.java)

Test: testGetSupportedCipherSuitesClass: org.apache.harmony.xnet.provider.jsse.SSLEngineImplTestjava.lang.NoClassDefFoundError:
org/apache/harmony/xnet/provider/jsse/JSSETestData
	at org.apache.harmony.xnet.provider.jsse.SSLEngineImplTest.testSelfInteraction(SSLEngineImplTest.java:70)
	at java.lang.reflect.VMReflection.invokeMethod(VMReflection.java)

Test: testGetEnabledCipherSuitesClass: org.apache.harmony.xnet.provider.jsse.SSLEngineImplTestjava.lang.NoClassDefFoundError:
org/apache/harmony/xnet/provider/jsse/JSSETestData
	at org.apache.harmony.xnet.provider.jsse.SSLEngineImplTest.testSelfInteraction(SSLEngineImplTest.java:70)
	at java.lang.reflect.VMReflection.invokeMethod(VMReflection.java)

Test: testSetEnabledCipherSuitesClass: org.apache.harmony.xnet.provider.jsse.SSLEngineImplTestjava.lang.NoClassDefFoundError:
org/apache/harmony/xnet/provider/jsse/JSSETestData
	at org.apache.harmony.xnet.provider.jsse.SSLEngineImplTest.testSelfInteraction(SSLEngineImplTest.java:70)
	at java.lang.reflect.VMReflection.invokeMethod(VMReflection.java)

Test: testGetSupportedProtocolsClass: org.apache.harmony.xnet.provider.jsse.SSLEngineImplTestjava.lang.NoClassDefFoundError:
org/apache/harmony/xnet/provider/jsse/JSSETestData
	at org.apache.harmony.xnet.provider.jsse.SSLEngineImplTest.testSelfInteraction(SSLEngineImplTest.java:70)
	at java.lang.reflect.VMReflection.invokeMethod(VMReflection.java)

Test: testGetEnabledProtocolsClass: org.apache.harmony.xnet.provider.jsse.SSLEngineImplTestjava.lang.NoClassDefFoundError:
org/apache/harmony/xnet/provider/jsse/JSSETestData
	at org.apache.harmony.xnet.provider.jsse.SSLEngineImplTest.testSelfInteraction(SSLEngineImplTest.java:70)
	at java.lang.reflect.VMReflection.invokeMethod(VMReflection.java)

Test: testSetGetUseClientModeClass: org.apache.harmony.xnet.provider.jsse.SSLEngineImplTestjava.lang.NoClassDefFoundError:
org/apache/harmony/xnet/provider/jsse/JSSETestData
	at org.apache.harmony.xnet.provider.jsse.SSLEngineImplTest.testSelfInteraction(SSLEngineImplTest.java:70)
	at java.lang.reflect.VMReflection.invokeMethod(VMReflection.java)

Test: testSetGetEnableSessionCreationClass: org.apache.harmony.xnet.provider.jsse.SSLEngineImplTestjava.lang.NoClassDefFoundError:
org/apache/harmony/xnet/provider/jsse/JSSETestData
	at org.apache.harmony.xnet.provider.jsse.SSLEngineImplTest.testSelfInteraction(SSLEngineImplTest.java:70)
	at java.lang.reflect.VMReflection.invokeMethod(VMReflection.java)

Test: testGetSessionClass: org.apache.harmony.xnet.provider.jsse.SSLEngineImplTestjava.lang.NoClassDefFoundError:
org/apache/harmony/xnet/provider/jsse/JSSETestData
	at org.apache.harmony.xnet.provider.jsse.SSLEngineImplTest.testSelfInteraction(SSLEngineImplTest.java:70)
	at java.lang.reflect.VMReflection.invokeMethod(VMReflection.java)

Test: testBeginHandshakeClass: org.apache.harmony.xnet.provider.jsse.SSLEngineImplTestjava.lang.NoClassDefFoundError:
org/apache/harmony/xnet/provider/jsse/JSSETestData
	at org.apache.harmony.xnet.provider.jsse.SSLEngineImplTest.testSelfInteraction(SSLEngineImplTest.java:70)
	at java.lang.reflect.VMReflection.invokeMethod(VMReflection.java)

Test: testCloseOutboundClass: org.apache.harmony.xnet.provider.jsse.SSLEngineImplTestjava.lang.NoClassDefFoundError:
org/apache/harmony/xnet/provider/jsse/JSSETestData
	at org.apache.harmony.xnet.provider.jsse.SSLEngineImplTest.testSelfInteraction(SSLEngineImplTest.java:70)
	at java.lang.reflect.VMReflection.invokeMethod(VMReflection.java)

Test: testCloseInboundClass: org.apache.harmony.xnet.provider.jsse.SSLEngineImplTestjava.lang.NoClassDefFoundError:
org/apache/harmony/xnet/provider/jsse/JSSETestData
	at org.apache.harmony.xnet.provider.jsse.SSLEngineImplTest.testSelfInteraction(SSLEngineImplTest.java:70)
	at java.lang.reflect.VMReflection.invokeMethod(VMReflection.java)

Test: testCloseInbound2Class: org.apache.harmony.xnet.provider.jsse.SSLEngineImplTestjava.lang.NoClassDefFoundError:
org/apache/harmony/xnet/provider/jsse/JSSETestData
	at org.apache.harmony.xnet.provider.jsse.SSLEngineImplTest.testSelfInteraction(SSLEngineImplTest.java:70)
	at java.lang.reflect.VMReflection.invokeMethod(VMReflection.java)

Test: testErrorProcessingClass: org.apache.harmony.xnet.provider.jsse.SSLEngineImplTestjava.lang.NoClassDefFoundError:
org/apache/harmony/xnet/provider/jsse/JSSETestData
	at org.apache.harmony.xnet.provider.jsse.SSLEngineImplTest.testSelfInteraction(SSLEngineImplTest.java:70)
	at java.lang.reflect.VMReflection.invokeMethod(VMReflection.java)

Test: testSSLServerSocketImpl1Class: org.apache.harmony.xnet.provider.jsse.SSLServerSocketImplTestjava.lang.NoClassDefFoundError:
org/apache/harmony/xnet/provider/jsse/JSSETestData
	at java.lang.reflect.VMReflection.invokeMethod(VMReflection.java)

Test: testSSLServerSocketImpl2Class: org.apache.harmony.xnet.provider.jsse.SSLServerSocketImplTestjava.lang.NoClassDefFoundError:
org/apache/harmony/xnet/provider/jsse/JSSETestData
	at java.lang.reflect.VMReflection.invokeMethod(VMReflection.java)

Test: testSSLServerSocketImpl3Class: org.apache.harmony.xnet.provider.jsse.SSLServerSocketImplTestjava.lang.NoClassDefFoundError:
org/apache/harmony/xnet/provider/jsse/JSSETestData
	at java.lang.reflect.VMReflection.invokeMethod(VMReflection.java)

Test: testSSLServerSocketImpl4Class: org.apache.harmony.xnet.provider.jsse.SSLServerSocketImplTestjava.lang.NoClassDefFoundError:
org/apache/harmony/xnet/provider/jsse/JSSETestData
	at java.lang.reflect.VMReflection.invokeMethod(VMReflection.java)

Test: testGetSupportedCipherSuitesClass: org.apache.harmony.xnet.provider.jsse.SSLServerSocketImplTestjava.lang.NoClassDefFoundError:
org/apache/harmony/xnet/provider/jsse/JSSETestData
	at java.lang.reflect.VMReflection.invokeMethod(VMReflection.java)

Test: testGetEnabledCipherSuitesClass: org.apache.harmony.xnet.provider.jsse.SSLServerSocketImplTestjava.lang.NoClassDefFoundError:
org/apache/harmony/xnet/provider/jsse/JSSETestData
	at java.lang.reflect.VMReflection.invokeMethod(VMReflection.java)

Test: testSetEnabledCipherSuitesClass: org.apache.harmony.xnet.provider.jsse.SSLServerSocketImplTestjava.lang.NoClassDefFoundError:
org/apache/harmony/xnet/provider/jsse/JSSETestData
	at java.lang.reflect.VMReflection.invokeMethod(VMReflection.java)

Test: testGetSupportedProtocolsClass: org.apache.harmony.xnet.provider.jsse.SSLServerSocketImplTestjava.lang.NoClassDefFoundError:
org/apache/harmony/xnet/provider/jsse/JSSETestData
	at java.lang.reflect.VMReflection.invokeMethod(VMReflection.java)

Test: testGetEnabledProtocolsClass: org.apache.harmony.xnet.provider.jsse.SSLServerSocketImplTestjava.lang.NoClassDefFoundError:
org/apache/harmony/xnet/provider/jsse/JSSETestData
	at java.lang.reflect.VMReflection.invokeMethod(VMReflection.java)

Test: testSetEnabledProtocolsClass: org.apache.harmony.xnet.provider.jsse.SSLServerSocketImplTestjava.lang.NoClassDefFoundError:
org/apache/harmony/xnet/provider/jsse/JSSETestData
	at java.lang.reflect.VMReflection.invokeMethod(VMReflection.java)

Test: testSetGetUseClientModeClass: org.apache.harmony.xnet.provider.jsse.SSLServerSocketImplTestjava.lang.NoClassDefFoundError:
org/apache/harmony/xnet/provider/jsse/JSSETestData
	at java.lang.reflect.VMReflection.invokeMethod(VMReflection.java)

Test: testSetGetNeedClientAuthClass: org.apache.harmony.xnet.provider.jsse.SSLServerSocketImplTestjava.lang.NoClassDefFoundError:
org/apache/harmony/xnet/provider/jsse/JSSETestData
	at java.lang.reflect.VMReflection.invokeMethod(VMReflection.java)

Test: testSetGetWantClientAuthClass: org.apache.harmony.xnet.provider.jsse.SSLServerSocketImplTestjava.lang.NoClassDefFoundError:
org/apache/harmony/xnet/provider/jsse/JSSETestData
	at java.lang.reflect.VMReflection.invokeMethod(VMReflection.java)

Test: testSetGetEnableSessionCreationClass: org.apache.harmony.xnet.provider.jsse.SSLServerSocketImplTestjava.lang.NoClassDefFoundError:
org/apache/harmony/xnet/provider/jsse/JSSETestData
	at java.lang.reflect.VMReflection.invokeMethod(VMReflection.java)

Test: testToStringClass: org.apache.harmony.xnet.provider.jsse.SSLServerSocketImplTestjava.lang.NoClassDefFoundError:
org/apache/harmony/xnet/provider/jsse/JSSETestData
	at java.lang.reflect.VMReflection.invokeMethod(VMReflection.java)

Test: testSocketCreationClass: org.apache.harmony.xnet.provider.jsse.SSLSocketFactoriesTestjava.lang.NoClassDefFoundError:
org/apache/harmony/xnet/provider/jsse/JSSETestData
	at java.lang.reflect.VMReflection.invokeMethod(VMReflection.java)

Test: testGetSupportedCipherSuites1Class: org.apache.harmony.xnet.provider.jsse.SSLSocketFactoriesTestjava.lang.NoClassDefFoundError:
org/apache/harmony/xnet/provider/jsse/JSSETestData
	at java.lang.reflect.VMReflection.invokeMethod(VMReflection.java)

Test: testGetSupportedCipherSuites2Class: org.apache.harmony.xnet.provider.jsse.SSLSocketFactoriesTestjava.lang.NoClassDefFoundError:
org/apache/harmony/xnet/provider/jsse/JSSETestData
	at java.lang.reflect.VMReflection.invokeMethod(VMReflection.java)

Test: testGetDefaultCipherSuites1Class: org.apache.harmony.xnet.provider.jsse.SSLSocketFactoriesTestjava.lang.NoClassDefFoundError:
org/apache/harmony/xnet/provider/jsse/JSSETestData
	at java.lang.reflect.VMReflection.invokeMethod(VMReflection.java)

Test: testGetDefaultCipherSuites2Class: org.apache.harmony.xnet.provider.jsse.SSLSocketFactoriesTestjava.lang.NoClassDefFoundError:
org/apache/harmony/xnet/provider/jsse/JSSETestData
	at java.lang.reflect.VMReflection.invokeMethod(VMReflection.java)

Test: testContextInitialized2Class: org.apache.harmony.xnet.provider.jsse.SSLSocketFunctionalTestjava.lang.NoClassDefFoundError:
org/apache/harmony/xnet/provider/jsse/JSSETestData
	at java.lang.reflect.VMReflection.invokeMethod(VMReflection.java)

Test: testSSLSocketImpl1Class: org.apache.harmony.xnet.provider.jsse.SSLSocketImplTestjava.lang.NoClassDefFoundError:
org/apache/harmony/xnet/provider/jsse/JSSETestData
	at java.lang.reflect.VMReflection.invokeMethod(VMReflection.java)

Test: testSSLSocketImpl2Class: org.apache.harmony.xnet.provider.jsse.SSLSocketImplTestjava.lang.NoClassDefFoundError:
org/apache/harmony/xnet/provider/jsse/JSSETestData
	at java.lang.reflect.VMReflection.invokeMethod(VMReflection.java)

Test: testSSLSocketImpl3Class: org.apache.harmony.xnet.provider.jsse.SSLSocketImplTestjava.lang.NoClassDefFoundError:
org/apache/harmony/xnet/provider/jsse/JSSETestData
	at java.lang.reflect.VMReflection.invokeMethod(VMReflection.java)

Test: testSSLSocketImpl4Class: org.apache.harmony.xnet.provider.jsse.SSLSocketImplTestjava.lang.NoClassDefFoundError:
org/apache/harmony/xnet/provider/jsse/JSSETestData
	at java.lang.reflect.VMReflection.invokeMethod(VMReflection.java)

Test: testSSLSocketImpl5Class: org.apache.harmony.xnet.provider.jsse.SSLSocketImplTestjava.lang.NoClassDefFoundError:
org/apache/harmony/xnet/provider/jsse/JSSETestData
	at java.lang.reflect.VMReflection.invokeMethod(VMReflection.java)

Test: testGetSupportedCipherSuitesClass: org.apache.harmony.xnet.provider.jsse.SSLSocketImplTestjava.lang.NoClassDefFoundError:
org/apache/harmony/xnet/provider/jsse/JSSETestData
	at java.lang.reflect.VMReflection.invokeMethod(VMReflection.java)

Test: testGetEnabledCipherSuitesClass: org.apache.harmony.xnet.provider.jsse.SSLSocketImplTestjava.lang.NoClassDefFoundError:
org/apache/harmony/xnet/provider/jsse/JSSETestData
	at java.lang.reflect.VMReflection.invokeMethod(VMReflection.java)

Test: testSetEnabledCipherSuitesClass: org.apache.harmony.xnet.provider.jsse.SSLSocketImplTestjava.lang.NoClassDefFoundError:
org/apache/harmony/xnet/provider/jsse/JSSETestData
	at java.lang.reflect.VMReflection.invokeMethod(VMReflection.java)

Test: testGetSupportedProtocolsClass: org.apache.harmony.xnet.provider.jsse.SSLSocketImplTestjava.lang.NoClassDefFoundError:
org/apache/harmony/xnet/provider/jsse/JSSETestData
	at java.lang.reflect.VMReflection.invokeMethod(VMReflection.java)

Test: testGetEnabledProtocolsClass: org.apache.harmony.xnet.provider.jsse.SSLSocketImplTestjava.lang.NoClassDefFoundError:
org/apache/harmony/xnet/provider/jsse/JSSETestData
	at java.lang.reflect.VMReflection.invokeMethod(VMReflection.java)

Test: testSetEnabledProtocolsClass: org.apache.harmony.xnet.provider.jsse.SSLSocketImplTestjava.lang.NoClassDefFoundError:
org/apache/harmony/xnet/provider/jsse/JSSETestData
	at java.lang.reflect.VMReflection.invokeMethod(VMReflection.java)

Test: testSetGetUseClientModeClass: org.apache.harmony.xnet.provider.jsse.SSLSocketImplTestjava.lang.NoClassDefFoundError:
org/apache/harmony/xnet/provider/jsse/JSSETestData
	at java.lang.reflect.VMReflection.invokeMethod(VMReflection.java)

Test: testSetGetNeedClientAuthClass: org.apache.harmony.xnet.provider.jsse.SSLSocketImplTestjava.lang.NoClassDefFoundError:
org/apache/harmony/xnet/provider/jsse/JSSETestData
	at java.lang.reflect.VMReflection.invokeMethod(VMReflection.java)

Test: testSetGetWantClientAuthClass: org.apache.harmony.xnet.provider.jsse.SSLSocketImplTestjava.lang.NoClassDefFoundError:
org/apache/harmony/xnet/provider/jsse/JSSETestData
	at java.lang.reflect.VMReflection.invokeMethod(VMReflection.java)

Test: testSetGetEnableSessionCreationClass: org.apache.harmony.xnet.provider.jsse.SSLSocketImplTestjava.lang.NoClassDefFoundError:
org/apache/harmony/xnet/provider/jsse/JSSETestData
	at java.lang.reflect.VMReflection.invokeMethod(VMReflection.java)

Test: testGetSessionClass: org.apache.harmony.xnet.provider.jsse.SSLSocketImplTestjava.lang.NoClassDefFoundError:
org/apache/harmony/xnet/provider/jsse/JSSETestData
	at java.lang.reflect.VMReflection.invokeMethod(VMReflection.java)

Test: testAddRemoveHandshakeCompletedListenerClass: org.apache.harmony.xnet.provider.jsse.SSLSocketImplTestjava.lang.NoClassDefFoundError:
org/apache/harmony/xnet/provider/jsse/JSSETestData
	at java.lang.reflect.VMReflection.invokeMethod(VMReflection.java)

Test: testStartHandshakeClass: org.apache.harmony.xnet.provider.jsse.SSLSocketImplTestjava.lang.NoClassDefFoundError:
org/apache/harmony/xnet/provider/jsse/JSSETestData
	at java.lang.reflect.VMReflection.invokeMethod(VMReflection.java)

Test: testGetInputStreamClass: org.apache.harmony.xnet.provider.jsse.SSLSocketImplTestjava.lang.NoClassDefFoundError:
org/apache/harmony/xnet/provider/jsse/JSSETestData
	at java.lang.reflect.VMReflection.invokeMethod(VMReflection.java)

Test: testGetOutputStreamClass: org.apache.harmony.xnet.provider.jsse.SSLSocketImplTestjava.lang.NoClassDefFoundError:
org/apache/harmony/xnet/provider/jsse/JSSETestData
	at java.lang.reflect.VMReflection.invokeMethod(VMReflection.java)

Test: testSendUrgentDataClass: org.apache.harmony.xnet.provider.jsse.SSLSocketImplTestjava.lang.NoClassDefFoundError:
org/apache/harmony/xnet/provider/jsse/JSSETestData
	at java.lang.reflect.VMReflection.invokeMethod(VMReflection.java)

Test: testSetOOBInlineClass: org.apache.harmony.xnet.provider.jsse.SSLSocketImplTestjava.lang.NoClassDefFoundError:
org/apache/harmony/xnet/provider/jsse/JSSETestData
	at java.lang.reflect.VMReflection.invokeMethod(VMReflection.java)

Test: testShutdownOutputClass: org.apache.harmony.xnet.provider.jsse.SSLSocketImplTestjava.lang.NoClassDefFoundError:
org/apache/harmony/xnet/provider/jsse/JSSETestData
	at java.lang.reflect.VMReflection.invokeMethod(VMReflection.java)

Test: testShutdownInputClass: org.apache.harmony.xnet.provider.jsse.SSLSocketImplTestjava.lang.NoClassDefFoundError:
org/apache/harmony/xnet/provider/jsse/JSSETestData
	at java.lang.reflect.VMReflection.invokeMethod(VMReflection.java)

Test: testToStringClass: org.apache.harmony.xnet.provider.jsse.SSLSocketImplTestjava.lang.NoClassDefFoundError:
org/apache/harmony/xnet/provider/jsse/JSSETestData
	at java.lang.reflect.VMReflection.invokeMethod(VMReflection.java)

Test: testUnwrapClass: org.apache.harmony.xnet.provider.jsse.ServerHandshakeImplTestjava.lang.NoClassDefFoundError:
org/apache/harmony/xnet/provider/jsse/JSSETestData

Test: testServerHandshakeImplClass: org.apache.harmony.xnet.provider.jsse.ServerHandshakeImplTestjava.lang.NoClassDefFoundError:
org/apache/harmony/xnet/provider/jsse/JSSETestData

Test: testTrustManagerImpl_2Class: org.apache.harmony.xnet.provider.jsse.TrustManagerImplTestjava.lang.NoClassDefFoundError:
org/apache/harmony/xnet/provider/jsse/JSSETestData
	at java.lang.reflect.VMReflection.invokeMethod(VMReflection.java)


***********************************************************
Modifications since last successful build:	(5)
            
add cc-drlvm log20070204150802Lbuild.63 02/04/2007 15:08:02drlvm
add cc-classlib log20070204145228Lbuild.58 02/04/2007 14:52:28classlib
modified tellison  /harmony/enhanced/classlib/trunk/modules/luni/src/main/java/java/io/File.java
02/04/2007 14:15:49 Apply patch HARMONY-2236 ([classlib][luni]the return value of File.lastModified()
losts its precision)
modified tellison  /harmony/enhanced/classlib/trunk/modules/portlib/src/main/native/port/windows/hyfile.c
02/04/2007 14:15:49 Apply patch HARMONY-2236 ([classlib][luni]the return value of File.lastModified()
losts its precision)
modified tellison  /harmony/enhanced/classlib/trunk/modules/portlib/src/main/native/port/unix/hyfile.c
02/04/2007 14:15:49 Apply patch HARMONY-2236 ([classlib][luni]the return value of File.lastModified()
losts its precision)

Mime
View raw message