harmony-alerts mailing list archives

Site index · List index
Message view « Date » · « Thread »
Top « Date » · « Thread »
From ge...@apache.org
Subject [build-test alert] BUILD FAILED lnx gcc debug: classlib over drlvm
Date Tue, 27 Feb 2007 11:17:38 GMT
BUILD FAILED:
	Ant Error Message:
/home/geir/dev/apache/harmony/enhanced/buildtest/trunk/cc/projects/classlib/trunk/build.xml:167:
The following error occurred while executing this line: /home/geir/dev/apache/harmony/enhanced/buildtest/trunk/cc/projects/classlib/trunk/make/build-test.xml:52:
The following error occurred while executing this line: /home/geir/dev/apache/harmony/enhanced/buildtest/trunk/cc/projects/classlib/trunk/make/properties.xml:354:
The following error occurred while executing this line: /home/geir/dev/apache/harmony/enhanced/buildtest/trunk/cc/projects/classlib/trunk/modules/jndi/build.xml:133:
Compile failed; see the compiler error output for details.

Date of build:	02/27/2007 06:12:30
Time to build:	4 minutes 51 seconds
Last changed:	02/27/2007 06:03:06
Last log entry:	drlvm

***********************************************************
Errors/Warnings:	(100)
            

========================================
Testing class libraries...
========================================
Checking for depends/jars/yoko_M2-20070130/yoko.jar
Checking for depends/jars/yoko_M2-20070130/yoko-core.jar
Checking for depends/jars/yoko_M2-20070130/yoko-rmi-impl.jar
Checking for depends/jars/yoko_M2-20070130/yoko-rmi-spec.jar
Checking for depends/jars/bcel-5.2/bcel-5.2.jar
Checking for depends/jars/xalan-j_2.7.0/xalan.jar
Checking for depends/jars/xerces_2.8.0/resolver.jar
Checking for depends/jars/xerces_2.8.0/xercesImpl.jar
Checking for depends/jars/xerces_2.8.0/xml-apis.jar
Checking for depends/jars/junit_3.8.2/junit.jar
Checking for depends/jars/bcprov-jdk15-134/bcprov.jar
Checking for depends/jars/icu4j_3.4.4/icu4j_3_4_4.jar
Checking for depends/jars/mx4j_3.0.2/mx4j.zip
Checking for depends/jars/ecj_3.2/ecj_3.2.jar
Checking for depends/jars/jetty/jetty-6.0.0.jar
Checking for depends/jars/jetty/jetty-util-6.0.0.jar
Checking for depends/jars/jetty/servlet-api-2.5-6.0.0.jar
Checking for depends/libs/build/lcms/icc34.h
Checking for depends/libs/build/lcms/lcms.h
Checking for depends/libs/build/png/pngconf.h
Checking for depends/libs/build/png/png.h
Checking for depends/libs/build/jpeg/jconfig.lnx
Checking for depends/libs/build/jpeg/jpeglib.h
Checking for depends/libs/build/jpeg/jmorecfg.h
Checking for depends/libs/build/jpeg/jerror.h
Checking for depends/libs/build/lcms/liblcms.linux.x86
Checking for depends/libs/build/png/libpng.linux.x86
Checking for depends/libs/build/jpeg/libjpeg.linux.x86
Since fork is false, ignoring memoryMaximumSize setting
Compiling ACCESSIBILITY classes
Compiling ACCESSIBILITY tests
Since fork is false, ignoring memoryMaximumSize setting
Compiling ANNOTATION classes
Compiling ANNOTATION tests
Since fork is false, ignoring memoryMaximumSize setting
Compiling APPLET classes
Compiling APPLET tests
Since fork is false, ignoring memoryMaximumSize setting
Compiling ARCHIVE classes
Compiling ARCHIVE tests
Since fork is false, ignoring memoryMaximumSize setting
Compiling AUTH classes
Compiling AUTH tests
Since fork is false, ignoring memoryMaximumSize setting
Compiling AWT classes
Compiling AWT tests
Since fork is false, ignoring memoryMaximumSize setting
java.lang.RuntimeException: expected from EDT
	at java.awt.EventDispatchThreadRTest$1.run(EventDispatchThreadRTest.java:29)
	at java.awt.event.InvocationEvent.runAndNotify(InvocationEvent.java:90)
	at java.awt.event.InvocationEvent.dispatch(InvocationEvent.java:77)
	at java.awt.EventQueueCore.dispatchEventImpl(EventQueueCore.java:140)
	at java.awt.EventQueue.dispatchEvent(EventQueue.java:144)
	at java.awt.EventDispatchThread.runModalLoop(EventDispatchThread.java:73)
	at java.awt.EventDispatchThread.run(EventDispatchThread.java:45)
Compiling BEANS classes
Compiling support classes for BEANS tests
Compiling internal BEANS tests
Compiling BEANS tests
Since fork is false, ignoring memoryMaximumSize setting
Running internal BEANS tests
Running BEANS tests
Compiling CRYPTO classes
Compiling CRYPTO test support files
Since fork is false, ignoring memoryMaximumSize setting
Compiling CRYPTO api tests
Since fork is false, ignoring memoryMaximumSize setting
Compiling CRYPTO api injected tests
Since fork is false, ignoring memoryMaximumSize setting
Compiling CRYPTO impl injected tests
Since fork is false, ignoring memoryMaximumSize setting
Compiling CRYPTO impl tests
Since fork is false, ignoring memoryMaximumSize setting
Running CRYPTO api tests
Running CRYPTO api.injected tests
Running CRYPTO impl tests
Running CRYPTO impl injected tests
Compiling ImageIO classes
Compiling ImageIO tests
Compiling INSTRUMENT classes
Compiling INSTRUMENT tests
Since fork is false, ignoring memoryMaximumSize setting
Compiling JNDI classes
Compiling JNDI tests
Since fork is false, ignoring memoryMaximumSize setting
----------
1. ERROR in /home/geir/dev/apache/harmony/enhanced/buildtest/trunk/cc/projects/classlib/trunk/modules/jndi/src/test/java/org/apache/harmony/jndi/tests/javax/naming/ldap/main/AllTestLdap.java
 (at line 32)
	import org.apache.harmony.jndi.tests.javax.naming.ldap.TestRdn;
	       ^^^^^^^^^^^^^^^^^^^^^^^^^^^^^^^^^^^^^^^^^^^^^^^^^^^^^^^
The import org.apache.harmony.jndi.tests.javax.naming.ldap.TestRdn cannot be resolved
----------
2. ERROR in /home/geir/dev/apache/harmony/enhanced/buildtest/trunk/cc/projects/classlib/trunk/modules/jndi/src/test/java/org/apache/harmony/jndi/tests/javax/naming/ldap/main/AllTestLdap.java
 (at line 80)
	suite.addTest(new TestSuite(TestRdn.class));
	                            ^^^^^^^
TestRdn cannot be resolved to a type
----------
2 problems (2 errors)

***********************************************************
Unit Tests: (3740)
        
All Tests Passed

***********************************************************
Modifications since last successful build:	(8)
            
add cc-drlvm log20070227060306Lbuild.107 02/27/2007 06:03:06drlvm
modified mloenko  /harmony/enhanced/classlib/trunk/modules/jndi/src/test/java/org/apache/harmony/jndi/tests/javax/naming/ldap/main/AllTestLdap.java
02/27/2007 05:36:21 updated test name
modified mloenko  /harmony/enhanced/classlib/trunk/modules/jndi/src/test/java/org/apache/harmony/jndi/tests/javax/naming/ldap/LdapNameTest.java
02/27/2007 05:03:51 more cleanup
modified mloenko  /harmony/enhanced/classlib/trunk/modules/jndi/make/exclude.common 02/27/2007
05:03:51 more cleanup
modified mloenko  /harmony/enhanced/classlib/trunk/modules/jndi/src/main/java/javax/naming/ldap/LdapName.java
02/27/2007 05:03:51 more cleanup
add cc-classlib log20070227041508Lbuild.71 02/27/2007 04:15:08classlib
modified hindessm  /harmony/enhanced/classlib/trunk/depends/build/defines.mk 02/27/2007 04:05:06
Some aix defines.
modified hindessm  /harmony/enhanced/classlib/trunk/modules/archive/src/main/native/zlib/unix/makefile
02/27/2007 04:05:06 Some aix defines.


Mime
View raw message