harmony-alerts mailing list archives

Site index · List index
Message view « Date » · « Thread »
Top « Date » · « Thread »
From ge...@apache.org
Subject [build-test alert] BUILD FAILED lnx gcc debug: classlib over drlvm
Date Tue, 27 Feb 2007 07:00:39 GMT
BUILD FAILED:
	Ant Error Message:
/home/geir/dev/apache/harmony/enhanced/buildtest/trunk/cc/projects/classlib/trunk/build.xml:167:
The following error occurred while executing this line: /home/geir/dev/apache/harmony/enhanced/buildtest/trunk/cc/projects/classlib/trunk/make/build-test.xml:289:
Could not create task or type of type: replaceregexp.  Ant could not find the task or a class
this task relies upon.  This is common and has a number of causes; the usual  solutions are
to read the manual pages then download and install needed JAR files, or fix the build file:
  - You have misspelt 'replaceregexp'.    Fix: check your spelling.  - The task needs an external
JAR file to execute      and this is not found at the right place in the classpath.    Fix:
check the documentation for dependencies.    Fix: declare the task.  - The task is an Ant
optional task and the JAR file and/or libraries      implementing the functionality were not
found at the time you      yourself built your installation of Ant from the Ant
 sources.    Fix: Look in the ANT_HOME/lib for the 'ant-' JAR corresponding to the      task
and make sure it contains more than merely a META-INF/MANIFEST.MF.      If all it contains
is the manifest, then rebuild Ant with the needed      libraries present in /home/geir/dev/apache/harmony/enhanced/buildtest/trunk/cc/lib/optional/
, or alternatively,      download a pre-built release version from apache.org  - The build
file was written for a later version of Ant    Fix: upgrade to at least the latest release
version of Ant  - The task is not an Ant core or optional task       and needs to be declared
using <taskdef>.  - You are attempting to use a task defined using      <presetdef>
or <macrodef> but have spelt wrong or not     defined it at the point of use  Remember
that for JAR files to be visible to Ant tasks implemented in ANT_HOME/lib, the files must
be in the same directory or on the classpath  Please neither file bug reports on this problem,
nor email the Ant mailing 
 lists,
 until all of these causes have been explored, as this is not an Ant bug.

Date of build:	02/27/2007 01:25:42
Time to build:	34 minutes 28 seconds
Last changed:	02/27/2007 01:20:04
Last log entry:	Applied HARMONY-3063 [drlvm][jit] ArrayCopyRepMove does not work on EM64T

***********************************************************
Errors/Warnings:	(171)
            

========================================
Testing class libraries...
========================================
Checking for depends/jars/yoko_M2-20070130/yoko.jar
Checking for depends/jars/yoko_M2-20070130/yoko-core.jar
Checking for depends/jars/yoko_M2-20070130/yoko-rmi-impl.jar
Checking for depends/jars/yoko_M2-20070130/yoko-rmi-spec.jar
Checking for depends/jars/bcel-5.2/bcel-5.2.jar
Checking for depends/jars/xalan-j_2.7.0/xalan.jar
Checking for depends/jars/xerces_2.8.0/resolver.jar
Checking for depends/jars/xerces_2.8.0/xercesImpl.jar
Checking for depends/jars/xerces_2.8.0/xml-apis.jar
Checking for depends/jars/junit_3.8.2/junit.jar
Checking for depends/jars/bcprov-jdk15-134/bcprov.jar
Checking for depends/jars/icu4j_3.4.4/icu4j_3_4_4.jar
Checking for depends/jars/mx4j_3.0.2/mx4j.zip
Checking for depends/jars/ecj_3.2/ecj_3.2.jar
Checking for depends/jars/jetty/jetty-6.0.0.jar
Checking for depends/jars/jetty/jetty-util-6.0.0.jar
Checking for depends/jars/jetty/servlet-api-2.5-6.0.0.jar
Checking for depends/libs/build/lcms/icc34.h
Checking for depends/libs/build/lcms/lcms.h
Checking for depends/libs/build/png/pngconf.h
Checking for depends/libs/build/png/png.h
Checking for depends/libs/build/jpeg/jconfig.lnx
Checking for depends/libs/build/jpeg/jpeglib.h
Checking for depends/libs/build/jpeg/jmorecfg.h
Checking for depends/libs/build/jpeg/jerror.h
Checking for depends/libs/build/lcms/liblcms.linux.x86
Checking for depends/libs/build/png/libpng.linux.x86
Checking for depends/libs/build/jpeg/libjpeg.linux.x86
Since fork is false, ignoring memoryMaximumSize setting
Compiling ACCESSIBILITY classes
Compiling ACCESSIBILITY tests
Compiling ANNOTATION classes
Compiling ANNOTATION tests
Compiling APPLET classes
Compiling APPLET tests
Compiling ARCHIVE classes
Compiling ARCHIVE tests
Compiling AUTH classes
Compiling AUTH tests
Compiling AWT classes
Compiling AWT tests
java.lang.RuntimeException: expected from EDT
	at java.awt.EventDispatchThreadRTest$1.run(EventDispatchThreadRTest.java:29)
	at java.awt.event.InvocationEvent.runAndNotify(InvocationEvent.java:90)
	at java.awt.event.InvocationEvent.dispatch(InvocationEvent.java:77)
	at java.awt.EventQueueCore.dispatchEventImpl(EventQueueCore.java:140)
	at java.awt.EventQueue.dispatchEvent(EventQueue.java:144)
	at java.awt.EventDispatchThread.runModalLoop(EventDispatchThread.java:73)
	at java.awt.EventDispatchThread.run(EventDispatchThread.java:45)
Compiling BEANS classes
Compiling support classes for BEANS tests
Compiling internal BEANS tests
Compiling BEANS tests
Running internal BEANS tests
Running BEANS tests
Compiling CRYPTO classes
Compiling CRYPTO test support files
Since fork is false, ignoring memoryMaximumSize setting
Compiling CRYPTO api tests
Compiling CRYPTO api injected tests
Compiling CRYPTO impl injected tests
Compiling CRYPTO impl tests
Running CRYPTO api tests
Running CRYPTO api.injected tests
Running CRYPTO impl tests
Running CRYPTO impl injected tests
Compiling ImageIO classes
Compiling ImageIO tests
Compiling INSTRUMENT classes
Compiling INSTRUMENT tests
Compiling JNDI classes
Compiling JNDI tests
Compiling LANG-MANAGEMENT classes
Compiling LANG-MANAGEMENT API tests
Compiling LANG-MANAGEMENT Implementation tests
Compiling LOGGING classes
Compiling LOGGING tests
Compiling LUNI classes
Compiling LUNI JUnit Tests
Running LUNI JUnit Tests
java.io.IOException: Stream is closed
	at java.io.BufferedInputStream.read(BufferedInputStream.java:247)
	at java.io.FilterInputStream.read(FilterInputStream.java:137)
	at tests.support.Support_Exec$2.run(Support_Exec.java:199)
	at java.lang.Thread.run(Thread.java:660)
Compiling MATH classes
Compiling MATH tests
Compiling MISC classes
Compiling MISC tests
Compiling NIO classes
Compiling NIO tests
Compiling NIO_CHAR classes
Compiling NIO_CHAR tests
Cannot find unmappable byte array for US-ASCII
Cannot find unmappable byte array for gb18030
Cannot find unmappable byte array for ISO-8859-1
Cannot find malform byte array for ISO-8859-1
Cannot find unmappable byte array for UTF-16BE
Cannot find malform byte array for UTF-16BE
Cannot find unmappable byte array for UTF-16LE
Cannot find malform byte array for UTF-16LE
Cannot find unmappable byte array for UTF-8
Compiling PACK200 classes
Compiling PACK200 tests
Running PACK200 tests
init: passed
hyerror: passed
hytime: passed
hyfile: passed
Compiling PREFS classes
Compiling PREFS tests
Compiling PRINT classes
Compiling Print tests
Compiling REGEX classes
Compiling REGEX tests
Compiling RMI classes
Compiling RMI api tests
Running RMI api tests
Unexporting MyRemoteObject1[UnicastServerRef[endpoint:[[127.0.0.1:49556]](local), ObjID[65536,
UID[-59b00890:11101ec3e3b:-7ff7]]]] ...
Done.
Unexporting MyRemoteObject1[UnicastServerRef[endpoint:[[127.0.0.1:51524]](local), ObjID[65537,
UID[-59b00890:11101ec3e3b:-7ff6]]]] ...
Done.
Unexporting MyRemoteObject1[UnicastServerRef[endpoint:[[127.0.0.1:44273]](local), ObjID[65538,
UID[-59b00890:11101ec3e3b:-7ff5]]]] ...
Done.
Unexporting MyRemoteObject1[UnicastServerRef[endpoint:[[127.0.0.1:41042]](local), ObjID[65539,
UID[-59b00890:11101ec3e3b:-7ff4]]]] ...
Done.
Unexporting MyRemoteObject1[UnicastServerRef[endpoint:[[127.0.0.1:35695]](local), ObjID[65540,
UID[-59b00890:11101ec3e3b:-7ff3]]]] ...
Done.
Unexporting MyRemoteObject1[UnicastServerRef[endpoint:[[127.0.0.1:55711]](local), ObjID[65541,
UID[-59b00890:11101ec3e3b:-7ff2]]]] ...
Done.
Unexporting MyRemoteObject1[UnicastServerRef[endpoint:[[127.0.0.1:56129]](local), ObjID[65542,
UID[-59b00890:11101ec3e3b:-7ff1]]]] ...
Done.
Unexporting MyRemoteObject1[UnicastServerRef[endpoint:[[127.0.0.1:47061]](local), ObjID[65543,
UID[-59b00890:11101ec3e3b:-7ff0]]]] ...
Done.
LogStream[tst]:
Compiling SECURITY classes
Compiling SECURITY test support files
Compiling SECURITY api tests
Compiling SECURITY api injected tests
Compiling SECURITY impl injected tests
Compiling SECURITY impl tests
Running SECURITY api tests
Running SECURITY api.injected tests
Running SECURITY impl tests
Running SECURITY impl injected tests
Compiling SOUND classes
Compiling SOUND tests
Compiling SQL classes
Compiling SQL tests
Compiling Sun Compat classes
Compiling SUNCOMPAT tests
Compiling SWING classes
Compiling SWING tests
*** glibc detected *** double free or corruption (out): 0x0acc8e70 ***
SIGABRT in VM code.
Stack trace:
Compiling TEXT classes
Compiling TEXT tests
Compiling TOOLS classes
Compiling Tools tests
Compiling X-NET classes
Compiling X-NET test support files
Since fork is false, ignoring memoryMaximumSize setting
Compiling X-NET api tests
Compiling X-NET impl injected tests
Compiling X-NET impl tests
Running X-NET api tests
Running X-NET impl tests
Running X-NET impl injected tests

***********************************************************
Unit Tests: (17599)
        
failure: testUninstallDefaults javax.swing.plaf.basic.BasicTextUITest
failure: testModelChanged javax.swing.plaf.basic.BasicTextUITest
failure: testInstallListeners javax.swing.plaf.basic.BasicTextUITest
failure: testInstallKeyboardActions javax.swing.plaf.basic.BasicTextUITest
failure: testInstallDefaults javax.swing.plaf.basic.BasicTextUITest
failure: testBasicCaret javax.swing.plaf.basic.BasicTextUITest
failure: testBasicHighlighter javax.swing.plaf.basic.BasicTextUITest
failure: testI18nProperty javax.swing.plaf.basic.BasicTextUITest
failure: testCallOrder javax.swing.plaf.basic.BasicTextUITest
failure: testFocusAccelerator javax.swing.plaf.basic.BasicTextUITest
failure: testCreateUI javax.swing.plaf.basic.BasicToggleButtonUITest
failure: testGetPropertyPrefix javax.swing.plaf.basic.BasicToggleButtonUITest
failure: testGetTextShiftOffset javax.swing.plaf.basic.BasicToggleButtonUITest
failure: testPaint javax.swing.plaf.basic.BasicToolBarSeparatorUITest
failure: testGetPreferredSize javax.swing.plaf.basic.BasicToolBarSeparatorUITest
failure: testCreateUI javax.swing.plaf.basic.BasicToolBarSeparatorUITest
failure: testInstallDefaults javax.swing.plaf.basic.BasicToolBarSeparatorUITest
failure: testBasicToolBarSeparatorUI javax.swing.plaf.basic.BasicToolBarSeparatorUITest
failure: testNavigateFocusedComponent javax.swing.plaf.basic.BasicToolBarUIRTest
failure: testCreateUI javax.swing.plaf.basic.BasicToolTipUITest
failure: testGetSize javax.swing.plaf.basic.BasicToolTipUITest
failure: testCreateUI javax.swing.plaf.basic.BasicViewportUITest
failure: testDefaultValues javax.swing.plaf.basic.BasicViewportUITest
failure: testPreferredLayoutSize javax.swing.plaf.basic.DefaultMenuLayoutTest
failure: testDefaultMenuLayout javax.swing.plaf.basic.DefaultMenuLayoutTest
failure: testGetSystemTextFontFromProperty javax.swing.plaf.metal.DefaultMetalThemeTest
failure: testGetControlTextFontFromProperty javax.swing.plaf.metal.DefaultMetalThemeTest
failure: testGetSmallTextFontFromProperty javax.swing.plaf.metal.DefaultMetalThemeTest
failure: testGetUserTextFontFromProperty javax.swing.plaf.metal.DefaultMetalThemeTest
failure: testGetWindowTitleFont javax.swing.plaf.metal.DefaultMetalThemeTest
failure: testGetUserTextFont javax.swing.plaf.metal.DefaultMetalThemeTest
failure: testGetSystemTextFont javax.swing.plaf.metal.DefaultMetalThemeTest
failure: testGetSubTextFont javax.swing.plaf.metal.DefaultMetalThemeTest
failure: testGetMenuTextFont javax.swing.plaf.metal.DefaultMetalThemeTest
failure: testGetControlTextFont javax.swing.plaf.metal.DefaultMetalThemeTest
failure: testGetSecondary3 javax.swing.plaf.metal.DefaultMetalThemeTest
failure: testGetSecondary2 javax.swing.plaf.metal.DefaultMetalThemeTest
failure: testGetSecondary1 javax.swing.plaf.metal.DefaultMetalThemeTest
failure: testGetPrimary3 javax.swing.plaf.metal.DefaultMetalThemeTest
failure: testGetPrimary2 javax.swing.plaf.metal.DefaultMetalThemeTest
failure: testGetPrimary1 javax.swing.plaf.metal.DefaultMetalThemeTest
failure: testGetName javax.swing.plaf.metal.DefaultMetalThemeTest
Unit Test Error Details:	(42)
                
Test: testUninstallDefaultsClass: javax.swing.plaf.basic.BasicTextUITestjunit.framework.AssertionFailedError:
Test interrupted due timeout
	at javax.swing.BasicSwingTestCase.runBare(BasicSwingTestCase.java:147)

Test: testModelChangedClass: javax.swing.plaf.basic.BasicTextUITestjunit.framework.AssertionFailedError:
Test interrupted due timeout
	at javax.swing.BasicSwingTestCase.runBare(BasicSwingTestCase.java:147)

Test: testInstallListenersClass: javax.swing.plaf.basic.BasicTextUITestjunit.framework.AssertionFailedError:
Test interrupted due timeout
	at javax.swing.BasicSwingTestCase.runBare(BasicSwingTestCase.java:147)

Test: testInstallKeyboardActionsClass: javax.swing.plaf.basic.BasicTextUITestjunit.framework.AssertionFailedError:
Test interrupted due timeout
	at javax.swing.BasicSwingTestCase.runBare(BasicSwingTestCase.java:147)

Test: testInstallDefaultsClass: javax.swing.plaf.basic.BasicTextUITestjunit.framework.AssertionFailedError:
Test interrupted due timeout
	at javax.swing.BasicSwingTestCase.runBare(BasicSwingTestCase.java:147)

Test: testBasicCaretClass: javax.swing.plaf.basic.BasicTextUITestjunit.framework.AssertionFailedError:
Test interrupted due timeout
	at javax.swing.BasicSwingTestCase.runBare(BasicSwingTestCase.java:147)

Test: testBasicHighlighterClass: javax.swing.plaf.basic.BasicTextUITestjunit.framework.AssertionFailedError:
Test interrupted due timeout
	at javax.swing.BasicSwingTestCase.runBare(BasicSwingTestCase.java:147)

Test: testI18nPropertyClass: javax.swing.plaf.basic.BasicTextUITestjunit.framework.AssertionFailedError:
Test interrupted due timeout
	at javax.swing.BasicSwingTestCase.runBare(BasicSwingTestCase.java:147)

Test: testCallOrderClass: javax.swing.plaf.basic.BasicTextUITestjunit.framework.AssertionFailedError:
Test interrupted due timeout
	at javax.swing.BasicSwingTestCase.runBare(BasicSwingTestCase.java:147)

Test: testFocusAcceleratorClass: javax.swing.plaf.basic.BasicTextUITestjunit.framework.AssertionFailedError:
Test interrupted due timeout
	at javax.swing.BasicSwingTestCase.runBare(BasicSwingTestCase.java:147)

Test: testCreateUIClass: javax.swing.plaf.basic.BasicToggleButtonUITestjunit.framework.AssertionFailedError:
Test interrupted due timeout
	at javax.swing.BasicSwingTestCase.runBare(BasicSwingTestCase.java:147)

Test: testGetPropertyPrefixClass: javax.swing.plaf.basic.BasicToggleButtonUITestjunit.framework.AssertionFailedError:
Test interrupted due timeout
	at javax.swing.BasicSwingTestCase.runBare(BasicSwingTestCase.java:147)

Test: testGetTextShiftOffsetClass: javax.swing.plaf.basic.BasicToggleButtonUITestjunit.framework.AssertionFailedError:
Test interrupted due timeout
	at javax.swing.BasicSwingTestCase.runBare(BasicSwingTestCase.java:147)

Test: testPaintClass: javax.swing.plaf.basic.BasicToolBarSeparatorUITestjunit.framework.AssertionFailedError:
Test interrupted due timeout
	at javax.swing.BasicSwingTestCase.runBare(BasicSwingTestCase.java:147)

Test: testGetPreferredSizeClass: javax.swing.plaf.basic.BasicToolBarSeparatorUITestjunit.framework.AssertionFailedError:
Test interrupted due timeout
	at javax.swing.BasicSwingTestCase.runBare(BasicSwingTestCase.java:147)

Test: testCreateUIClass: javax.swing.plaf.basic.BasicToolBarSeparatorUITestjunit.framework.AssertionFailedError:
Test interrupted due timeout
	at javax.swing.BasicSwingTestCase.runBare(BasicSwingTestCase.java:147)

Test: testInstallDefaultsClass: javax.swing.plaf.basic.BasicToolBarSeparatorUITestjunit.framework.AssertionFailedError:
Test interrupted due timeout
	at javax.swing.BasicSwingTestCase.runBare(BasicSwingTestCase.java:147)

Test: testBasicToolBarSeparatorUIClass: javax.swing.plaf.basic.BasicToolBarSeparatorUITestjunit.framework.AssertionFailedError:
Test interrupted due timeout
	at javax.swing.BasicSwingTestCase.runBare(BasicSwingTestCase.java:147)

Test: testNavigateFocusedComponentClass: javax.swing.plaf.basic.BasicToolBarUIRTestjunit.framework.AssertionFailedError:
Test interrupted due timeout
	at javax.swing.BasicSwingTestCase.runBare(BasicSwingTestCase.java:147)

Test: testCreateUIClass: javax.swing.plaf.basic.BasicToolTipUITestjunit.framework.AssertionFailedError:
Test interrupted due timeout
	at javax.swing.BasicSwingTestCase.runBare(BasicSwingTestCase.java:147)

Test: testGetSizeClass: javax.swing.plaf.basic.BasicToolTipUITestjunit.framework.AssertionFailedError:
Test interrupted due timeout
	at javax.swing.BasicSwingTestCase.runBare(BasicSwingTestCase.java:147)

Test: testCreateUIClass: javax.swing.plaf.basic.BasicViewportUITestjunit.framework.AssertionFailedError:
Test interrupted due timeout
	at javax.swing.BasicSwingTestCase.runBare(BasicSwingTestCase.java:147)

Test: testDefaultValuesClass: javax.swing.plaf.basic.BasicViewportUITestjunit.framework.AssertionFailedError:
Test interrupted due timeout
	at javax.swing.BasicSwingTestCase.runBare(BasicSwingTestCase.java:147)

Test: testPreferredLayoutSizeClass: javax.swing.plaf.basic.DefaultMenuLayoutTestjunit.framework.AssertionFailedError:
Test interrupted due timeout
	at javax.swing.BasicSwingTestCase.runBare(BasicSwingTestCase.java:147)

Test: testDefaultMenuLayoutClass: javax.swing.plaf.basic.DefaultMenuLayoutTestjunit.framework.AssertionFailedError:
Test interrupted due timeout
	at javax.swing.BasicSwingTestCase.runBare(BasicSwingTestCase.java:147)

Test: testGetSystemTextFontFromPropertyClass: javax.swing.plaf.metal.DefaultMetalThemeTestjunit.framework.AssertionFailedError:
Test interrupted due timeout
	at javax.swing.BasicSwingTestCase.runBare(BasicSwingTestCase.java:147)

Test: testGetControlTextFontFromPropertyClass: javax.swing.plaf.metal.DefaultMetalThemeTestjunit.framework.AssertionFailedError:
Test interrupted due timeout
	at javax.swing.BasicSwingTestCase.runBare(BasicSwingTestCase.java:147)

Test: testGetSmallTextFontFromPropertyClass: javax.swing.plaf.metal.DefaultMetalThemeTestjunit.framework.AssertionFailedError:
Test interrupted due timeout
	at javax.swing.BasicSwingTestCase.runBare(BasicSwingTestCase.java:147)

Test: testGetUserTextFontFromPropertyClass: javax.swing.plaf.metal.DefaultMetalThemeTestjunit.framework.AssertionFailedError:
Test interrupted due timeout
	at javax.swing.BasicSwingTestCase.runBare(BasicSwingTestCase.java:147)

Test: testGetWindowTitleFontClass: javax.swing.plaf.metal.DefaultMetalThemeTestjunit.framework.AssertionFailedError:
Test interrupted due timeout
	at javax.swing.BasicSwingTestCase.runBare(BasicSwingTestCase.java:147)

Test: testGetUserTextFontClass: javax.swing.plaf.metal.DefaultMetalThemeTestjunit.framework.AssertionFailedError:
Test interrupted due timeout
	at javax.swing.BasicSwingTestCase.runBare(BasicSwingTestCase.java:147)

Test: testGetSystemTextFontClass: javax.swing.plaf.metal.DefaultMetalThemeTestjunit.framework.AssertionFailedError:
Test interrupted due timeout
	at javax.swing.BasicSwingTestCase.runBare(BasicSwingTestCase.java:147)

Test: testGetSubTextFontClass: javax.swing.plaf.metal.DefaultMetalThemeTestjunit.framework.AssertionFailedError:
Test interrupted due timeout
	at javax.swing.BasicSwingTestCase.runBare(BasicSwingTestCase.java:147)

Test: testGetMenuTextFontClass: javax.swing.plaf.metal.DefaultMetalThemeTestjunit.framework.AssertionFailedError:
Test interrupted due timeout
	at javax.swing.BasicSwingTestCase.runBare(BasicSwingTestCase.java:147)

Test: testGetControlTextFontClass: javax.swing.plaf.metal.DefaultMetalThemeTestjunit.framework.AssertionFailedError:
Test interrupted due timeout
	at javax.swing.BasicSwingTestCase.runBare(BasicSwingTestCase.java:147)

Test: testGetSecondary3Class: javax.swing.plaf.metal.DefaultMetalThemeTestjunit.framework.AssertionFailedError:
Test interrupted due timeout
	at javax.swing.BasicSwingTestCase.runBare(BasicSwingTestCase.java:147)

Test: testGetSecondary2Class: javax.swing.plaf.metal.DefaultMetalThemeTestjunit.framework.AssertionFailedError:
Test interrupted due timeout
	at javax.swing.BasicSwingTestCase.runBare(BasicSwingTestCase.java:147)

Test: testGetSecondary1Class: javax.swing.plaf.metal.DefaultMetalThemeTestjunit.framework.AssertionFailedError:
Test interrupted due timeout
	at javax.swing.BasicSwingTestCase.runBare(BasicSwingTestCase.java:147)

Test: testGetPrimary3Class: javax.swing.plaf.metal.DefaultMetalThemeTestjunit.framework.AssertionFailedError:
Test interrupted due timeout
	at javax.swing.BasicSwingTestCase.runBare(BasicSwingTestCase.java:147)

Test: testGetPrimary2Class: javax.swing.plaf.metal.DefaultMetalThemeTestjunit.framework.AssertionFailedError:
Test interrupted due timeout
	at javax.swing.BasicSwingTestCase.runBare(BasicSwingTestCase.java:147)

Test: testGetPrimary1Class: javax.swing.plaf.metal.DefaultMetalThemeTestjunit.framework.AssertionFailedError:
Test interrupted due timeout
	at javax.swing.BasicSwingTestCase.runBare(BasicSwingTestCase.java:147)

Test: testGetNameClass: javax.swing.plaf.metal.DefaultMetalThemeTestjunit.framework.AssertionFailedError:
Test interrupted due timeout
	at javax.swing.BasicSwingTestCase.runBare(BasicSwingTestCase.java:147)


***********************************************************
Modifications since last successful build:	(8)
            
modified varlax  /harmony/enhanced/drlvm/trunk/vm/jitrino/src/codegenerator/ia32/Ia32IRManager.cpp
02/27/2007 01:20:04 Applied HARMONY-3063 [drlvm][jit] ArrayCopyRepMove does not work on EM64T
modified varlax  /harmony/enhanced/drlvm/trunk/src/test/microbenchmark/harmony-2247/ArraycopyTest.java
02/27/2007 01:20:04 Applied HARMONY-3063 [drlvm][jit] ArrayCopyRepMove does not work on EM64T
modified varlax  /harmony/enhanced/drlvm/trunk/vm/jitrino/src/translator/java/JavaByteCodeTranslator.cpp
02/27/2007 01:20:04 Applied HARMONY-3063 [drlvm][jit] ArrayCopyRepMove does not work on EM64T
modified varlax  /harmony/enhanced/drlvm/trunk/vm/jitrino/src/codegenerator/ia32/Ia32InstCodeSelector.cpp
02/27/2007 01:20:04 Applied HARMONY-3063 [drlvm][jit] ArrayCopyRepMove does not work on EM64T
add cc-drlvm log20070227011615Lbuild.105 02/27/2007 01:16:15drlvm
modified varlax  /harmony/enhanced/drlvm/trunk/vm/jitrino/src/codegenerator/ia32/Ia32InstCodeSelector.cpp
02/26/2007 23:42:47 Fixed HARMONY-3222 [drlvm][jit] assertion fires with DaCapo eclipse (jitrino
built in debug)Tested on SLES9@ia32
modified varlax  /harmony/enhanced/drlvm/trunk/vm/jitrino/src/codegenerator/ia32/Ia32InstCodeSelector.h
02/26/2007 23:42:47 Fixed HARMONY-3222 [drlvm][jit] assertion fires with DaCapo eclipse (jitrino
built in debug)Tested on SLES9@ia32
modified varlax  /harmony/enhanced/drlvm/trunk/vm/jitrino/src/codegenerator/CodeGenIntfc.h
02/26/2007 23:42:47 Fixed HARMONY-3222 [drlvm][jit] assertion fires with DaCapo eclipse (jitrino
built in debug)Tested on SLES9@ia32


Mime
View raw message