harmony-alerts mailing list archives

Site index · List index
Message view « Date » · « Thread »
Top « Date » · « Thread »
From ge...@apache.org
Subject [build-test alert] BUILD FAILED lnx gcc debug: classlib over drlvm
Date Mon, 26 Feb 2007 19:15:15 GMT
BUILD FAILED:
	Ant Error Message:
/home/geir/dev/apache/harmony/enhanced/buildtest/trunk/cc/projects/classlib/trunk/build.xml:167:
The following error occurred while executing this line: /home/geir/dev/apache/harmony/enhanced/buildtest/trunk/cc/projects/classlib/trunk/make/build-test.xml:289:
Could not create task or type of type: replaceregexp.  Ant could not find the task or a class
this task relies upon.  This is common and has a number of causes; the usual  solutions are
to read the manual pages then download and install needed JAR files, or fix the build file:
  - You have misspelt 'replaceregexp'.    Fix: check your spelling.  - The task needs an external
JAR file to execute      and this is not found at the right place in the classpath.    Fix:
check the documentation for dependencies.    Fix: declare the task.  - The task is an Ant
optional task and the JAR file and/or libraries      implementing the functionality were not
found at the time you      yourself built your installation of Ant from the Ant
 sources.    Fix: Look in the ANT_HOME/lib for the 'ant-' JAR corresponding to the      task
and make sure it contains more than merely a META-INF/MANIFEST.MF.      If all it contains
is the manifest, then rebuild Ant with the needed      libraries present in /home/geir/dev/apache/harmony/enhanced/buildtest/trunk/cc/lib/optional/
, or alternatively,      download a pre-built release version from apache.org  - The build
file was written for a later version of Ant    Fix: upgrade to at least the latest release
version of Ant  - The task is not an Ant core or optional task       and needs to be declared
using <taskdef>.  - You are attempting to use a task defined using      <presetdef>
or <macrodef> but have spelt wrong or not     defined it at the point of use  Remember
that for JAR files to be visible to Ant tasks implemented in ANT_HOME/lib, the files must
be in the same directory or on the classpath  Please neither file bug reports on this problem,
nor email the Ant mailing 
 lists,
 until all of these causes have been explored, as this is not an Ant bug.

Date of build:	02/26/2007 13:40:17
Time to build:	34 minutes 30 seconds
Last changed:	02/26/2007 13:30:43
Last log entry:	drlvm

***********************************************************
Errors/Warnings:	(171)
            

========================================
Testing class libraries...
========================================
Checking for depends/jars/yoko_M2-20070130/yoko.jar
Checking for depends/jars/yoko_M2-20070130/yoko-core.jar
Checking for depends/jars/yoko_M2-20070130/yoko-rmi-impl.jar
Checking for depends/jars/yoko_M2-20070130/yoko-rmi-spec.jar
Checking for depends/jars/bcel-5.2/bcel-5.2.jar
Checking for depends/jars/xalan-j_2.7.0/xalan.jar
Checking for depends/jars/xerces_2.8.0/resolver.jar
Checking for depends/jars/xerces_2.8.0/xercesImpl.jar
Checking for depends/jars/xerces_2.8.0/xml-apis.jar
Checking for depends/jars/junit_3.8.2/junit.jar
Checking for depends/jars/bcprov-jdk15-134/bcprov.jar
Checking for depends/jars/icu4j_3.4.4/icu4j_3_4_4.jar
Checking for depends/jars/mx4j_3.0.2/mx4j.zip
Checking for depends/jars/ecj_3.2/ecj_3.2.jar
Checking for depends/jars/jetty/jetty-6.0.0.jar
Checking for depends/jars/jetty/jetty-util-6.0.0.jar
Checking for depends/jars/jetty/servlet-api-2.5-6.0.0.jar
Checking for depends/libs/build/lcms/icc34.h
Checking for depends/libs/build/lcms/lcms.h
Checking for depends/libs/build/png/pngconf.h
Checking for depends/libs/build/png/png.h
Checking for depends/libs/build/jpeg/jconfig.lnx
Checking for depends/libs/build/jpeg/jpeglib.h
Checking for depends/libs/build/jpeg/jmorecfg.h
Checking for depends/libs/build/jpeg/jerror.h
Checking for depends/libs/build/lcms/liblcms.linux.x86
Checking for depends/libs/build/png/libpng.linux.x86
Checking for depends/libs/build/jpeg/libjpeg.linux.x86
Since fork is false, ignoring memoryMaximumSize setting
Compiling ACCESSIBILITY classes
Compiling ACCESSIBILITY tests
Compiling ANNOTATION classes
Compiling ANNOTATION tests
Compiling APPLET classes
Compiling APPLET tests
Compiling ARCHIVE classes
Compiling ARCHIVE tests
Compiling AUTH classes
Compiling AUTH tests
Compiling AWT classes
Compiling AWT tests
java.lang.RuntimeException: expected from EDT
	at java.awt.EventDispatchThreadRTest$1.run(EventDispatchThreadRTest.java:29)
	at java.awt.event.InvocationEvent.runAndNotify(InvocationEvent.java:90)
	at java.awt.event.InvocationEvent.dispatch(InvocationEvent.java:77)
	at java.awt.EventQueueCore.dispatchEventImpl(EventQueueCore.java:140)
	at java.awt.EventQueue.dispatchEvent(EventQueue.java:144)
	at java.awt.EventDispatchThread.runModalLoop(EventDispatchThread.java:73)
	at java.awt.EventDispatchThread.run(EventDispatchThread.java:45)
Compiling BEANS classes
Compiling support classes for BEANS tests
Compiling internal BEANS tests
Compiling BEANS tests
Running internal BEANS tests
Running BEANS tests
Compiling CRYPTO classes
Compiling CRYPTO test support files
Since fork is false, ignoring memoryMaximumSize setting
Compiling CRYPTO api tests
Compiling CRYPTO api injected tests
Compiling CRYPTO impl injected tests
Compiling CRYPTO impl tests
Running CRYPTO api tests
Running CRYPTO api.injected tests
Running CRYPTO impl tests
Running CRYPTO impl injected tests
Compiling ImageIO classes
Compiling ImageIO tests
Compiling INSTRUMENT classes
Compiling INSTRUMENT tests
Compiling JNDI classes
Compiling JNDI tests
Compiling LANG-MANAGEMENT classes
Compiling LANG-MANAGEMENT API tests
Compiling LANG-MANAGEMENT Implementation tests
Compiling LOGGING classes
Compiling LOGGING tests
Compiling LUNI classes
Compiling LUNI JUnit Tests
Running LUNI JUnit Tests
java.io.IOException: Stream is closed
	at java.io.BufferedInputStream.read(BufferedInputStream.java:247)
	at java.io.FilterInputStream.read(FilterInputStream.java:137)
	at tests.support.Support_Exec$2.run(Support_Exec.java:199)
	at java.lang.Thread.run(Thread.java:660)
Compiling MATH classes
Compiling MATH tests
Compiling MISC classes
Compiling MISC tests
Compiling NIO classes
Compiling NIO tests
Compiling NIO_CHAR classes
Compiling NIO_CHAR tests
Cannot find unmappable byte array for US-ASCII
Cannot find unmappable byte array for gb18030
Cannot find unmappable byte array for ISO-8859-1
Cannot find malform byte array for ISO-8859-1
Cannot find unmappable byte array for UTF-16BE
Cannot find malform byte array for UTF-16BE
Cannot find unmappable byte array for UTF-16LE
Cannot find malform byte array for UTF-16LE
Cannot find unmappable byte array for UTF-8
Compiling PACK200 classes
Compiling PACK200 tests
Running PACK200 tests
init: passed
hyerror: passed
hytime: passed
hyfile: passed
Compiling PREFS classes
Compiling PREFS tests
Compiling PRINT classes
Compiling Print tests
Compiling REGEX classes
Compiling REGEX tests
Compiling RMI classes
Compiling RMI api tests
Running RMI api tests
Unexporting MyRemoteObject1[UnicastServerRef[endpoint:[[127.0.0.1:46998]](local), ObjID[65536,
UID[-59b9d94c:110ff666cf9:-7ff7]]]] ...
Done.
Unexporting MyRemoteObject1[UnicastServerRef[endpoint:[[127.0.0.1:43037]](local), ObjID[65537,
UID[-59b9d94c:110ff666cf9:-7ff6]]]] ...
Done.
Unexporting MyRemoteObject1[UnicastServerRef[endpoint:[[127.0.0.1:59188]](local), ObjID[65538,
UID[-59b9d94c:110ff666cf9:-7ff5]]]] ...
Done.
Unexporting MyRemoteObject1[UnicastServerRef[endpoint:[[127.0.0.1:46965]](local), ObjID[65539,
UID[-59b9d94c:110ff666cf9:-7ff4]]]] ...
Done.
Unexporting MyRemoteObject1[UnicastServerRef[endpoint:[[127.0.0.1:60512]](local), ObjID[65540,
UID[-59b9d94c:110ff666cf9:-7ff3]]]] ...
Done.
Unexporting MyRemoteObject1[UnicastServerRef[endpoint:[[127.0.0.1:46796]](local), ObjID[65541,
UID[-59b9d94c:110ff666cf9:-7ff2]]]] ...
Done.
Unexporting MyRemoteObject1[UnicastServerRef[endpoint:[[127.0.0.1:58289]](local), ObjID[65542,
UID[-59b9d94c:110ff666cf9:-7ff1]]]] ...
Done.
Unexporting MyRemoteObject1[UnicastServerRef[endpoint:[[127.0.0.1:52619]](local), ObjID[65543,
UID[-59b9d94c:110ff666cf9:-7ff0]]]] ...
Done.
LogStream[tst]:
Compiling SECURITY classes
Compiling SECURITY test support files
Compiling SECURITY api tests
Compiling SECURITY api injected tests
Compiling SECURITY impl injected tests
Compiling SECURITY impl tests
Running SECURITY api tests
Running SECURITY api.injected tests
Running SECURITY impl tests
Running SECURITY impl injected tests
Compiling SOUND classes
Compiling SOUND tests
Compiling SQL classes
Compiling SQL tests
Compiling Sun Compat classes
Compiling SUNCOMPAT tests
Compiling SWING classes
Compiling SWING tests
*** glibc detected *** double free or corruption (out): 0x0d20ce38 ***
SIGABRT in VM code.
Stack trace:
Compiling TEXT classes
Compiling TEXT tests
Compiling TOOLS classes
Compiling Tools tests
Compiling X-NET classes
Compiling X-NET test support files
Since fork is false, ignoring memoryMaximumSize setting
Compiling X-NET api tests
Compiling X-NET impl injected tests
Compiling X-NET impl tests
Running X-NET api tests
Running X-NET impl tests
Running X-NET impl injected tests

***********************************************************
Unit Tests: (16310)
        
All Tests Passed

***********************************************************
Modifications since last successful build:	(52)
            
add cc-drlvm log20070226133043Lbuild.103 02/26/2007 13:30:43drlvm
modified ayza  /harmony/enhanced/classlib/trunk/modules/security/src/main/native/security/windows
02/26/2007 12:00:20 Fix that allows embedding assembly manifests into corresponding DLL/EXE
files during the build process. This was MSVS 2005-specific issue. See HARMONY-3240.
modified ayza  /harmony/enhanced/classlib/trunk/depends/build/rules.mak 02/26/2007 12:00:20
Fix that allows embedding assembly manifests into corresponding DLL/EXE files during the build
process. This was MSVS 2005-specific issue. See HARMONY-3240.
modified ayza  /harmony/enhanced/classlib/trunk/modules/nio/src/main/native/nio 02/26/2007
12:00:20 Fix that allows embedding assembly manifests into corresponding DLL/EXE files during
the build process. This was MSVS 2005-specific issue. See HARMONY-3240.
modified ayza  /harmony/enhanced/classlib/trunk/modules/prefs/build.xml 02/26/2007 12:00:20
Fix that allows embedding assembly manifests into corresponding DLL/EXE files during the build
process. This was MSVS 2005-specific issue. See HARMONY-3240.
modified ayza  /harmony/enhanced/classlib/trunk/modules/portlib/src/test/native/hytime/windows/makefile
02/26/2007 12:00:20 Fix that allows embedding assembly manifests into corresponding DLL/EXE
files during the build process. This was MSVS 2005-specific issue. See HARMONY-3240.
modified ayza  /harmony/enhanced/classlib/trunk/modules/archive/build.xml 02/26/2007 12:00:20
Fix that allows embedding assembly manifests into corresponding DLL/EXE files during the build
process. This was MSVS 2005-specific issue. See HARMONY-3240.
modified ayza  /harmony/enhanced/classlib/trunk/modules/awt/src/main/native/winfont 02/26/2007
12:00:20 Fix that allows embedding assembly manifests into corresponding DLL/EXE files during
the build process. This was MSVS 2005-specific issue. See HARMONY-3240.
modified ayza  /harmony/enhanced/classlib/trunk/modules/misc/src/main/native/accessors 02/26/2007
12:00:20 Fix that allows embedding assembly manifests into corresponding DLL/EXE files during
the build process. This was MSVS 2005-specific issue. See HARMONY-3240.
modified ayza  /harmony/enhanced/classlib/trunk/modules/portlib/src/test/native/init/windows/makefile
02/26/2007 12:00:20 Fix that allows embedding assembly manifests into corresponding DLL/EXE
files during the build process. This was MSVS 2005-specific issue. See HARMONY-3240.
modified ayza  /harmony/enhanced/classlib/trunk/modules/portlib/src/main/native/thread 02/26/2007
12:00:20 Fix that allows embedding assembly manifests into corresponding DLL/EXE files during
the build process. This was MSVS 2005-specific issue. See HARMONY-3240.
modified ayza  /harmony/enhanced/classlib/trunk/modules/nio/build.xml 02/26/2007 12:00:20
Fix that allows embedding assembly manifests into corresponding DLL/EXE files during the build
process. This was MSVS 2005-specific issue. See HARMONY-3240.
modified ayza  /harmony/enhanced/classlib/trunk/modules/portlib/src/main/native/common/windows/windows.x86_64
02/26/2007 12:00:20 Fix that allows embedding assembly manifests into corresponding DLL/EXE
files during the build process. This was MSVS 2005-specific issue. See HARMONY-3240.
modified ayza  /harmony/enhanced/classlib/trunk/modules/print/src/main/native/print 02/26/2007
12:00:20 Fix that allows embedding assembly manifests into corresponding DLL/EXE files during
the build process. This was MSVS 2005-specific issue. See HARMONY-3240.
modified ayza  /harmony/enhanced/classlib/trunk/modules/misc/build.xml 02/26/2007 12:00:20
Fix that allows embedding assembly manifests into corresponding DLL/EXE files during the build
process. This was MSVS 2005-specific issue. See HARMONY-3240.
modified ayza  /harmony/enhanced/classlib/trunk/modules/awt/build.xml 02/26/2007 12:00:20
Fix that allows embedding assembly manifests into corresponding DLL/EXE files during the build
process. This was MSVS 2005-specific issue. See HARMONY-3240.
modified ayza  /harmony/enhanced/classlib/trunk/modules/print/build.xml 02/26/2007 12:00:20
Fix that allows embedding assembly manifests into corresponding DLL/EXE files during the build
process. This was MSVS 2005-specific issue. See HARMONY-3240.
modified ayza  /harmony/enhanced/classlib/trunk/modules/awt/src/main/native/gl 02/26/2007
12:00:20 Fix that allows embedding assembly manifests into corresponding DLL/EXE files during
the build process. This was MSVS 2005-specific issue. See HARMONY-3240.
modified ayza  /harmony/enhanced/classlib/trunk/modules/portlib/src/main/native/sig 02/26/2007
12:00:20 Fix that allows embedding assembly manifests into corresponding DLL/EXE files during
the build process. This was MSVS 2005-specific issue. See HARMONY-3240.
modified ayza  /harmony/enhanced/classlib/trunk/modules/awt/src/main/native/win32wrapper 02/26/2007
12:00:20 Fix that allows embedding assembly manifests into corresponding DLL/EXE files during
the build process. This was MSVS 2005-specific issue. See HARMONY-3240.
modified ayza  /harmony/enhanced/classlib/trunk/modules/imageio/src/main/native/jpegencoder
02/26/2007 12:00:20 Fix that allows embedding assembly manifests into corresponding DLL/EXE
files during the build process. This was MSVS 2005-specific issue. See HARMONY-3240.
modified ayza  /harmony/enhanced/classlib/trunk/modules/portlib/src/test/native/hyerror 02/26/2007
12:00:20 Fix that allows embedding assembly manifests into corresponding DLL/EXE files during
the build process. This was MSVS 2005-specific issue. See HARMONY-3240.
modified ayza  /harmony/enhanced/classlib/trunk/modules/auth/src/main/native/auth 02/26/2007
12:00:20 Fix that allows embedding assembly manifests into corresponding DLL/EXE files during
the build process. This was MSVS 2005-specific issue. See HARMONY-3240.
modified ayza  /harmony/enhanced/classlib/trunk/modules/portlib/src/main/native/thread/windows/windows.x86_64
02/26/2007 12:00:20 Fix that allows embedding assembly manifests into corresponding DLL/EXE
files during the build process. This was MSVS 2005-specific issue. See HARMONY-3240.
modified ayza  /harmony/enhanced/classlib/trunk/modules/security/build.xml 02/26/2007 12:00:20
Fix that allows embedding assembly manifests into corresponding DLL/EXE files during the build
process. This was MSVS 2005-specific issue. See HARMONY-3240.
modified ayza  /harmony/enhanced/classlib/trunk/modules/luni/build.xml 02/26/2007 12:00:20
Fix that allows embedding assembly manifests into corresponding DLL/EXE files during the build
process. This was MSVS 2005-specific issue. See HARMONY-3240.
modified ayza  /harmony/enhanced/classlib/trunk/modules/portlib/src/test/native/hytime 02/26/2007
12:00:20 Fix that allows embedding assembly manifests into corresponding DLL/EXE files during
the build process. This was MSVS 2005-specific issue. See HARMONY-3240.
modified ayza  /harmony/enhanced/classlib/trunk/modules/awt/src/main/native/jpegdecoder 02/26/2007
12:00:20 Fix that allows embedding assembly manifests into corresponding DLL/EXE files during
the build process. This was MSVS 2005-specific issue. See HARMONY-3240.
modified ayza  /harmony/enhanced/classlib/trunk/modules/imageio/build.xml 02/26/2007 12:00:20
Fix that allows embedding assembly manifests into corresponding DLL/EXE files during the build
process. This was MSVS 2005-specific issue. See HARMONY-3240.
modified ayza  /harmony/enhanced/classlib/trunk/modules/portlib/src/test/native/hyerror/windows/makefile
02/26/2007 12:00:20 Fix that allows embedding assembly manifests into corresponding DLL/EXE
files during the build process. This was MSVS 2005-specific issue. See HARMONY-3240.
modified ayza  /harmony/enhanced/classlib/trunk/modules/portlib/build.xml 02/26/2007 12:00:20
Fix that allows embedding assembly manifests into corresponding DLL/EXE files during the build
process. This was MSVS 2005-specific issue. See HARMONY-3240.
modified ayza  /harmony/enhanced/classlib/trunk/modules/luni/src/main/native/launcher 02/26/2007
12:00:20 Fix that allows embedding assembly manifests into corresponding DLL/EXE files during
the build process. This was MSVS 2005-specific issue. See HARMONY-3240.
modified ayza  /harmony/enhanced/classlib/trunk/modules/text/src/main/native/text 02/26/2007
12:00:20 Fix that allows embedding assembly manifests into corresponding DLL/EXE files during
the build process. This was MSVS 2005-specific issue. See HARMONY-3240.
modified ayza  /harmony/enhanced/classlib/trunk/modules/portlib/src/test/native/init 02/26/2007
12:00:20 Fix that allows embedding assembly manifests into corresponding DLL/EXE files during
the build process. This was MSVS 2005-specific issue. See HARMONY-3240.
modified ayza  /harmony/enhanced/classlib/trunk/modules/awt/src/main/native/oglwrapper 02/26/2007
12:00:20 Fix that allows embedding assembly manifests into corresponding DLL/EXE files during
the build process. This was MSVS 2005-specific issue. See HARMONY-3240.
modified ayza  /harmony/enhanced/classlib/trunk/modules/security/src/main/native/security
02/26/2007 12:00:20 Fix that allows embedding assembly manifests into corresponding DLL/EXE
files during the build process. This was MSVS 2005-specific issue. See HARMONY-3240.
modified ayza  /harmony/enhanced/classlib/trunk/modules/luni/src/main/native/luni 02/26/2007
12:00:20 Fix that allows embedding assembly manifests into corresponding DLL/EXE files during
the build process. This was MSVS 2005-specific issue. See HARMONY-3240.
modified ayza  /harmony/enhanced/classlib/trunk/modules/archive/src/main/native/zlib 02/26/2007
12:00:20 Fix that allows embedding assembly manifests into corresponding DLL/EXE files during
the build process. This was MSVS 2005-specific issue. See HARMONY-3240.
modified ayza  /harmony/enhanced/classlib/trunk/modules/text/build.xml 02/26/2007 12:00:20
Fix that allows embedding assembly manifests into corresponding DLL/EXE files during the build
process. This was MSVS 2005-specific issue. See HARMONY-3240.
modified ayza  /harmony/enhanced/classlib/trunk/modules/print/src/main/native/print/windows
02/26/2007 12:00:20 Fix that allows embedding assembly manifests into corresponding DLL/EXE
files during the build process. This was MSVS 2005-specific issue. See HARMONY-3240.
modified ayza  /harmony/enhanced/classlib/trunk/modules/awt/src/main/native/lcmm 02/26/2007
12:00:20 Fix that allows embedding assembly manifests into corresponding DLL/EXE files during
the build process. This was MSVS 2005-specific issue. See HARMONY-3240.
modified ayza  /harmony/enhanced/classlib/trunk/modules/portlib/src/test/native/hyfile 02/26/2007
12:00:20 Fix that allows embedding assembly manifests into corresponding DLL/EXE files during
the build process. This was MSVS 2005-specific issue. See HARMONY-3240.
modified ayza  /harmony/enhanced/classlib/trunk/depends/libs/windows.x86_64 02/26/2007 12:00:20
Fix that allows embedding assembly manifests into corresponding DLL/EXE files during the build
process. This was MSVS 2005-specific issue. See HARMONY-3240.
modified ayza  /harmony/enhanced/classlib/trunk/modules/imageio/src/main/native/jpegencoder/windows
02/26/2007 12:00:20 Fix that allows embedding assembly manifests into corresponding DLL/EXE
files during the build process. This was MSVS 2005-specific issue. See HARMONY-3240.
modified ayza  /harmony/enhanced/classlib/trunk/modules/portlib/src/test/native/hyfile/windows/makefile
02/26/2007 12:00:20 Fix that allows embedding assembly manifests into corresponding DLL/EXE
files during the build process. This was MSVS 2005-specific issue. See HARMONY-3240.
modified ayza  /harmony/enhanced/classlib/trunk/modules/prefs/src/main/native/prefs 02/26/2007
12:00:20 Fix that allows embedding assembly manifests into corresponding DLL/EXE files during
the build process. This was MSVS 2005-specific issue. See HARMONY-3240.
modified ayza  /harmony/enhanced/classlib/trunk/modules/auth/build.xml 02/26/2007 12:00:20
Fix that allows embedding assembly manifests into corresponding DLL/EXE files during the build
process. This was MSVS 2005-specific issue. See HARMONY-3240.
modified ayza  /harmony/enhanced/classlib/trunk/modules/portlib/src/main/native/port 02/26/2007
12:00:20 Fix that allows embedding assembly manifests into corresponding DLL/EXE files during
the build process. This was MSVS 2005-specific issue. See HARMONY-3240.
modified ayza  /harmony/enhanced/classlib/trunk/make/properties.xml 02/26/2007 12:00:20 Fix
that allows embedding assembly manifests into corresponding DLL/EXE files during the build
process. This was MSVS 2005-specific issue. See HARMONY-3240.
modified ayza  /harmony/enhanced/classlib/trunk/modules/archive/src/main/native/archive 02/26/2007
12:00:20 Fix that allows embedding assembly manifests into corresponding DLL/EXE files during
the build process. This was MSVS 2005-specific issue. See HARMONY-3240.
modified gshimansky  /harmony/enhanced/drlvm/trunk/vm/gc_gen/src/gen/gen_adapt.cpp 02/26/2007
10:45:42 Fixed compilation on windows ia32 in release mode
modified hindessm  /harmony/enhanced/classlib/trunk/make/properties.xml 02/26/2007 10:37:03
Adding aix properties.


Mime
View raw message