harmony-alerts mailing list archives

Site index · List index
Message view « Date » · « Thread »
Top « Date » · « Thread »
From ge...@apache.org
Subject [build-test alert] BUILD FAILED lnx gcc debug: classlib over drlvm
Date Sun, 04 Feb 2007 08:55:45 GMT
BUILD FAILED:
	Ant Error Message:
/home/geir/dev/apache/harmony/enhanced/buildtest/trunk/cc/projects/classlib/trunk/build.xml:167:
The following error occurred while executing this line: /home/geir/dev/apache/harmony/enhanced/buildtest/trunk/cc/projects/classlib/trunk/make/build-test.xml:138:
There were test errors.

Date of build:	02/04/2007 03:29:33
Time to build:	25 minutes 28 seconds
Last changed:	02/04/2007 03:15:49
Last log entry:	Apply patch HARMONY-2236 ([classlib][luni]the return value of File.lastModified()
losts its precision)


***********************************************************
Errors/Warnings:	(209)
            
Tests FAILED
Tests FAILED

***********************************************************
Unit Tests: (19453)
        
error: testDelegatedTask org.apache.harmony.xnet.provider.jsse.DelegatedTaskTest
error: testDigitalSignature_1 org.apache.harmony.xnet.provider.jsse.DigitalSignatureTest
error: testDigitalSignature_2 org.apache.harmony.xnet.provider.jsse.DigitalSignatureTest
error: testGetStatus org.apache.harmony.xnet.provider.jsse.HandshakeProtocolTest
error: testSendChangeCipherSpec org.apache.harmony.xnet.provider.jsse.HandshakeProtocolTest
error: testWrap org.apache.harmony.xnet.provider.jsse.HandshakeProtocolTest
error: testcomputerVerifyDataTLS org.apache.harmony.xnet.provider.jsse.HandshakeProtocolTest
error: testComputerReferenceVerifyDataSSLv3 org.apache.harmony.xnet.provider.jsse.HandshakeProtocolTest
error: testUnexpectedMessage org.apache.harmony.xnet.provider.jsse.HandshakeProtocolTest
error: testGetTask org.apache.harmony.xnet.provider.jsse.HandshakeProtocolTest
error: testKeyManagerImpl2 org.apache.harmony.xnet.provider.jsse.KeyManagerImplTest
error: testSelfInteraction org.apache.harmony.xnet.provider.jsse.SSLEngineImplTest
error: testHandshake org.apache.harmony.xnet.provider.jsse.SSLEngineImplTest
error: testSetGetNeedClientAuth org.apache.harmony.xnet.provider.jsse.SSLEngineImplTest
error: testSetGetWantClientAuth org.apache.harmony.xnet.provider.jsse.SSLEngineImplTest
error: testGetSupportedCipherSuites org.apache.harmony.xnet.provider.jsse.SSLEngineImplTest
error: testGetEnabledCipherSuites org.apache.harmony.xnet.provider.jsse.SSLEngineImplTest
error: testSetEnabledCipherSuites org.apache.harmony.xnet.provider.jsse.SSLEngineImplTest
error: testGetSupportedProtocols org.apache.harmony.xnet.provider.jsse.SSLEngineImplTest
error: testGetEnabledProtocols org.apache.harmony.xnet.provider.jsse.SSLEngineImplTest
error: testSetGetUseClientMode org.apache.harmony.xnet.provider.jsse.SSLEngineImplTest
error: testSetGetEnableSessionCreation org.apache.harmony.xnet.provider.jsse.SSLEngineImplTest
error: testGetSession org.apache.harmony.xnet.provider.jsse.SSLEngineImplTest
error: testBeginHandshake org.apache.harmony.xnet.provider.jsse.SSLEngineImplTest
error: testCloseOutbound org.apache.harmony.xnet.provider.jsse.SSLEngineImplTest
error: testCloseInbound org.apache.harmony.xnet.provider.jsse.SSLEngineImplTest
error: testCloseInbound2 org.apache.harmony.xnet.provider.jsse.SSLEngineImplTest
error: testErrorProcessing org.apache.harmony.xnet.provider.jsse.SSLEngineImplTest
error: testSSLServerSocketImpl1 org.apache.harmony.xnet.provider.jsse.SSLServerSocketImplTest
error: testSSLServerSocketImpl2 org.apache.harmony.xnet.provider.jsse.SSLServerSocketImplTest
error: testSSLServerSocketImpl3 org.apache.harmony.xnet.provider.jsse.SSLServerSocketImplTest
error: testSSLServerSocketImpl4 org.apache.harmony.xnet.provider.jsse.SSLServerSocketImplTest
error: testGetSupportedCipherSuites org.apache.harmony.xnet.provider.jsse.SSLServerSocketImplTest
error: testGetEnabledCipherSuites org.apache.harmony.xnet.provider.jsse.SSLServerSocketImplTest
error: testSetEnabledCipherSuites org.apache.harmony.xnet.provider.jsse.SSLServerSocketImplTest
error: testGetSupportedProtocols org.apache.harmony.xnet.provider.jsse.SSLServerSocketImplTest
error: testGetEnabledProtocols org.apache.harmony.xnet.provider.jsse.SSLServerSocketImplTest
error: testSetEnabledProtocols org.apache.harmony.xnet.provider.jsse.SSLServerSocketImplTest
error: testSetGetUseClientMode org.apache.harmony.xnet.provider.jsse.SSLServerSocketImplTest
error: testSetGetNeedClientAuth org.apache.harmony.xnet.provider.jsse.SSLServerSocketImplTest
error: testSetGetWantClientAuth org.apache.harmony.xnet.provider.jsse.SSLServerSocketImplTest
error: testSetGetEnableSessionCreation org.apache.harmony.xnet.provider.jsse.SSLServerSocketImplTest
error: testToString org.apache.harmony.xnet.provider.jsse.SSLServerSocketImplTest
error: testSocketCreation org.apache.harmony.xnet.provider.jsse.SSLSocketFactoriesTest
error: testGetSupportedCipherSuites1 org.apache.harmony.xnet.provider.jsse.SSLSocketFactoriesTest
error: testGetSupportedCipherSuites2 org.apache.harmony.xnet.provider.jsse.SSLSocketFactoriesTest
error: testGetDefaultCipherSuites1 org.apache.harmony.xnet.provider.jsse.SSLSocketFactoriesTest
error: testGetDefaultCipherSuites2 org.apache.harmony.xnet.provider.jsse.SSLSocketFactoriesTest
error: testContextInitialized2 org.apache.harmony.xnet.provider.jsse.SSLSocketFunctionalTest
error: testSSLSocketImpl1 org.apache.harmony.xnet.provider.jsse.SSLSocketImplTest
error: testSSLSocketImpl2 org.apache.harmony.xnet.provider.jsse.SSLSocketImplTest
error: testSSLSocketImpl3 org.apache.harmony.xnet.provider.jsse.SSLSocketImplTest
error: testSSLSocketImpl4 org.apache.harmony.xnet.provider.jsse.SSLSocketImplTest
error: testSSLSocketImpl5 org.apache.harmony.xnet.provider.jsse.SSLSocketImplTest
error: testGetSupportedCipherSuites org.apache.harmony.xnet.provider.jsse.SSLSocketImplTest
error: testGetEnabledCipherSuites org.apache.harmony.xnet.provider.jsse.SSLSocketImplTest
error: testSetEnabledCipherSuites org.apache.harmony.xnet.provider.jsse.SSLSocketImplTest
error: testGetSupportedProtocols org.apache.harmony.xnet.provider.jsse.SSLSocketImplTest
error: testGetEnabledProtocols org.apache.harmony.xnet.provider.jsse.SSLSocketImplTest
error: testSetEnabledProtocols org.apache.harmony.xnet.provider.jsse.SSLSocketImplTest
error: testSetGetUseClientMode org.apache.harmony.xnet.provider.jsse.SSLSocketImplTest
error: testSetGetNeedClientAuth org.apache.harmony.xnet.provider.jsse.SSLSocketImplTest
error: testSetGetWantClientAuth org.apache.harmony.xnet.provider.jsse.SSLSocketImplTest
error: testSetGetEnableSessionCreation org.apache.harmony.xnet.provider.jsse.SSLSocketImplTest
error: testGetSession org.apache.harmony.xnet.provider.jsse.SSLSocketImplTest
error: testAddRemoveHandshakeCompletedListener org.apache.harmony.xnet.provider.jsse.SSLSocketImplTest
error: testStartHandshake org.apache.harmony.xnet.provider.jsse.SSLSocketImplTest
error: testGetInputStream org.apache.harmony.xnet.provider.jsse.SSLSocketImplTest
error: testGetOutputStream org.apache.harmony.xnet.provider.jsse.SSLSocketImplTest
error: testSendUrgentData org.apache.harmony.xnet.provider.jsse.SSLSocketImplTest
error: testSetOOBInline org.apache.harmony.xnet.provider.jsse.SSLSocketImplTest
error: testShutdownOutput org.apache.harmony.xnet.provider.jsse.SSLSocketImplTest
error: testShutdownInput org.apache.harmony.xnet.provider.jsse.SSLSocketImplTest
error: testToString org.apache.harmony.xnet.provider.jsse.SSLSocketImplTest
error: testUnwrap org.apache.harmony.xnet.provider.jsse.ServerHandshakeImplTest
error: testServerHandshakeImpl org.apache.harmony.xnet.provider.jsse.ServerHandshakeImplTest
error: testTrustManagerImpl_2 org.apache.harmony.xnet.provider.jsse.TrustManagerImplTest
error: testSSLContext10 org.apache.harmony.xnet.tests.javax.net.ssl.SSLContext1Test
failure: testAddAttributeAnotherThread javax.swing.text.AbstractDocument_AbstractElement_MASNoLockTest
Unit Test Error Details:	(79)
                
Test: testDelegatedTaskClass: org.apache.harmony.xnet.provider.jsse.DelegatedTaskTestjava.lang.NoSuchMethodError:
org/apache/harmony/xnet/provider/jsse/SSLParameters.<init>([Ljavax/net/ssl/KeyManager;[Ljavax/net/ssl/TrustManager;Ljava/security/SecureRandom;Lorg/apache/harmony/xnet/provider/jsse/SSLSessionContextImpl;Lorg/apache/harmony/xnet/provider/jsse/SSLSessionContextImpl;)V
while resolving constant pool entry at index 27 in class org/apache/harmony/xnet/provider/jsse/DelegatedTaskTest
	at java.lang.reflect.VMReflection.invokeMethod(VMReflection.java)

Test: testDigitalSignature_1Class: org.apache.harmony.xnet.provider.jsse.DigitalSignatureTestjava.lang.NoClassDefFoundError:
org/apache/harmony/xnet/provider/jsse/JSSETestData

Test: testDigitalSignature_2Class: org.apache.harmony.xnet.provider.jsse.DigitalSignatureTestjava.lang.NoClassDefFoundError:
org/apache/harmony/xnet/provider/jsse/JSSETestData

Test: testGetStatusClass: org.apache.harmony.xnet.provider.jsse.HandshakeProtocolTestjava.lang.NoSuchMethodError:
org/apache/harmony/xnet/provider/jsse/SSLParameters.<init>([Ljavax/net/ssl/KeyManager;[Ljavax/net/ssl/TrustManager;Ljava/security/SecureRandom;Lorg/apache/harmony/xnet/provider/jsse/SSLSessionContextImpl;Lorg/apache/harmony/xnet/provider/jsse/SSLSessionContextImpl;)V
while resolving constant pool entry at index 27 in class org/apache/harmony/xnet/provider/jsse/HandshakeProtocolTest
	at java.lang.reflect.VMReflection.invokeMethod(VMReflection.java)

Test: testSendChangeCipherSpecClass: org.apache.harmony.xnet.provider.jsse.HandshakeProtocolTestjava.lang.NoSuchMethodError:
org/apache/harmony/xnet/provider/jsse/SSLParameters.<init>([Ljavax/net/ssl/KeyManager;[Ljavax/net/ssl/TrustManager;Ljava/security/SecureRandom;Lorg/apache/harmony/xnet/provider/jsse/SSLSessionContextImpl;Lorg/apache/harmony/xnet/provider/jsse/SSLSessionContextImpl;)V
while resolving constant pool entry at index 27 in class org/apache/harmony/xnet/provider/jsse/HandshakeProtocolTest
	at java.lang.reflect.VMReflection.invokeMethod(VMReflection.java)

Test: testWrapClass: org.apache.harmony.xnet.provider.jsse.HandshakeProtocolTestjava.lang.NoSuchMethodError:
org/apache/harmony/xnet/provider/jsse/SSLParameters.<init>([Ljavax/net/ssl/KeyManager;[Ljavax/net/ssl/TrustManager;Ljava/security/SecureRandom;Lorg/apache/harmony/xnet/provider/jsse/SSLSessionContextImpl;Lorg/apache/harmony/xnet/provider/jsse/SSLSessionContextImpl;)V
while resolving constant pool entry at index 27 in class org/apache/harmony/xnet/provider/jsse/HandshakeProtocolTest
	at java.lang.reflect.VMReflection.invokeMethod(VMReflection.java)

Test: testcomputerVerifyDataTLSClass: org.apache.harmony.xnet.provider.jsse.HandshakeProtocolTestjava.lang.NoSuchMethodError:
org/apache/harmony/xnet/provider/jsse/SSLParameters.<init>([Ljavax/net/ssl/KeyManager;[Ljavax/net/ssl/TrustManager;Ljava/security/SecureRandom;Lorg/apache/harmony/xnet/provider/jsse/SSLSessionContextImpl;Lorg/apache/harmony/xnet/provider/jsse/SSLSessionContextImpl;)V
while resolving constant pool entry at index 27 in class org/apache/harmony/xnet/provider/jsse/HandshakeProtocolTest
	at java.lang.reflect.VMReflection.invokeMethod(VMReflection.java)

Test: testComputerReferenceVerifyDataSSLv3Class: org.apache.harmony.xnet.provider.jsse.HandshakeProtocolTestjava.lang.NoSuchMethodError:
org/apache/harmony/xnet/provider/jsse/SSLParameters.<init>([Ljavax/net/ssl/KeyManager;[Ljavax/net/ssl/TrustManager;Ljava/security/SecureRandom;Lorg/apache/harmony/xnet/provider/jsse/SSLSessionContextImpl;Lorg/apache/harmony/xnet/provider/jsse/SSLSessionContextImpl;)V
while resolving constant pool entry at index 27 in class org/apache/harmony/xnet/provider/jsse/HandshakeProtocolTest
	at java.lang.reflect.VMReflection.invokeMethod(VMReflection.java)

Test: testUnexpectedMessageClass: org.apache.harmony.xnet.provider.jsse.HandshakeProtocolTestjava.lang.NoSuchMethodError:
org/apache/harmony/xnet/provider/jsse/SSLParameters.<init>([Ljavax/net/ssl/KeyManager;[Ljavax/net/ssl/TrustManager;Ljava/security/SecureRandom;Lorg/apache/harmony/xnet/provider/jsse/SSLSessionContextImpl;Lorg/apache/harmony/xnet/provider/jsse/SSLSessionContextImpl;)V
while resolving constant pool entry at index 27 in class org/apache/harmony/xnet/provider/jsse/HandshakeProtocolTest
	at java.lang.reflect.VMReflection.invokeMethod(VMReflection.java)

Test: testGetTaskClass: org.apache.harmony.xnet.provider.jsse.HandshakeProtocolTestjava.lang.NoSuchMethodError:
org/apache/harmony/xnet/provider/jsse/SSLParameters.<init>([Ljavax/net/ssl/KeyManager;[Ljavax/net/ssl/TrustManager;Ljava/security/SecureRandom;Lorg/apache/harmony/xnet/provider/jsse/SSLSessionContextImpl;Lorg/apache/harmony/xnet/provider/jsse/SSLSessionContextImpl;)V
while resolving constant pool entry at index 27 in class org/apache/harmony/xnet/provider/jsse/HandshakeProtocolTest
	at java.lang.reflect.VMReflection.invokeMethod(VMReflection.java)

Test: testKeyManagerImpl2Class: org.apache.harmony.xnet.provider.jsse.KeyManagerImplTestjava.lang.NoClassDefFoundError:
org/apache/harmony/xnet/provider/jsse/JSSETestData
	at java.lang.reflect.VMReflection.invokeMethod(VMReflection.java)

Test: testSelfInteractionClass: org.apache.harmony.xnet.provider.jsse.SSLEngineImplTestjava.lang.NoClassDefFoundError:
org/apache/harmony/xnet/provider/jsse/JSSETestData
	at org.apache.harmony.xnet.provider.jsse.SSLEngineImplTest.testSelfInteraction(SSLEngineImplTest.java:70)
	at java.lang.reflect.VMReflection.invokeMethod(VMReflection.java)

Test: testHandshakeClass: org.apache.harmony.xnet.provider.jsse.SSLEngineImplTestjava.lang.NoClassDefFoundError:
org/apache/harmony/xnet/provider/jsse/JSSETestData
	at org.apache.harmony.xnet.provider.jsse.SSLEngineImplTest.testSelfInteraction(SSLEngineImplTest.java:70)
	at java.lang.reflect.VMReflection.invokeMethod(VMReflection.java)

Test: testSetGetNeedClientAuthClass: org.apache.harmony.xnet.provider.jsse.SSLEngineImplTestjava.lang.NoClassDefFoundError:
org/apache/harmony/xnet/provider/jsse/JSSETestData
	at org.apache.harmony.xnet.provider.jsse.SSLEngineImplTest.testSelfInteraction(SSLEngineImplTest.java:70)
	at java.lang.reflect.VMReflection.invokeMethod(VMReflection.java)

Test: testSetGetWantClientAuthClass: org.apache.harmony.xnet.provider.jsse.SSLEngineImplTestjava.lang.NoClassDefFoundError:
org/apache/harmony/xnet/provider/jsse/JSSETestData
	at org.apache.harmony.xnet.provider.jsse.SSLEngineImplTest.testSelfInteraction(SSLEngineImplTest.java:70)
	at java.lang.reflect.VMReflection.invokeMethod(VMReflection.java)

Test: testGetSupportedCipherSuitesClass: org.apache.harmony.xnet.provider.jsse.SSLEngineImplTestjava.lang.NoClassDefFoundError:
org/apache/harmony/xnet/provider/jsse/JSSETestData
	at org.apache.harmony.xnet.provider.jsse.SSLEngineImplTest.testSelfInteraction(SSLEngineImplTest.java:70)
	at java.lang.reflect.VMReflection.invokeMethod(VMReflection.java)

Test: testGetEnabledCipherSuitesClass: org.apache.harmony.xnet.provider.jsse.SSLEngineImplTestjava.lang.NoClassDefFoundError:
org/apache/harmony/xnet/provider/jsse/JSSETestData
	at org.apache.harmony.xnet.provider.jsse.SSLEngineImplTest.testSelfInteraction(SSLEngineImplTest.java:70)
	at java.lang.reflect.VMReflection.invokeMethod(VMReflection.java)

Test: testSetEnabledCipherSuitesClass: org.apache.harmony.xnet.provider.jsse.SSLEngineImplTestjava.lang.NoClassDefFoundError:
org/apache/harmony/xnet/provider/jsse/JSSETestData
	at org.apache.harmony.xnet.provider.jsse.SSLEngineImplTest.testSelfInteraction(SSLEngineImplTest.java:70)
	at java.lang.reflect.VMReflection.invokeMethod(VMReflection.java)

Test: testGetSupportedProtocolsClass: org.apache.harmony.xnet.provider.jsse.SSLEngineImplTestjava.lang.NoClassDefFoundError:
org/apache/harmony/xnet/provider/jsse/JSSETestData
	at org.apache.harmony.xnet.provider.jsse.SSLEngineImplTest.testSelfInteraction(SSLEngineImplTest.java:70)
	at java.lang.reflect.VMReflection.invokeMethod(VMReflection.java)

Test: testGetEnabledProtocolsClass: org.apache.harmony.xnet.provider.jsse.SSLEngineImplTestjava.lang.NoClassDefFoundError:
org/apache/harmony/xnet/provider/jsse/JSSETestData
	at org.apache.harmony.xnet.provider.jsse.SSLEngineImplTest.testSelfInteraction(SSLEngineImplTest.java:70)
	at java.lang.reflect.VMReflection.invokeMethod(VMReflection.java)

Test: testSetGetUseClientModeClass: org.apache.harmony.xnet.provider.jsse.SSLEngineImplTestjava.lang.NoClassDefFoundError:
org/apache/harmony/xnet/provider/jsse/JSSETestData
	at org.apache.harmony.xnet.provider.jsse.SSLEngineImplTest.testSelfInteraction(SSLEngineImplTest.java:70)
	at java.lang.reflect.VMReflection.invokeMethod(VMReflection.java)

Test: testSetGetEnableSessionCreationClass: org.apache.harmony.xnet.provider.jsse.SSLEngineImplTestjava.lang.NoClassDefFoundError:
org/apache/harmony/xnet/provider/jsse/JSSETestData
	at org.apache.harmony.xnet.provider.jsse.SSLEngineImplTest.testSelfInteraction(SSLEngineImplTest.java:70)
	at java.lang.reflect.VMReflection.invokeMethod(VMReflection.java)

Test: testGetSessionClass: org.apache.harmony.xnet.provider.jsse.SSLEngineImplTestjava.lang.NoClassDefFoundError:
org/apache/harmony/xnet/provider/jsse/JSSETestData
	at org.apache.harmony.xnet.provider.jsse.SSLEngineImplTest.testSelfInteraction(SSLEngineImplTest.java:70)
	at java.lang.reflect.VMReflection.invokeMethod(VMReflection.java)

Test: testBeginHandshakeClass: org.apache.harmony.xnet.provider.jsse.SSLEngineImplTestjava.lang.NoClassDefFoundError:
org/apache/harmony/xnet/provider/jsse/JSSETestData
	at org.apache.harmony.xnet.provider.jsse.SSLEngineImplTest.testSelfInteraction(SSLEngineImplTest.java:70)
	at java.lang.reflect.VMReflection.invokeMethod(VMReflection.java)

Test: testCloseOutboundClass: org.apache.harmony.xnet.provider.jsse.SSLEngineImplTestjava.lang.NoClassDefFoundError:
org/apache/harmony/xnet/provider/jsse/JSSETestData
	at org.apache.harmony.xnet.provider.jsse.SSLEngineImplTest.testSelfInteraction(SSLEngineImplTest.java:70)
	at java.lang.reflect.VMReflection.invokeMethod(VMReflection.java)

Test: testCloseInboundClass: org.apache.harmony.xnet.provider.jsse.SSLEngineImplTestjava.lang.NoClassDefFoundError:
org/apache/harmony/xnet/provider/jsse/JSSETestData
	at org.apache.harmony.xnet.provider.jsse.SSLEngineImplTest.testSelfInteraction(SSLEngineImplTest.java:70)
	at java.lang.reflect.VMReflection.invokeMethod(VMReflection.java)

Test: testCloseInbound2Class: org.apache.harmony.xnet.provider.jsse.SSLEngineImplTestjava.lang.NoClassDefFoundError:
org/apache/harmony/xnet/provider/jsse/JSSETestData
	at org.apache.harmony.xnet.provider.jsse.SSLEngineImplTest.testSelfInteraction(SSLEngineImplTest.java:70)
	at java.lang.reflect.VMReflection.invokeMethod(VMReflection.java)

Test: testErrorProcessingClass: org.apache.harmony.xnet.provider.jsse.SSLEngineImplTestjava.lang.NoClassDefFoundError:
org/apache/harmony/xnet/provider/jsse/JSSETestData
	at org.apache.harmony.xnet.provider.jsse.SSLEngineImplTest.testSelfInteraction(SSLEngineImplTest.java:70)
	at java.lang.reflect.VMReflection.invokeMethod(VMReflection.java)

Test: testSSLServerSocketImpl1Class: org.apache.harmony.xnet.provider.jsse.SSLServerSocketImplTestjava.lang.NoClassDefFoundError:
org/apache/harmony/xnet/provider/jsse/JSSETestData
	at java.lang.reflect.VMReflection.invokeMethod(VMReflection.java)

Test: testSSLServerSocketImpl2Class: org.apache.harmony.xnet.provider.jsse.SSLServerSocketImplTestjava.lang.NoClassDefFoundError:
org/apache/harmony/xnet/provider/jsse/JSSETestData
	at java.lang.reflect.VMReflection.invokeMethod(VMReflection.java)

Test: testSSLServerSocketImpl3Class: org.apache.harmony.xnet.provider.jsse.SSLServerSocketImplTestjava.lang.NoClassDefFoundError:
org/apache/harmony/xnet/provider/jsse/JSSETestData
	at java.lang.reflect.VMReflection.invokeMethod(VMReflection.java)

Test: testSSLServerSocketImpl4Class: org.apache.harmony.xnet.provider.jsse.SSLServerSocketImplTestjava.lang.NoClassDefFoundError:
org/apache/harmony/xnet/provider/jsse/JSSETestData
	at java.lang.reflect.VMReflection.invokeMethod(VMReflection.java)

Test: testGetSupportedCipherSuitesClass: org.apache.harmony.xnet.provider.jsse.SSLServerSocketImplTestjava.lang.NoClassDefFoundError:
org/apache/harmony/xnet/provider/jsse/JSSETestData
	at java.lang.reflect.VMReflection.invokeMethod(VMReflection.java)

Test: testGetEnabledCipherSuitesClass: org.apache.harmony.xnet.provider.jsse.SSLServerSocketImplTestjava.lang.NoClassDefFoundError:
org/apache/harmony/xnet/provider/jsse/JSSETestData
	at java.lang.reflect.VMReflection.invokeMethod(VMReflection.java)

Test: testSetEnabledCipherSuitesClass: org.apache.harmony.xnet.provider.jsse.SSLServerSocketImplTestjava.lang.NoClassDefFoundError:
org/apache/harmony/xnet/provider/jsse/JSSETestData
	at java.lang.reflect.VMReflection.invokeMethod(VMReflection.java)

Test: testGetSupportedProtocolsClass: org.apache.harmony.xnet.provider.jsse.SSLServerSocketImplTestjava.lang.NoClassDefFoundError:
org/apache/harmony/xnet/provider/jsse/JSSETestData
	at java.lang.reflect.VMReflection.invokeMethod(VMReflection.java)

Test: testGetEnabledProtocolsClass: org.apache.harmony.xnet.provider.jsse.SSLServerSocketImplTestjava.lang.NoClassDefFoundError:
org/apache/harmony/xnet/provider/jsse/JSSETestData
	at java.lang.reflect.VMReflection.invokeMethod(VMReflection.java)

Test: testSetEnabledProtocolsClass: org.apache.harmony.xnet.provider.jsse.SSLServerSocketImplTestjava.lang.NoClassDefFoundError:
org/apache/harmony/xnet/provider/jsse/JSSETestData
	at java.lang.reflect.VMReflection.invokeMethod(VMReflection.java)

Test: testSetGetUseClientModeClass: org.apache.harmony.xnet.provider.jsse.SSLServerSocketImplTestjava.lang.NoClassDefFoundError:
org/apache/harmony/xnet/provider/jsse/JSSETestData
	at java.lang.reflect.VMReflection.invokeMethod(VMReflection.java)

Test: testSetGetNeedClientAuthClass: org.apache.harmony.xnet.provider.jsse.SSLServerSocketImplTestjava.lang.NoClassDefFoundError:
org/apache/harmony/xnet/provider/jsse/JSSETestData
	at java.lang.reflect.VMReflection.invokeMethod(VMReflection.java)

Test: testSetGetWantClientAuthClass: org.apache.harmony.xnet.provider.jsse.SSLServerSocketImplTestjava.lang.NoClassDefFoundError:
org/apache/harmony/xnet/provider/jsse/JSSETestData
	at java.lang.reflect.VMReflection.invokeMethod(VMReflection.java)

Test: testSetGetEnableSessionCreationClass: org.apache.harmony.xnet.provider.jsse.SSLServerSocketImplTestjava.lang.NoClassDefFoundError:
org/apache/harmony/xnet/provider/jsse/JSSETestData
	at java.lang.reflect.VMReflection.invokeMethod(VMReflection.java)

Test: testToStringClass: org.apache.harmony.xnet.provider.jsse.SSLServerSocketImplTestjava.lang.NoClassDefFoundError:
org/apache/harmony/xnet/provider/jsse/JSSETestData
	at java.lang.reflect.VMReflection.invokeMethod(VMReflection.java)

Test: testSocketCreationClass: org.apache.harmony.xnet.provider.jsse.SSLSocketFactoriesTestjava.lang.NoClassDefFoundError:
org/apache/harmony/xnet/provider/jsse/JSSETestData
	at java.lang.reflect.VMReflection.invokeMethod(VMReflection.java)

Test: testGetSupportedCipherSuites1Class: org.apache.harmony.xnet.provider.jsse.SSLSocketFactoriesTestjava.lang.NoClassDefFoundError:
org/apache/harmony/xnet/provider/jsse/JSSETestData
	at java.lang.reflect.VMReflection.invokeMethod(VMReflection.java)

Test: testGetSupportedCipherSuites2Class: org.apache.harmony.xnet.provider.jsse.SSLSocketFactoriesTestjava.lang.NoClassDefFoundError:
org/apache/harmony/xnet/provider/jsse/JSSETestData
	at java.lang.reflect.VMReflection.invokeMethod(VMReflection.java)

Test: testGetDefaultCipherSuites1Class: org.apache.harmony.xnet.provider.jsse.SSLSocketFactoriesTestjava.lang.NoClassDefFoundError:
org/apache/harmony/xnet/provider/jsse/JSSETestData
	at java.lang.reflect.VMReflection.invokeMethod(VMReflection.java)

Test: testGetDefaultCipherSuites2Class: org.apache.harmony.xnet.provider.jsse.SSLSocketFactoriesTestjava.lang.NoClassDefFoundError:
org/apache/harmony/xnet/provider/jsse/JSSETestData
	at java.lang.reflect.VMReflection.invokeMethod(VMReflection.java)

Test: testContextInitialized2Class: org.apache.harmony.xnet.provider.jsse.SSLSocketFunctionalTestjava.lang.NoClassDefFoundError:
org/apache/harmony/xnet/provider/jsse/JSSETestData
	at java.lang.reflect.VMReflection.invokeMethod(VMReflection.java)

Test: testSSLSocketImpl1Class: org.apache.harmony.xnet.provider.jsse.SSLSocketImplTestjava.lang.NoClassDefFoundError:
org/apache/harmony/xnet/provider/jsse/JSSETestData
	at java.lang.reflect.VMReflection.invokeMethod(VMReflection.java)

Test: testSSLSocketImpl2Class: org.apache.harmony.xnet.provider.jsse.SSLSocketImplTestjava.lang.NoClassDefFoundError:
org/apache/harmony/xnet/provider/jsse/JSSETestData
	at java.lang.reflect.VMReflection.invokeMethod(VMReflection.java)

Test: testSSLSocketImpl3Class: org.apache.harmony.xnet.provider.jsse.SSLSocketImplTestjava.lang.NoClassDefFoundError:
org/apache/harmony/xnet/provider/jsse/JSSETestData
	at java.lang.reflect.VMReflection.invokeMethod(VMReflection.java)

Test: testSSLSocketImpl4Class: org.apache.harmony.xnet.provider.jsse.SSLSocketImplTestjava.lang.NoClassDefFoundError:
org/apache/harmony/xnet/provider/jsse/JSSETestData
	at java.lang.reflect.VMReflection.invokeMethod(VMReflection.java)

Test: testSSLSocketImpl5Class: org.apache.harmony.xnet.provider.jsse.SSLSocketImplTestjava.lang.NoClassDefFoundError:
org/apache/harmony/xnet/provider/jsse/JSSETestData
	at java.lang.reflect.VMReflection.invokeMethod(VMReflection.java)

Test: testGetSupportedCipherSuitesClass: org.apache.harmony.xnet.provider.jsse.SSLSocketImplTestjava.lang.NoClassDefFoundError:
org/apache/harmony/xnet/provider/jsse/JSSETestData
	at java.lang.reflect.VMReflection.invokeMethod(VMReflection.java)

Test: testGetEnabledCipherSuitesClass: org.apache.harmony.xnet.provider.jsse.SSLSocketImplTestjava.lang.NoClassDefFoundError:
org/apache/harmony/xnet/provider/jsse/JSSETestData
	at java.lang.reflect.VMReflection.invokeMethod(VMReflection.java)

Test: testSetEnabledCipherSuitesClass: org.apache.harmony.xnet.provider.jsse.SSLSocketImplTestjava.lang.NoClassDefFoundError:
org/apache/harmony/xnet/provider/jsse/JSSETestData
	at java.lang.reflect.VMReflection.invokeMethod(VMReflection.java)

Test: testGetSupportedProtocolsClass: org.apache.harmony.xnet.provider.jsse.SSLSocketImplTestjava.lang.NoClassDefFoundError:
org/apache/harmony/xnet/provider/jsse/JSSETestData
	at java.lang.reflect.VMReflection.invokeMethod(VMReflection.java)

Test: testGetEnabledProtocolsClass: org.apache.harmony.xnet.provider.jsse.SSLSocketImplTestjava.lang.NoClassDefFoundError:
org/apache/harmony/xnet/provider/jsse/JSSETestData
	at java.lang.reflect.VMReflection.invokeMethod(VMReflection.java)

Test: testSetEnabledProtocolsClass: org.apache.harmony.xnet.provider.jsse.SSLSocketImplTestjava.lang.NoClassDefFoundError:
org/apache/harmony/xnet/provider/jsse/JSSETestData
	at java.lang.reflect.VMReflection.invokeMethod(VMReflection.java)

Test: testSetGetUseClientModeClass: org.apache.harmony.xnet.provider.jsse.SSLSocketImplTestjava.lang.NoClassDefFoundError:
org/apache/harmony/xnet/provider/jsse/JSSETestData
	at java.lang.reflect.VMReflection.invokeMethod(VMReflection.java)

Test: testSetGetNeedClientAuthClass: org.apache.harmony.xnet.provider.jsse.SSLSocketImplTestjava.lang.NoClassDefFoundError:
org/apache/harmony/xnet/provider/jsse/JSSETestData
	at java.lang.reflect.VMReflection.invokeMethod(VMReflection.java)

Test: testSetGetWantClientAuthClass: org.apache.harmony.xnet.provider.jsse.SSLSocketImplTestjava.lang.NoClassDefFoundError:
org/apache/harmony/xnet/provider/jsse/JSSETestData
	at java.lang.reflect.VMReflection.invokeMethod(VMReflection.java)

Test: testSetGetEnableSessionCreationClass: org.apache.harmony.xnet.provider.jsse.SSLSocketImplTestjava.lang.NoClassDefFoundError:
org/apache/harmony/xnet/provider/jsse/JSSETestData
	at java.lang.reflect.VMReflection.invokeMethod(VMReflection.java)

Test: testGetSessionClass: org.apache.harmony.xnet.provider.jsse.SSLSocketImplTestjava.lang.NoClassDefFoundError:
org/apache/harmony/xnet/provider/jsse/JSSETestData
	at java.lang.reflect.VMReflection.invokeMethod(VMReflection.java)

Test: testAddRemoveHandshakeCompletedListenerClass: org.apache.harmony.xnet.provider.jsse.SSLSocketImplTestjava.lang.NoClassDefFoundError:
org/apache/harmony/xnet/provider/jsse/JSSETestData
	at java.lang.reflect.VMReflection.invokeMethod(VMReflection.java)

Test: testStartHandshakeClass: org.apache.harmony.xnet.provider.jsse.SSLSocketImplTestjava.lang.NoClassDefFoundError:
org/apache/harmony/xnet/provider/jsse/JSSETestData
	at java.lang.reflect.VMReflection.invokeMethod(VMReflection.java)

Test: testGetInputStreamClass: org.apache.harmony.xnet.provider.jsse.SSLSocketImplTestjava.lang.NoClassDefFoundError:
org/apache/harmony/xnet/provider/jsse/JSSETestData
	at java.lang.reflect.VMReflection.invokeMethod(VMReflection.java)

Test: testGetOutputStreamClass: org.apache.harmony.xnet.provider.jsse.SSLSocketImplTestjava.lang.NoClassDefFoundError:
org/apache/harmony/xnet/provider/jsse/JSSETestData
	at java.lang.reflect.VMReflection.invokeMethod(VMReflection.java)

Test: testSendUrgentDataClass: org.apache.harmony.xnet.provider.jsse.SSLSocketImplTestjava.lang.NoClassDefFoundError:
org/apache/harmony/xnet/provider/jsse/JSSETestData
	at java.lang.reflect.VMReflection.invokeMethod(VMReflection.java)

Test: testSetOOBInlineClass: org.apache.harmony.xnet.provider.jsse.SSLSocketImplTestjava.lang.NoClassDefFoundError:
org/apache/harmony/xnet/provider/jsse/JSSETestData
	at java.lang.reflect.VMReflection.invokeMethod(VMReflection.java)

Test: testShutdownOutputClass: org.apache.harmony.xnet.provider.jsse.SSLSocketImplTestjava.lang.NoClassDefFoundError:
org/apache/harmony/xnet/provider/jsse/JSSETestData
	at java.lang.reflect.VMReflection.invokeMethod(VMReflection.java)

Test: testShutdownInputClass: org.apache.harmony.xnet.provider.jsse.SSLSocketImplTestjava.lang.NoClassDefFoundError:
org/apache/harmony/xnet/provider/jsse/JSSETestData
	at java.lang.reflect.VMReflection.invokeMethod(VMReflection.java)

Test: testToStringClass: org.apache.harmony.xnet.provider.jsse.SSLSocketImplTestjava.lang.NoClassDefFoundError:
org/apache/harmony/xnet/provider/jsse/JSSETestData
	at java.lang.reflect.VMReflection.invokeMethod(VMReflection.java)

Test: testUnwrapClass: org.apache.harmony.xnet.provider.jsse.ServerHandshakeImplTestjava.lang.NoClassDefFoundError:
org/apache/harmony/xnet/provider/jsse/JSSETestData

Test: testServerHandshakeImplClass: org.apache.harmony.xnet.provider.jsse.ServerHandshakeImplTestjava.lang.NoClassDefFoundError:
org/apache/harmony/xnet/provider/jsse/JSSETestData

Test: testTrustManagerImpl_2Class: org.apache.harmony.xnet.provider.jsse.TrustManagerImplTestjava.lang.NoClassDefFoundError:
org/apache/harmony/xnet/provider/jsse/JSSETestData
	at java.lang.reflect.VMReflection.invokeMethod(VMReflection.java)

Test: testSSLContext10Class: org.apache.harmony.xnet.tests.javax.net.ssl.SSLContext1Testjava.lang.NullPointerException
	at org.apache.harmony.xnet.provider.jsse.SSLContextImpl.engineGetClientSessionContext(SSLContextImpl.java)
	at javax.net.ssl.SSLContext.getClientSessionContext(SSLContext.java)
	at org.apache.harmony.xnet.tests.javax.net.ssl.SSLContext1Test.testSSLContext10(SSLContext1Test.java:318)
	at java.lang.reflect.VMReflection.invokeMethod(VMReflection.java)

Test: testAddAttributeAnotherThreadClass: javax.swing.text.AbstractDocument_AbstractElement_MASNoLockTestjunit.framework.AssertionFailedError
	at javax.swing.text.AbstractDocument_AbstractElement_MASNoLockTest.testAddAttributeAnotherThread(AbstractDocument_AbstractElement_MASNoLockTest.java:157)
	at java.lang.reflect.VMReflection.invokeMethod(VMReflection.java)


***********************************************************
Modifications since last successful build:	(49)
            
modified tellison  /harmony/enhanced/classlib/trunk/modules/luni/src/main/java/java/io/File.java
02/04/2007 03:15:49 Apply patch HARMONY-2236 ([classlib][luni]the return value of File.lastModified()
losts its precision)
modified tellison  /harmony/enhanced/classlib/trunk/modules/portlib/src/main/native/port/windows/hyfile.c
02/04/2007 03:15:49 Apply patch HARMONY-2236 ([classlib][luni]the return value of File.lastModified()
losts its precision)
modified tellison  /harmony/enhanced/classlib/trunk/modules/portlib/src/main/native/port/unix/hyfile.c
02/04/2007 03:15:49 Apply patch HARMONY-2236 ([classlib][luni]the return value of File.lastModified()
losts its precision)
add cc-classlib log20070204031451Lbuild.47 02/04/2007 03:14:51classlib
added tellison  /harmony/enhanced/classlib/trunk/modules/x-net/src/test/api/java/org/apache/harmony/xnet/tests/javax/net/ssl/SSLContext1Test.java
02/04/2007 03:10:09 Apply contribution HARMONY-2371 ([classlib][x-net]JSSE provider tests
contribution)
added tellison  /harmony/enhanced/classlib/trunk/modules/x-net/src/test/support 02/04/2007
03:10:09 Apply contribution HARMONY-2371 ([classlib][x-net]JSSE provider tests contribution)
added tellison  /harmony/enhanced/classlib/trunk/modules/x-net/src/test/support/common/java/org
02/04/2007 03:10:09 Apply contribution HARMONY-2371 ([classlib][x-net]JSSE provider tests
contribution)
added tellison  /harmony/enhanced/classlib/trunk/modules/x-net/src/test/api/java/org/apache/harmony/xnet/tests/javax/net/ssl/KeyManagerFactory2Test.java
02/04/2007 03:10:09 Apply contribution HARMONY-2371 ([classlib][x-net]JSSE provider tests
contribution)
added tellison  /harmony/enhanced/classlib/trunk/modules/x-net/src/test/support/common/java/org/apache/harmony/xnet/tests/support/MyTrustManagerFactorySpi.java
02/04/2007 03:10:09 Apply contribution HARMONY-2371 ([classlib][x-net]JSSE provider tests
contribution)
added tellison  /harmony/enhanced/classlib/trunk/modules/x-net/src/test/support/common/java/org/apache/harmony/xnet/tests/support/MySSLContextSpi.java
02/04/2007 03:10:09 Apply contribution HARMONY-2371 ([classlib][x-net]JSSE provider tests
contribution)
added tellison  /harmony/enhanced/classlib/trunk/modules/x-net/src/test/support/common/java/org/apache/harmony/xnet/tests/support/MyKeyManagerFactorySpi.java
02/04/2007 03:10:09 Apply contribution HARMONY-2371 ([classlib][x-net]JSSE provider tests
contribution)
added tellison  /harmony/enhanced/classlib/trunk/modules/x-net/src/test/impl/java.injected/org/apache/harmony/xnet/provider/jsse/SSLSocketImplTest.java
02/04/2007 03:10:09 Apply contribution HARMONY-2371 ([classlib][x-net]JSSE provider tests
contribution)
added tellison  /harmony/enhanced/classlib/trunk/modules/x-net/src/test/impl/java.injected/org/apache/harmony/xnet/provider/jsse/SSLSessionContextImplTest.java
02/04/2007 03:10:09 Apply contribution HARMONY-2371 ([classlib][x-net]JSSE provider tests
contribution)
added tellison  /harmony/enhanced/classlib/trunk/modules/x-net/src/test/impl/java.injected/org/apache/harmony/xnet/provider/jsse/SSLSocketFunctionalTest.java
02/04/2007 03:10:09 Apply contribution HARMONY-2371 ([classlib][x-net]JSSE provider tests
contribution)
added tellison  /harmony/enhanced/classlib/trunk/modules/x-net/src/test/impl/java.injected/org/apache/harmony/xnet/provider/jsse/TrustManagerImplTest.java
02/04/2007 03:10:09 Apply contribution HARMONY-2371 ([classlib][x-net]JSSE provider tests
contribution)
added tellison  /harmony/enhanced/classlib/trunk/modules/x-net/src/test/impl/java.injected/org/apache/harmony/xnet/provider/jsse/DigitalSignatureTest.java
02/04/2007 03:10:09 Apply contribution HARMONY-2371 ([classlib][x-net]JSSE provider tests
contribution)
modified tellison  /harmony/enhanced/classlib/trunk/modules/x-net/build.xml 02/04/2007 03:10:09
Apply contribution HARMONY-2371 ([classlib][x-net]JSSE provider tests contribution)
added tellison  /harmony/enhanced/classlib/trunk/modules/x-net/src/test/impl/java.injected/org/apache/harmony/xnet/provider/jsse/DelegatedTaskTest.java
02/04/2007 03:10:09 Apply contribution HARMONY-2371 ([classlib][x-net]JSSE provider tests
contribution)
added tellison  /harmony/enhanced/classlib/trunk/modules/x-net/src/test/support/common/java/org/apache/harmony/xnet/tests
02/04/2007 03:10:09 Apply contribution HARMONY-2371 ([classlib][x-net]JSSE provider tests
contribution)
modified tellison  /harmony/enhanced/classlib/trunk/modules/x-net/src/main/java/org/apache/harmony/xnet/provider/jsse/SSLParameters.java
02/04/2007 03:10:09 Apply contribution HARMONY-2371 ([classlib][x-net]JSSE provider tests
contribution)
added tellison  /harmony/enhanced/classlib/trunk/modules/x-net/src/test/impl/java.injected/org/apache/harmony/xnet/provider/jsse/KeyManagerImplTest.java
02/04/2007 03:10:09 Apply contribution HARMONY-2371 ([classlib][x-net]JSSE provider tests
contribution)
added tellison  /harmony/enhanced/classlib/trunk/modules/x-net/src/test/support/common/java/org/apache
02/04/2007 03:10:09 Apply contribution HARMONY-2371 ([classlib][x-net]JSSE provider tests
contribution)
added tellison  /harmony/enhanced/classlib/trunk/modules/x-net/src/test/impl/java.injected/org/apache/harmony/xnet/provider/jsse/SSLSocketFactoriesTest.java
02/04/2007 03:10:09 Apply contribution HARMONY-2371 ([classlib][x-net]JSSE provider tests
contribution)
added tellison  /harmony/enhanced/classlib/trunk/modules/x-net/src/test/impl/java/org/apache/harmony/xnet/tests/provider/jsse/KeyManagerFactoryImplTest.java
02/04/2007 03:10:09 Apply contribution HARMONY-2371 ([classlib][x-net]JSSE provider tests
contribution)
added tellison  /harmony/enhanced/classlib/trunk/modules/x-net/src/test/support/common 02/04/2007
03:10:09 Apply contribution HARMONY-2371 ([classlib][x-net]JSSE provider tests contribution)
added tellison  /harmony/enhanced/classlib/trunk/modules/x-net/src/test/api/java/org/apache/harmony/xnet/tests/javax/net/ssl/TrustManagerFactory1Test.java
02/04/2007 03:10:09 Apply contribution HARMONY-2371 ([classlib][x-net]JSSE provider tests
contribution)
added tellison  /harmony/enhanced/classlib/trunk/modules/x-net/src/test/support/common/java/org/apache/harmony/xnet/tests/support
02/04/2007 03:10:09 Apply contribution HARMONY-2371 ([classlib][x-net]JSSE provider tests
contribution)
added tellison  /harmony/enhanced/classlib/trunk/modules/x-net/src/test/api/java/org/apache/harmony/xnet/tests/javax/net/ssl/SSLContext2Test.java
02/04/2007 03:10:09 Apply contribution HARMONY-2371 ([classlib][x-net]JSSE provider tests
contribution)
added tellison  /harmony/enhanced/classlib/trunk/modules/x-net/src/test/impl/java.injected/org/apache/harmony/xnet/provider/jsse/SSLServerSocketImplTest.java
02/04/2007 03:10:09 Apply contribution HARMONY-2371 ([classlib][x-net]JSSE provider tests
contribution)
added tellison  /harmony/enhanced/classlib/trunk/modules/x-net/src/test/support/common/java/org/apache/harmony
02/04/2007 03:10:09 Apply contribution HARMONY-2371 ([classlib][x-net]JSSE provider tests
contribution)
added tellison  /harmony/enhanced/classlib/trunk/modules/x-net/src/test/impl/java.injected/org/apache/harmony/xnet/provider/jsse/CipherSuiteTest.java
02/04/2007 03:10:09 Apply contribution HARMONY-2371 ([classlib][x-net]JSSE provider tests
contribution)
added tellison  /harmony/enhanced/classlib/trunk/modules/x-net/src/test/api/java/org/apache/harmony/xnet/tests/javax/net/ssl/KeyManagerFactory1Test.java
02/04/2007 03:10:09 Apply contribution HARMONY-2371 ([classlib][x-net]JSSE provider tests
contribution)
added tellison  /harmony/enhanced/classlib/trunk/modules/x-net/src/test/impl/java/org/apache/harmony/xnet/tests/provider/jsse/ProtocolVersionTest.java
02/04/2007 03:10:09 Apply contribution HARMONY-2371 ([classlib][x-net]JSSE provider tests
contribution)
added tellison  /harmony/enhanced/classlib/trunk/modules/x-net/src/test/impl/java.injected/org/apache/harmony/xnet/provider/jsse/SSLSessionImplTest.java
02/04/2007 03:10:09 Apply contribution HARMONY-2371 ([classlib][x-net]JSSE provider tests
contribution)
added tellison  /harmony/enhanced/classlib/trunk/modules/x-net/src/test/support/common/java/org/apache/harmony/xnet/provider
02/04/2007 03:10:09 Apply contribution HARMONY-2371 ([classlib][x-net]JSSE provider tests
contribution)
added tellison  /harmony/enhanced/classlib/trunk/modules/x-net/src/test/support/common/java
02/04/2007 03:10:09 Apply contribution HARMONY-2371 ([classlib][x-net]JSSE provider tests
contribution)
added tellison  /harmony/enhanced/classlib/trunk/modules/x-net/src/test/impl/java.injected/org/apache/harmony/xnet/provider/jsse/ServerHandshakeImplTest.java
02/04/2007 03:10:09 Apply contribution HARMONY-2371 ([classlib][x-net]JSSE provider tests
contribution)
added tellison  /harmony/enhanced/classlib/trunk/modules/x-net/src/test/support/common/java/org/apache/harmony/xnet/provider/jsse
02/04/2007 03:10:09 Apply contribution HARMONY-2371 ([classlib][x-net]JSSE provider tests
contribution)
added tellison  /harmony/enhanced/classlib/trunk/modules/x-net/src/test/support/common/java/org/apache/harmony/xnet
02/04/2007 03:10:09 Apply contribution HARMONY-2371 ([classlib][x-net]JSSE provider tests
contribution)
modified tellison  /harmony/enhanced/classlib/trunk/modules/x-net/.classpath 02/04/2007 03:10:09
Apply contribution HARMONY-2371 ([classlib][x-net]JSSE provider tests contribution)
added tellison  /harmony/enhanced/classlib/trunk/modules/x-net/src/test/impl/java/org/apache/harmony/xnet/tests/provider/jsse/TrustManagerFactoryImplTest.java
02/04/2007 03:10:09 Apply contribution HARMONY-2371 ([classlib][x-net]JSSE provider tests
contribution)
added tellison  /harmony/enhanced/classlib/trunk/modules/x-net/src/test/resources/key_store.bks
02/04/2007 03:10:09 Apply contribution HARMONY-2371 ([classlib][x-net]JSSE provider tests
contribution)
added tellison  /harmony/enhanced/classlib/trunk/modules/x-net/src/test/impl/java.injected/org/apache/harmony/xnet/provider/jsse/SSLStreamedInputTest.java
02/04/2007 03:10:09 Apply contribution HARMONY-2371 ([classlib][x-net]JSSE provider tests
contribution)
added tellison  /harmony/enhanced/classlib/trunk/modules/x-net/src/test/impl/java.injected/org/apache/harmony/xnet/provider/jsse/HandshakeProtocolTest.java
02/04/2007 03:10:09 Apply contribution HARMONY-2371 ([classlib][x-net]JSSE provider tests
contribution)
modified tellison  /harmony/enhanced/classlib/trunk/modules/x-net/src/main/java/org/apache/harmony/xnet/provider/jsse/SSLContextImpl.java
02/04/2007 03:10:09 Apply contribution HARMONY-2371 ([classlib][x-net]JSSE provider tests
contribution)
added tellison  /harmony/enhanced/classlib/trunk/modules/x-net/src/test/impl/java.injected/org/apache/harmony/xnet/provider/jsse/SSLEngineImplTest.java
02/04/2007 03:10:09 Apply contribution HARMONY-2371 ([classlib][x-net]JSSE provider tests
contribution)
modified tellison  /harmony/enhanced/classlib/trunk/modules/x-net/META-INF/MANIFEST.MF 02/04/2007
03:10:09 Apply contribution HARMONY-2371 ([classlib][x-net]JSSE provider tests contribution)
added tellison  /harmony/enhanced/classlib/trunk/modules/x-net/src/test/support/common/java/org/apache/harmony/xnet/provider/jsse/JSSETestData.java
02/04/2007 03:10:09 Apply contribution HARMONY-2371 ([classlib][x-net]JSSE provider tests
contribution)
added tellison  /harmony/enhanced/classlib/trunk/modules/x-net/src/test/api/java/org/apache/harmony/xnet/tests/javax/net/ssl/TrustManagerFactory2Test.java
02/04/2007 03:10:09 Apply contribution HARMONY-2371 ([classlib][x-net]JSSE provider tests
contribution)


Mime
View raw message