harmony-alerts mailing list archives: January 2007

Site index · List index
Message list« Previous · 1 · 2 · 3 · 4 · 5 · Next »Thread · Author · Date
ge...@apache.org [build-test alert] BUILD FAILED lnx gcc debug: classlib over drlvm Sun, 28 Jan, 16:15
ge...@apache.org [build-test alert] BUILD SUCCEEDED lnx gcc debug: classlib Sun, 28 Jan, 16:24
ge...@apache.org [build-test alert] BUILD SUCCEEDED lnx gcc debug: drlvm Sun, 28 Jan, 16:33
nom...@hursley.ibm.com [continuum] BUILD SUCCESSFUL: Classlib/linux.ia32 Build/Test Sun, 28 Jan, 17:09
ge...@apache.org [build-test alert] BUILD SUCCEEDED lnx gcc debug: classlib over drlvm Sun, 28 Jan, 17:09
ge...@apache.org [build-test alert] BUILD SUCCEEDED lnx gcc debug: drlvm Sun, 28 Jan, 18:00
nom...@hursley.ibm.com [continuum] BUILD FAILURE: Classlib/linux.ia32 Build/Test Sun, 28 Jan, 19:11
nom...@frigga.cs.uiuc.edu [build-test alert] BUILD FAILED lnx gcc debug: classlib Sun, 28 Jan, 22:57
nom...@frigga.cs.uiuc.edu [build-test alert] BUILD FAILED lnx gcc debug: drlvm Sun, 28 Jan, 23:00
nom...@frigga.cs.uiuc.edu [build-test alert] BUILD FAILED lnx gcc debug: drlvm Sun, 28 Jan, 23:26
nom...@hursley.ibm.com [continuum] BUILD ERROR: Classlib/linux.ia32 Build/Test Mon, 29 Jan, 00:00
nom...@frigga.cs.uiuc.edu [build-test alert] BUILD FAILED lnx gcc debug: classlib over drlvm Mon, 29 Jan, 00:23
nom...@intel.com [build-test alert] BUILD FAILED Windows XP SP2 msvc debug: classlib Mon, 29 Jan, 03:24
nom...@intel.com [build-test alert] BUILD FAILED Windows XP SP2 msvc debug: drlvm Mon, 29 Jan, 03:27
nom...@intel.com [build-test alert] BUILD FAILED Windows XP SP2 msvc debug: drlvm Mon, 29 Jan, 03:27
nom...@intel.com [build-test alert] BUILD FAILED Windows XP SP2 msvc debug: classlib over drlvm Mon, 29 Jan, 03:28
nom...@intel.com [build-test alert] BUILD FAILED Linux SUSE 9 gcc debug: classlib Mon, 29 Jan, 03:30
nom...@intel.com [build-test alert] BUILD FAILED Linux SUSE 9 gcc debug: classlib over drlvm Mon, 29 Jan, 03:30
nom...@intel.com [build-test alert] BUILD FAILED Linux SUSE 9 64bit gcc debug: classlib Mon, 29 Jan, 03:33
nom...@intel.com [build-test alert] BUILD FAILED Linux SUSE 9 gcc debug: drlvm Mon, 29 Jan, 03:34
nom...@intel.com [build-test alert] BUILD FAILED Linux SUSE 9 gcc debug: drlvm Mon, 29 Jan, 03:34
nom...@intel.com [build-test alert] BUILD FAILED Windows XP msvc debug: classlib EHWA Mon, 29 Jan, 03:35
nom...@intel.com [build-test alert] BUILD SUCCEEDED Windows XP SP2 msvc debug: classlib Mon, 29 Jan, 03:43
nom...@intel.com [build-test alert] BUILD SUCCEEDED Linux SUSE 9 gcc debug: classlib Mon, 29 Jan, 03:50
nom...@intel.com [build-test alert] BUILD SUCCEEDED Windows XP SP2 msvc debug: drlvm Mon, 29 Jan, 03:52
nom...@intel.com [build-test alert] BUILD SUCCEEDED Linux SUSE 9 gcc debug: drlvm Mon, 29 Jan, 04:01
nom...@intel.com [build-test alert] BUILD SUCCEEDED Windows XP msvc debug: classlib EHWA Mon, 29 Jan, 04:04
nom...@intel.com [build-test alert] BUILD SUCCEEDED Linux SUSE 9 64bit gcc debug: classlib Mon, 29 Jan, 04:22
nom...@intel.com [build-test alert] BUILD FAILED SUSEL9 64bit gcc debug: classlib tests iterative Mon, 29 Jan, 04:51
nom...@intel.com [build-test alert] BUILD SUCCEEDED Windows XP SP2 msvc debug: classlib over drlvm Mon, 29 Jan, 05:20
nom...@intel.com [build-test alert] BUILD SUCCEEDED Linux SUSE 9 gcc debug: drlvm Mon, 29 Jan, 05:28
nom...@intel.com [build-test alert] BUILD SUCCEEDED Linux SUSE 9 gcc debug: classlib over drlvm Mon, 29 Jan, 06:08
ge...@apache.org [build-test alert] BUILD FAILED lnx gcc debug: classlib over drlvm Mon, 29 Jan, 06:12
nom...@hursley.ibm.com [continuum] BUILD FAILURE: Classlib/linux.ia32 Build/Test Mon, 29 Jan, 07:20
nom...@hursley.ibm.com [continuum] BUILD SUCCESSFUL: Classlib/linux.ia32 Build/Test Mon, 29 Jan, 09:05
nom...@hursley.ibm.com [continuum] BUILD FAILURE: Classlib/linux.ia32 Build/Test Mon, 29 Jan, 11:32
nom...@intel.com [build-test alert] BUILD FAILED Linux SUSE 9 gcc debug: classlib over drlvm Mon, 29 Jan, 12:10
nom...@intel.com [build-test alert] BUILD SUCCEEDED Windows XP SP2 msvc debug: drlvm Mon, 29 Jan, 12:17
ge...@apache.org [build-test alert] BUILD FAILED lnx gcc debug: classlib over drlvm Mon, 29 Jan, 13:08
nom...@intel.com [build-test alert] BUILD FAILED Windows XP SP2 msvc debug: drlvm tests Mon, 29 Jan, 13:59
nom...@intel.com [build-test alert] BUILD FAILED Linux SUSE 9 64bit gcc debug: drlvm tests Mon, 29 Jan, 14:14
nom...@intel.com [build-test alert] BUILD FAILED Windows XP SP2 msvc debug: classlib over drlvm Mon, 29 Jan, 14:35
nom...@hursley.ibm.com [continuum] BUILD FAILURE: Classlib/linux.ia32 Build/Test Mon, 29 Jan, 15:11
nom...@intel.com [build-test alert] BUILD FAILED Linux SUSE 9 64bit gcc debug: classlib over drlvm Mon, 29 Jan, 16:35
nom...@intel.com [build-test alert] BUILD SUCCEEDED Windows XP SP2 msvc debug: classlib over drlvm Mon, 29 Jan, 16:37
ge...@apache.org [build-test alert] BUILD SUCCEEDED lnx gcc debug: classlib over drlvm Mon, 29 Jan, 16:45
nom...@hursley.ibm.com [continuum] BUILD SUCCESSFUL: Classlib/linux.ia32 Build/Test Mon, 29 Jan, 17:04
nom...@intel.com [build-test alert] BUILD SUCCEEDED Linux SUSE 9 gcc debug: classlib over drlvm Mon, 29 Jan, 18:15
ge...@apache.org [build-test alert] BUILD FAILED lnx gcc debug: classlib over drlvm Mon, 29 Jan, 18:26
nom...@hursley.ibm.com [continuum] BUILD FAILURE: Classlib/linux.ia32 Build/Test Mon, 29 Jan, 19:23
ge...@apache.org [build-test alert] BUILD SUCCEEDED lnx gcc debug: classlib over drlvm Mon, 29 Jan, 20:49
nom...@hursley.ibm.com [continuum] BUILD SUCCESSFUL: Classlib/linux.ia32 Build/Test Mon, 29 Jan, 21:05
nom...@intel.com [build-test alert] BUILD SUCCEEDED Linux SUSE 9 64bit gcc debug: drlvm tests Mon, 29 Jan, 22:34
nom...@intel.com [build-test alert] BUILD SUCCEEDED Windows XP SP2 msvc debug: drlvm tests Mon, 29 Jan, 22:45
nom...@frigga.cs.uiuc.edu [build-test alert] BUILD SUCCEEDED lnx gcc debug: classlib Mon, 29 Jan, 23:06
nom...@frigga.cs.uiuc.edu [build-test alert] BUILD SUCCEEDED lnx gcc debug: drlvm Mon, 29 Jan, 23:12
nom...@frigga.cs.uiuc.edu [build-test alert] BUILD SUCCEEDED lnx gcc debug: drlvm Mon, 29 Jan, 23:53
nom...@hursley.ibm.com [continuum] BUILD ERROR: Classlib/linux.ia32 Build/Test Tue, 30 Jan, 00:00
nom...@frigga.cs.uiuc.edu [build-test alert] BUILD SUCCEEDED lnx gcc debug: classlib over drlvm Tue, 30 Jan, 01:21
nom...@intel.com [build-test alert] BUILD FAILED WIN XP msvc debug: classlib tests iterative Tue, 30 Jan, 03:58
nom...@intel.com [build-test alert] BUILD FAILED SUSEL9 IA32 gcc debug: classlib tests iterative Tue, 30 Jan, 04:14
nom...@intel.com [build-test alert] BUILD FAILED Windows XP SP2 msvc debug: drlvm tests Tue, 30 Jan, 06:22
nom...@hursley.ibm.com [continuum] BUILD SUCCESSFUL: Classlib/linux.ia32 Build/Test Tue, 30 Jan, 07:14
ge...@apache.org [build-test alert] BUILD FAILED lnx gcc debug: classlib over drlvm Tue, 30 Jan, 09:26
nom...@intel.com [build-test alert] BUILD SUCCEEDED Windows XP SP2 msvc debug: drlvm tests Tue, 30 Jan, 09:58
nom...@intel.com [build-test alert] BUILD FAILED Windows XP SP2 msvc debug: classlib over drlvm Tue, 30 Jan, 10:33
nom...@intel.com [build-test alert] BUILD SUCCEEDED Linux SUSE 9 64bit gcc debug: classlib over drlvm Tue, 30 Jan, 11:25
nom...@hursley.ibm.com [continuum] BUILD FAILURE: Classlib/linux.ia32 Build/Test Tue, 30 Jan, 13:10
ge...@apache.org [build-test alert] BUILD FAILED lnx gcc debug: drlvm Tue, 30 Jan, 14:23
nom...@intel.com [build-test alert] BUILD FAILED SUSEL9 64bit gcc debug: classlib tests iterative Tue, 30 Jan, 15:34
nom...@intel.com [build-test alert] BUILD FAILED Windows XP SP2 msvc debug: drlvm tests Tue, 30 Jan, 15:48
nom...@hursley.ibm.com [continuum] BUILD FAILURE: Classlib/linux.ia32 Build/Test Tue, 30 Jan, 16:18
ge...@apache.org [build-test alert] BUILD SUCCEEDED lnx gcc debug: drlvm Tue, 30 Jan, 16:21
nom...@hursley.ibm.com [continuum] BUILD FAILURE: Classlib/linux.ia32 Build/Test Tue, 30 Jan, 17:05
ge...@apache.org [build-test alert] BUILD FAILED lnx gcc debug: drlvm Tue, 30 Jan, 18:40
nom...@hursley.ibm.com [continuum] BUILD SUCCESSFUL: Classlib/linux.ia32 Build/Test Tue, 30 Jan, 19:09
ge...@apache.org [build-test alert] BUILD SUCCEEDED lnx gcc debug: drlvm Tue, 30 Jan, 20:41
ge...@apache.org [build-test alert] BUILD SUCCEEDED lnx gcc debug: classlib over drlvm Tue, 30 Jan, 22:44
nom...@hursley.ibm.com [continuum] BUILD ERROR: Classlib/linux.ia32 Build/Test Wed, 31 Jan, 00:00
ge...@apache.org [build-test alert] BUILD FAILED lnx gcc debug: drlvm Wed, 31 Jan, 00:08
ge...@apache.org [build-test alert] BUILD FAILED lnx gcc debug: classlib over drlvm Wed, 31 Jan, 00:34
nom...@intel.com [build-test alert] BUILD FAILED Linux SUSE 9 64bit gcc debug: classlib over drlvm Wed, 31 Jan, 01:39
ge...@apache.org [build-test alert] BUILD SUCCEEDED lnx gcc debug: drlvm Wed, 31 Jan, 01:43
ge...@apache.org [build-test alert] BUILD SUCCEEDED lnx gcc debug: classlib over drlvm Wed, 31 Jan, 02:11
nom...@intel.com [build-test alert] BUILD FAILED WIN XP msvc debug: classlib tests iterative Wed, 31 Jan, 03:01
nom...@intel.com [build-test alert] BUILD SUCCEEDED Linux SUSE 9 64bit gcc debug: classlib over drlvm Wed, 31 Jan, 03:08
ge...@apache.org [build-test alert] BUILD FAILED lnx gcc debug: classlib over drlvm Wed, 31 Jan, 03:32
nom...@hursley.ibm.com [continuum] BUILD SUCCESSFUL: Classlib/linux.ia32 Build/Test Wed, 31 Jan, 04:13
nom...@intel.com [build-test alert] BUILD SUCCEEDED Windows XP SP2 msvc debug: drlvm tests Wed, 31 Jan, 04:42
nom...@intel.com [build-test alert] BUILD SUCCEEDED Windows XP SP2 msvc debug: classlib over drlvm Wed, 31 Jan, 06:00
ge...@apache.org [build-test alert] BUILD SUCCEEDED lnx gcc debug: classlib over drlvm Wed, 31 Jan, 07:06
nom...@intel.com [build-test alert] BUILD FAILED Windows XP SP2 msvc debug: drlvm tests Wed, 31 Jan, 08:01
ge...@apache.org [build-test alert] BUILD FAILED lnx gcc debug: classlib over drlvm Wed, 31 Jan, 08:43
nom...@intel.com [build-test alert] BUILD FAILED Linux SUSE 9 64bit gcc debug: classlib over drlvm Wed, 31 Jan, 12:16
ge...@apache.org [build-test alert] BUILD SUCCEEDED lnx gcc debug: classlib over drlvm Wed, 31 Jan, 12:26
nom...@intel.com [build-test alert] BUILD FAILED SUSE Linux 64bit gcc debug: classlib EHWA Wed, 31 Jan, 13:36
nom...@intel.com [build-test alert] BUILD FAILED Linux SUSE 9 gcc debug: classlib over drlvm Wed, 31 Jan, 14:07
nom...@intel.com [build-test alert] BUILD SUCCEEDED Windows XP SP2 msvc debug: drlvm tests Wed, 31 Jan, 14:09
ge...@apache.org [build-test alert] BUILD FAILED lnx gcc debug: classlib over drlvm Wed, 31 Jan, 14:30
nom...@intel.com [build-test alert] BUILD SUCCEEDED Linux SUSE 9 64bit gcc debug: classlib over drlvm Wed, 31 Jan, 14:49
Message list« Previous · 1 · 2 · 3 · 4 · 5 · Next »Thread · Author · Date
Box list
Jul 20113
Dec 201029
Nov 20106
Oct 201046
Sep 201035
Aug 201017
Jul 201029
Jun 201041
May 201020
Apr 201040
Mar 2010102
Feb 201043
Jan 201014
Dec 200911
Nov 20099
Oct 200912
Sep 20093
Aug 200915
Jul 200959
Jun 200916
May 200930
Apr 200960
Mar 200919
Feb 200945
Jan 200957
Dec 200827
Nov 200815
Oct 200824
Sep 200854
Aug 200834
Jul 200841
Jun 200899
May 200862
Apr 2008113
Mar 2008133
Feb 2008164
Jan 2008291
Dec 2007335
Nov 2007454
Oct 2007405
Sep 2007259
Aug 2007368
Jul 2007618
Jun 2007607
May 2007672
Apr 2007455
Mar 20071104
Feb 2007389
Jan 2007418
Dec 200692