harmony-alerts mailing list archives: January 2007

Site index · List index
Message list« Previous · 1 · 2 · 3 · 4 · 5 · Next »Thread · Author · Date
nom...@intel.com [build-test alert] BUILD SUCCEEDED Linux SUSE 9 64bit gcc debug: classlib Sat, 06 Jan, 21:18
nom...@intel.com [build-test alert] BUILD FAILED Linux SUSE 9 gcc debug: classlib over ibmvm Sat, 06 Jan, 21:19
nom...@intel.com [build-test alert] BUILD FAILED Linux SUSE 9 gcc debug: drlvm Sat, 06 Jan, 21:22
nom...@intel.com [build-test alert] BUILD SUCCEEDED Linux SUSE 9 64bit gcc debug: drlvm Sat, 06 Jan, 21:28
nom...@intel.com [build-test alert] BUILD SUCCEEDED Windows XP SP2 msvc debug: classlib over drlvm Sat, 06 Jan, 21:48
nom...@intel.com [build-test alert] BUILD SUCCEEDED Linux SUSE 9 gcc debug: classlib over ibmvm Sat, 06 Jan, 22:11
nom...@intel.com [build-test alert] BUILD SUCCEEDED Linux SUSE 9 gcc debug: drlvm Sat, 06 Jan, 22:23
nom...@intel.com [build-test alert] BUILD SUCCEEDED Linux SUSE 9 64bit gcc debug: classlib over drlvm Sat, 06 Jan, 22:50
nom...@intel.com [build-test alert] BUILD FAILED Windows XP SP2 msvc debug: classlib over drlvm Sun, 07 Jan, 01:35
nom...@intel.com [build-test alert] BUILD SUCCEEDED Windows XP SP2 msvc debug: classlib over drlvm Sun, 07 Jan, 03:10
nom...@intel.com [build-test alert] BUILD FAILED win XP IA32 msvc debug: classlib tests iterative Sun, 07 Jan, 12:58
nom...@intel.com [build-test alert] BUILD FAILED win XP IA32 msvc debug: classlib tests iterative Mon, 08 Jan, 20:50
nom...@intel.com [build-test alert] BUILD FAILED Linux SUSE 9 gcc debug: classlib over ibmvm Mon, 08 Jan, 21:21
nom...@intel.com [build-test alert] BUILD FAILED Windows XP SP2 msvc debug: classlib over drlvm Mon, 08 Jan, 21:45
nom...@intel.com [build-test alert] BUILD SUCCEEDED Linux SUSE 9 gcc debug: classlib over ibmvm Mon, 08 Jan, 22:57
nom...@intel.com [build-test alert] BUILD SUCCEEDED Windows XP SP2 msvc debug: classlib over drlvm Mon, 08 Jan, 23:20
nom...@intel.com [build-test alert] BUILD FAILED Linux SUSE 9 gcc debug: classlib over ibmvm Tue, 09 Jan, 05:55
nom...@intel.com [build-test alert] BUILD SUCCEEDED Linux SUSE 9 gcc debug: classlib over ibmvm Tue, 09 Jan, 08:25
nom...@intel.com [build-test alert] BUILD FAILED Linux SUSE 9 64bit gcc debug: classlib over drlvm Tue, 09 Jan, 16:50
nom...@intel.com [build-test alert] BUILD FAILED Windows XP SP2 msvc debug: classlib over drlvm Tue, 09 Jan, 17:02
nom...@intel.com [build-test alert] BUILD SUCCEEDED Linux SUSE 9 64bit gcc debug: classlib over drlvm Tue, 09 Jan, 19:10
nom...@intel.com [build-test alert] BUILD SUCCEEDED Windows XP SP2 msvc debug: classlib over drlvm Tue, 09 Jan, 19:22
nom...@intel.com [build-test alert] BUILD FAILED win XP IA32 msvc debug: classlib tests iterative Wed, 10 Jan, 04:25
nom...@intel.com [build-test alert] BUILD FAILED Windows XP SP2 msvc debug: classlib over drlvm Wed, 10 Jan, 08:20
nom...@intel.com [build-test alert] BUILD SUCCEEDED Linux SUSE 9 gcc debug: classlib over drlvm Wed, 10 Jan, 11:19
nom...@intel.com [build-test alert] BUILD FAILED Linux SUSE 9 64bit gcc debug: classlib over drlvm Wed, 10 Jan, 11:35
nom...@intel.com [build-test alert] BUILD SUCCEEDED Windows XP SP2 msvc debug: classlib over drlvm Wed, 10 Jan, 12:27
nom...@intel.com [build-test alert] BUILD SUCCEEDED Linux SUSE 9 64bit gcc debug: classlib over drlvm Wed, 10 Jan, 14:01
nom...@intel.com [build-test alert] BUILD FAILED Linux SUSE 9 64bit gcc debug: classlib over drlvm Wed, 10 Jan, 22:07
nom...@intel.com [build-test alert] BUILD SUCCEEDED Linux SUSE 9 64bit gcc debug: classlib over drlvm Thu, 11 Jan, 00:17
nom...@intel.com [build-test alert] BUILD FAILED win XP IA32 msvc debug: classlib tests iterative Thu, 11 Jan, 12:39
nom...@intel.com [build-test alert] BUILD FAILED win XP IA32 msvc debug: classlib tests iterative Fri, 12 Jan, 19:39
nom...@intel.com [build-test alert] BUILD FAILED Linux SUSE 9 gcc debug: classlib over ibmvm Sat, 13 Jan, 00:51
nom...@intel.com [build-test alert] BUILD SUCCEEDED Linux SUSE 9 gcc debug: classlib over ibmvm Sat, 13 Jan, 03:20
nom...@intel.com [build-test alert] BUILD FAILED Windows XP SP2 msvc debug: drlvm tests Sat, 13 Jan, 19:04
nom...@intel.com [build-test alert] BUILD SUCCEEDED Windows XP SP2 msvc debug: drlvm tests Sat, 13 Jan, 21:12
nom...@intel.com [build-test alert] BUILD FAILED Linux SUSE 9 64bit gcc debug: classlib over drlvm Sat, 13 Jan, 22:21
nom...@intel.com [build-test alert] BUILD FAILED Linux SUSE 9 gcc debug: classlib over drlvm Sun, 14 Jan, 02:57
nom...@intel.com [build-test alert] BUILD SUCCEEDED Linux SUSE 9 64bit gcc debug: classlib over drlvm Sun, 14 Jan, 03:06
nom...@intel.com [build-test alert] BUILD SUCCEEDED Linux SUSE 9 gcc debug: classlib over drlvm Sun, 14 Jan, 03:44
nom...@intel.com [build-test alert] BUILD FAILED win XP IA32 msvc debug: classlib tests iterative Sun, 14 Jan, 05:01
nom...@intel.com [build-test alert] BUILD FAILED Linux SUSE 9 64bit gcc debug: classlib over drlvm Sun, 14 Jan, 11:27
nom...@intel.com [build-test alert] BUILD FAILED Linux SUSE 9 gcc debug: classlib over ibmvm Sun, 14 Jan, 12:36
nom...@intel.com [build-test alert] BUILD SUCCEEDED Linux SUSE 9 64bit gcc debug: classlib over drlvm Sun, 14 Jan, 13:49
nom...@intel.com [build-test alert] BUILD FAILED Windows XP msvc debug: classlib EHWA Sun, 14 Jan, 18:35
nom...@intel.com [build-test alert] BUILD FAILED Linux SUSE 9 64bit gcc debug: drlvm Sun, 14 Jan, 19:52
nom...@intel.com [build-test alert] BUILD FAILED Linux SUSE 9 64bit gcc debug: drlvm tests Sun, 14 Jan, 19:52
nom...@intel.com [build-test alert] BUILD FAILED Linux SUSE 9 64bit gcc debug: classlib over drlvm Sun, 14 Jan, 19:52
nom...@intel.com [build-test alert] BUILD FAILED Linux SUSE 9 gcc debug: drlvm Sun, 14 Jan, 20:34
nom...@intel.com [build-test alert] BUILD FAILED Linux SUSE 9 gcc debug: drlvm Sun, 14 Jan, 20:35
nom...@intel.com [build-test alert] BUILD FAILED Linux SUSE 9 gcc debug: classlib over drlvm Sun, 14 Jan, 20:36
nom...@intel.com [build-test alert] BUILD FAILED Windows XP SP2 msvc debug: drlvm tests Mon, 15 Jan, 05:02
nom...@intel.com [build-test alert] BUILD FAILED Windows XP SP2 msvc debug: drlvm Mon, 15 Jan, 06:17
nom...@intel.com [build-test alert] BUILD FAILED Windows XP SP2 msvc debug: classlib over drlvm Mon, 15 Jan, 06:18
nom...@intel.com [build-test alert] BUILD SUCCEEDED Linux SUSE 9 gcc debug: classlib over ibmvm Mon, 15 Jan, 06:37
nom...@intel.com [build-test alert] BUILD SUCCEEDED Linux SUSE 9 64bit gcc debug: drlvm Mon, 15 Jan, 06:48
nom...@intel.com [build-test alert] BUILD SUCCEEDED Windows XP SP2 msvc debug: drlvm Mon, 15 Jan, 06:59
nom...@intel.com [build-test alert] BUILD SUCCEEDED Windows XP msvc debug: classlib EHWA Mon, 15 Jan, 07:08
nom...@intel.com [build-test alert] BUILD SUCCEEDED Linux SUSE 9 64bit gcc debug: drlvm tests Mon, 15 Jan, 07:26
nom...@intel.com [build-test alert] BUILD FAILED Linux SUSE 9 gcc debug: classlib over ibmvm Mon, 15 Jan, 07:41
nom...@intel.com [build-test alert] BUILD SUCCEEDED Linux SUSE 9 gcc debug: drlvm Mon, 15 Jan, 07:52
nom...@intel.com [build-test alert] BUILD SUCCEEDED Windows XP SP2 msvc debug: drlvm tests Mon, 15 Jan, 07:59
nom...@intel.com [build-test alert] BUILD SUCCEEDED Windows XP SP2 msvc debug: classlib over drlvm Mon, 15 Jan, 08:38
nom...@intel.com [build-test alert] BUILD SUCCEEDED Linux SUSE 9 gcc debug: drlvm Mon, 15 Jan, 08:50
nom...@intel.com [build-test alert] BUILD SUCCEEDED Linux SUSE 9 64bit gcc debug: classlib over drlvm Mon, 15 Jan, 08:52
nom...@intel.com [build-test alert] BUILD SUCCEEDED Linux SUSE 9 gcc debug: classlib over drlvm Mon, 15 Jan, 09:29
nom...@intel.com [build-test alert] BUILD SUCCEEDED Linux SUSE 9 gcc debug: classlib over ibmvm Mon, 15 Jan, 10:21
nom...@intel.com [build-test alert] BUILD FAILED Windows XP SP2 msvc debug: classlib over drlvm Mon, 15 Jan, 17:23
nom...@intel.com [build-test alert] BUILD SUCCEEDED Windows XP SP2 msvc debug: classlib over drlvm Mon, 15 Jan, 18:11
nom...@intel.com [build-test alert] BUILD FAILED Linux SUSE 9 gcc debug: classlib over ibmvm Mon, 15 Jan, 20:15
nom...@intel.com [build-test alert] BUILD SUCCEEDED Linux SUSE 9 gcc debug: classlib over ibmvm Mon, 15 Jan, 22:59
nom...@intel.com [build-test alert] BUILD FAILED Linux SUSE 9 64bit gcc debug: classlib over drlvm Mon, 15 Jan, 23:51
nom...@intel.com [build-test alert] BUILD SUCCEEDED Linux SUSE 9 64bit gcc debug: classlib over drlvm Tue, 16 Jan, 01:23
nom...@intel.com [build-test alert] BUILD FAILED Linux SUSE 9 64bit gcc debug: classlib over drlvm Tue, 16 Jan, 11:32
nom...@intel.com [build-test alert] BUILD FAILED Windows XP SP2 msvc debug: classlib over drlvm Tue, 16 Jan, 11:49
nom...@intel.com [build-test alert] BUILD SUCCEEDED Linux SUSE 9 64bit gcc debug: classlib over drlvm Tue, 16 Jan, 14:29
nom...@intel.com [build-test alert] BUILD SUCCEEDED Windows XP SP2 msvc debug: classlib over drlvm Tue, 16 Jan, 15:15
nom...@intel.com [build-test alert] BUILD FAILED Linux SUSE 9 gcc debug: classlib over ibmvm Tue, 16 Jan, 18:22
nom...@intel.com [build-test alert] BUILD FAILED Windows XP SP2 msvc debug: classlib over drlvm Tue, 16 Jan, 19:34
nom...@intel.com [build-test alert] BUILD FAILED Linux SUSE 9 64bit gcc debug: classlib over drlvm Tue, 16 Jan, 19:54
nom...@intel.com [build-test alert] BUILD FAILED Linux SUSE 9 gcc debug: classlib over drlvm Tue, 16 Jan, 20:13
nom...@intel.com [build-test alert] BUILD SUCCEEDED Linux SUSE 9 gcc debug: classlib over ibmvm Tue, 16 Jan, 21:04
nom...@intel.com [build-test alert] BUILD SUCCEEDED Linux SUSE 9 64bit gcc debug: classlib over drlvm Tue, 16 Jan, 22:31
nom...@intel.com [build-test alert] BUILD SUCCEEDED Linux SUSE 9 gcc debug: classlib over drlvm Tue, 16 Jan, 22:48
nom...@intel.com [build-test alert] BUILD SUCCEEDED Windows XP SP2 msvc debug: classlib over drlvm Wed, 17 Jan, 04:34
nom...@intel.com [build-test alert] BUILD FAILED Linux SUSE 9 64bit gcc debug: classlib Wed, 17 Jan, 05:55
nom...@intel.com [build-test alert] BUILD FAILED Linux SUSE 9 64bit gcc debug: drlvm Wed, 17 Jan, 05:59
nom...@intel.com [build-test alert] BUILD FAILED Linux SUSE 9 64bit gcc debug: classlib over drlvm Wed, 17 Jan, 05:59
nom...@intel.com [build-test alert] BUILD FAILED Linux SUSE 9 gcc debug: classlib over ibmvm Wed, 17 Jan, 06:03
nom...@intel.com [build-test alert] BUILD FAILED Linux SUSE 9 gcc debug: drlvm Wed, 17 Jan, 06:07
nom...@intel.com [build-test alert] BUILD SUCCEEDED Linux SUSE 9 64bit gcc debug: classlib Wed, 17 Jan, 06:10
nom...@intel.com [build-test alert] BUILD SUCCEEDED Linux SUSE 9 64bit gcc debug: drlvm Wed, 17 Jan, 06:19
nom...@intel.com [build-test alert] BUILD FAILED Windows XP SP2 msvc debug: classlib Wed, 17 Jan, 06:31
nom...@intel.com [build-test alert] BUILD SUCCEEDED Linux SUSE 9 gcc debug: classlib over ibmvm Wed, 17 Jan, 06:57
nom...@intel.com [build-test alert] BUILD SUCCEEDED Linux SUSE 9 gcc debug: drlvm Wed, 17 Jan, 07:08
nom...@intel.com [build-test alert] BUILD SUCCEEDED Windows XP SP2 msvc debug: classlib Wed, 17 Jan, 07:41
nom...@intel.com [build-test alert] BUILD SUCCEEDED Linux SUSE 9 64bit gcc debug: classlib over drlvm Wed, 17 Jan, 08:26
nom...@intel.com [build-test alert] BUILD FAILED Windows XP msvc debug: classlib EHWA Wed, 17 Jan, 08:34
nom...@intel.com [build-test alert] BUILD SUCCEEDED Windows XP msvc debug: classlib EHWA Wed, 17 Jan, 09:10
nom...@intel.com [build-test alert] BUILD FAILED Linux SUSE 9 64bit gcc debug: classlib over drlvm Wed, 17 Jan, 10:51
Message list« Previous · 1 · 2 · 3 · 4 · 5 · Next »Thread · Author · Date
Box list
Jul 20113
Dec 201029
Nov 20106
Oct 201046
Sep 201035
Aug 201017
Jul 201029
Jun 201041
May 201020
Apr 201040
Mar 2010102
Feb 201043
Jan 201014
Dec 200911
Nov 20099
Oct 200912
Sep 20093
Aug 200915
Jul 200959
Jun 200916
May 200930
Apr 200960
Mar 200919
Feb 200945
Jan 200957
Dec 200827
Nov 200815
Oct 200824
Sep 200854
Aug 200834
Jul 200841
Jun 200899
May 200862
Apr 2008113
Mar 2008133
Feb 2008164
Jan 2008291
Dec 2007335
Nov 2007454
Oct 2007405
Sep 2007259
Aug 2007368
Jul 2007618
Jun 2007607
May 2007672
Apr 2007455
Mar 20071104
Feb 2007389
Jan 2007418
Dec 200692