harmony-alerts mailing list archives

Site index · List index
Message view « Date » · « Thread »
Top « Date » · « Thread »
From nom...@intel.com
Subject [build-test alert] BUILD FAILED Linux SUSE 9 gcc debug: classlib over drlvm
Date Wed, 31 Jan 2007 14:07:24 GMT
BUILD FAILED:
	Ant Error Message:
/export/cruise/trunk/cc/projects/classlib/trunk/build.xml:167: The following error occurred
while executing this line: /export/cruise/trunk/cc/projects/classlib/trunk/make/build-test.xml:139:
There were test failures.

Date of build:	01/31/2007 19:27:22
Time to build:	39 minutes 13 seconds
Last changed:	01/31/2007 18:54:34
Last log entry:	Applied HARMONY-3063 [drlvm][jit] ArrayCopyRepMove does not work on EM64T
Tested on SUSE9@x64

***********************************************************
Errors/Warnings:	(304)
            

========================================
Testing class libraries...
========================================
Checking for depends/jars/yoko_M2-20061115/yoko.jar
Checking for depends/jars/yoko_M2-20061115/yoko-core.jar
Checking for depends/jars/yoko_M1-20061027/yoko-rmi.jar
Checking for depends/jars/bcel-5.2/bcel-5.2.jar
Checking for depends/jars/xalan-j_2.7.0/xalan.jar
Checking for depends/jars/xerces_2.8.0/resolver.jar
Checking for depends/jars/xerces_2.8.0/xercesImpl.jar
Checking for depends/jars/xerces_2.8.0/xml-apis.jar
Checking for depends/jars/junit_3.8.2/junit.jar
Checking for depends/jars/bcprov-jdk15-134/bcprov.jar
Checking for depends/jars/icu4j_3.4.4/icu4j_3_4_4.jar
Checking for depends/jars/mx4j_3.0.1/mx4j.jar
Checking for depends/jars/mx4j_3.0.1/mx4j-remote.jar
Checking for depends/jars/ecj_3.2/ecj_3.2.jar
Checking for depends/jars/jetty/jetty-6.0.0.jar
Checking for depends/jars/jetty/jetty-util-6.0.0.jar
Checking for depends/jars/jetty/servlet-api-2.5-6.0.0.jar
Checking for depends/libs/build/lcms/icc34.h
Checking for depends/libs/build/lcms/lcms.h
Checking for depends/libs/build/png/pngconf.h
Checking for depends/libs/build/png/png.h
Checking for depends/libs/build/jpeg/jconfig.lnx
Checking for depends/libs/build/jpeg/jpeglib.h
Checking for depends/libs/build/jpeg/jmorecfg.h
Checking for depends/libs/build/jpeg/jerror.h
Checking for depends/libs/build/lcms/liblcms.linux.x86
Checking for depends/libs/build/png/libpng.linux.x86
Checking for depends/libs/build/jpeg/libjpeg.linux.x86
Since fork is false, ignoring memoryMaximumSize setting
Compiling ACCESSIBILITY classes
Compiling ACCESSIBILITY tests
Since fork is false, ignoring memoryMaximumSize setting
Compiling ANNOTATION classes
Compiling ANNOTATION tests
Since fork is false, ignoring memoryMaximumSize setting
Compiling APPLET classes
Compiling APPLET tests
Since fork is false, ignoring memoryMaximumSize setting
Compiling ARCHIVE classes
Compiling ARCHIVE tests
Since fork is false, ignoring memoryMaximumSize setting
Compiling AUTH classes
Compiling AUTH tests
Since fork is false, ignoring memoryMaximumSize setting
Compiling AWT classes
Compiling AWT tests
Since fork is false, ignoring memoryMaximumSize setting
java.lang.RuntimeException: expected from EDT
	at java.awt.EventDispatchThreadRTest$1.run(EventDispatchThreadRTest.java:29)
	at java.awt.event.InvocationEvent.runAndNotify(InvocationEvent.java:90)
	at java.awt.event.InvocationEvent.dispatch(InvocationEvent.java:77)
	at java.awt.EventQueueCore.dispatchEventImpl(EventQueueCore.java:138)
	at java.awt.EventQueue.dispatchEvent(EventQueue.java:144)
	at java.awt.EventDispatchThread.runModalLoop(EventDispatchThread.java:73)
	at java.awt.EventDispatchThread.run(EventDispatchThread.java:45)
Compiling BEANS classes
Compiling support classes for BEANS tests
Compiling internal BEANS tests
Compiling BEANS tests
Since fork is false, ignoring memoryMaximumSize setting
Running internal BEANS tests
Running BEANS tests
Compiling CRYPTO classes
Compiling CRYPTO test support files
Since fork is false, ignoring memoryMaximumSize setting
Compiling CRYPTO api tests
Since fork is false, ignoring memoryMaximumSize setting
Compiling CRYPTO api injected tests
Since fork is false, ignoring memoryMaximumSize setting
Compiling CRYPTO impl injected tests
Since fork is false, ignoring memoryMaximumSize setting
Compiling CRYPTO impl tests
Since fork is false, ignoring memoryMaximumSize setting
Running CRYPTO api tests
Running CRYPTO api.injected tests
Running CRYPTO impl tests
Running CRYPTO impl injected tests
Compiling ImageIO classes
Compiling ImageIO tests
Compiling INSTRUMENT classes
Compiling INSTRUMENT tests
Since fork is false, ignoring memoryMaximumSize setting
Compiling JNDI classes
Compiling JNDI tests
Since fork is false, ignoring memoryMaximumSize setting
Compiling LANG-MANAGEMENT classes
Compiling LANG-MANAGEMENT API tests
Compiling LANG-MANAGEMENT Implementation tests
Compiling LOGGING classes
Compiling LOGGING tests
Since fork is false, ignoring memoryMaximumSize setting
Compiling LUNI classes
Compiling LUNI JUnit Tests
Since fork is false, ignoring memoryMaximumSize setting
Running LUNI JUnit Tests
Compiling MATH classes
Compiling MATH tests
Since fork is false, ignoring memoryMaximumSize setting
Compiling MISC classes
Compiling MISC tests
Since fork is false, ignoring memoryMaximumSize setting
Compiling NIO classes
Compiling NIO tests
Since fork is false, ignoring memoryMaximumSize setting
Compiling NIO_CHAR classes
Compiling NIO_CHAR tests
Since fork is false, ignoring memoryMaximumSize setting
Cannot find unmappable byte array for US-ASCII
Cannot find unmappable byte array for gb18030
Cannot find unmappable byte array for ISO-8859-1
Cannot find malform byte array for ISO-8859-1
Cannot find unmappable byte array for UTF-16BE
Cannot find malform byte array for UTF-16BE
Cannot find unmappable byte array for UTF-16LE
Cannot find malform byte array for UTF-16LE
Cannot find unmappable byte array for UTF-8
Compiling PACK200 classes
Compiling PACK200 tests
Since fork is false, ignoring memoryMaximumSize setting
Running PACK200 tests
init: passed
hyerror: passed
hytime: passed
hyfile: passed
Compiling PREFS classes
Compiling PREFS tests
Since fork is false, ignoring memoryMaximumSize setting
Compiling PRINT classes
Compiling Print tests
Since fork is false, ignoring memoryMaximumSize setting
java.net.ConnectException: localhost/127.0.0.1:631 - Connection refused
	at org.apache.harmony.luni.net.PlainSocketImpl.connect(PlainSocketImpl.java:229)
	at org.apache.harmony.luni.net.PlainSocketImpl.connect(PlainSocketImpl.java:508)
	at java.net.Socket.connect(Socket.java:930)
	at org.apache.harmony.luni.internal.net.www.protocol.http.HttpURLConnection.getHTTPConnection(HttpURLConnection.java:635)
	at org.apache.harmony.luni.internal.net.www.protocol.http.HttpURLConnection.connect(HttpURLConnection.java:616)
	at org.apache.harmony.x.print.ipp.IppClient.request(IppClient.java:110)
	at org.apache.harmony.x.print.ipp.IppClient.request(IppClient.java:87)
	at org.apache.harmony.x.print.cups.CUPSPrintServiceProvider.findDefaultPrintService(CUPSPrintServiceProvider.java:471)
	at org.apache.harmony.x.print.cups.CUPSPrintServiceProvider.getDefaultPrintService(CUPSPrintServiceProvider.java:168)
	at javax.print.PrintServiceLookup.lookupDefaultPrintService(PrintServiceLookup.java:138)
	at javax.print.attribute.HashAttributeTest.testAdd2(HashAttributeTest.java)
	at java.lang.reflect.VMReflection.invokeMethod(Native Method)
	at java.lang.reflect.Method.invoke(Unknown Source)
	at junit.framework.TestCase.runTest(TestCase.java:164)
	at junit.framework.TestCase.runBare(TestCase.java:128)
	at junit.framework.TestResult$1.protect(TestResult.java)
	at junit.framework.TestResult.runProtected(TestResult.java)
	at junit.framework.TestResult.run(TestResult.java:104)
	at junit.framework.TestCase.run(TestCase.java)
	at junit.framework.TestSuite.runTest(TestSuite.java)
	at junit.framework.TestSuite.run(TestSuite.java:224)
	at org.apache.tools.ant.taskdefs.optional.junit.JUnitTestRunner.run(JUnitTestRunner.java:294)
	at org.apache.tools.ant.taskdefs.optional.junit.JUnitTestRunner.launch(JUnitTestRunner.java:670)
	at org.apache.tools.ant.taskdefs.optional.junit.JUnitTestRunner.main(JUnitTestRunner.java:545)
java.net.ConnectException: localhost/127.0.0.1:631 - Connection refused
	at org.apache.harmony.luni.net.PlainSocketImpl.connect(PlainSocketImpl.java:229)
	at org.apache.harmony.luni.net.PlainSocketImpl.connect(PlainSocketImpl.java:508)
	at java.net.Socket.connect(Socket.java:930)
	at org.apache.harmony.luni.internal.net.www.protocol.http.HttpURLConnection.getHTTPConnection(HttpURLConnection.java:635)
	at org.apache.harmony.luni.internal.net.www.protocol.http.HttpURLConnection.connect(HttpURLConnection.java:616)
	at org.apache.harmony.x.print.ipp.IppClient.request(IppClient.java:110)
	at org.apache.harmony.x.print.ipp.IppClient.request(IppClient.java:87)
	at org.apache.harmony.x.print.cups.CUPSPrintServiceProvider.findDefaultPrintService(CUPSPrintServiceProvider.java:471)
	at org.apache.harmony.x.print.cups.CUPSPrintServiceProvider.getDefaultPrintService(CUPSPrintServiceProvider.java:168)
	at javax.print.PrintServiceLookup.lookupDefaultPrintService(PrintServiceLookup.java:138)
	at javax.print.attribute.HashAttributeTest.testEquals(HashAttributeTest.java:283)
	at java.lang.reflect.VMReflection.invokeMethod(Native Method)
	at java.lang.reflect.Method.invoke(Unknown Source)
	at junit.framework.TestCase.runTest(TestCase.java:164)
	at junit.framework.TestCase.runBare(TestCase.java:128)
	at junit.framework.TestResult$1.protect(TestResult.java)
	at junit.framework.TestResult.runProtected(TestResult.java)
	at junit.framework.TestResult.run(TestResult.java:104)
	at junit.framework.TestCase.run(TestCase.java)
	at junit.framework.TestSuite.runTest(TestSuite.java)
	at junit.framework.TestSuite.run(TestSuite.java:224)
	at org.apache.tools.ant.taskdefs.optional.junit.JUnitTestRunner.run(JUnitTestRunner.java:294)
	at org.apache.tools.ant.taskdefs.optional.junit.JUnitTestRunner.launch(JUnitTestRunner.java:670)
	at org.apache.tools.ant.taskdefs.optional.junit.JUnitTestRunner.main(JUnitTestRunner.java:545)
java.net.ConnectException: localhost/127.0.0.1:631 - Connection refused
	at org.apache.harmony.luni.net.PlainSocketImpl.connect(PlainSocketImpl.java:229)
	at org.apache.harmony.luni.net.PlainSocketImpl.connect(PlainSocketImpl.java:508)
	at java.net.Socket.connect(Socket.java:930)
	at org.apache.harmony.luni.internal.net.www.protocol.http.HttpURLConnection.getHTTPConnection(HttpURLConnection.java:635)
	at org.apache.harmony.luni.internal.net.www.protocol.http.HttpURLConnection.connect(HttpURLConnection.java:616)
	at org.apache.harmony.x.print.ipp.IppClient.request(IppClient.java:110)
	at org.apache.harmony.x.print.ipp.IppClient.request(IppClient.java:87)
	at org.apache.harmony.x.print.cups.CUPSPrintServiceProvider.findDefaultPrintService(CUPSPrintServiceProvider.java:471)
	at org.apache.harmony.x.print.cups.CUPSPrintServiceProvider.getDefaultPrintService(CUPSPrintServiceProvider.java:168)
	at javax.print.PrintServiceLookup.lookupDefaultPrintService(PrintServiceLookup.java:138)
	at javax.print.attribute.HashAttributeTest.testAdd2(HashAttributeTest.java)
	at java.lang.reflect.VMReflection.invokeMethod(Native Method)
	at java.lang.reflect.Method.invoke(Unknown Source)
	at junit.framework.TestCase.runTest(TestCase.java:164)
	at junit.framework.TestCase.runBare(TestCase.java:128)
	at junit.framework.TestResult$1.protect(TestResult.java)
	at junit.framework.TestResult.runProtected(TestResult.java)
	at junit.framework.TestResult.run(TestResult.java:104)
	at junit.framework.TestCase.run(TestCase.java)
	at junit.framework.TestSuite.runTest(TestSuite.java)
	at junit.framework.TestSuite.run(TestSuite.java:224)
	at junit.framework.TestSuite.runTest(TestSuite.java)
	at junit.framework.TestSuite.run(TestSuite.java:224)
	at org.apache.tools.ant.taskdefs.optional.junit.JUnitTestRunner.run(JUnitTestRunner.java:294)
	at org.apache.tools.ant.taskdefs.optional.junit.JUnitTestRunner.launch(JUnitTestRunner.java:670)
	at org.apache.tools.ant.taskdefs.optional.junit.JUnitTestRunner.main(JUnitTestRunner.java:545)
java.net.ConnectException: localhost/127.0.0.1:631 - Connection refused
	at org.apache.harmony.luni.net.PlainSocketImpl.connect(PlainSocketImpl.java:229)
	at org.apache.harmony.luni.net.PlainSocketImpl.connect(PlainSocketImpl.java:508)
	at java.net.Socket.connect(Socket.java:930)
	at org.apache.harmony.luni.internal.net.www.protocol.http.HttpURLConnection.getHTTPConnection(HttpURLConnection.java:635)
	at org.apache.harmony.luni.internal.net.www.protocol.http.HttpURLConnection.connect(HttpURLConnection.java:616)
	at org.apache.harmony.x.print.ipp.IppClient.request(IppClient.java:110)
	at org.apache.harmony.x.print.ipp.IppClient.request(IppClient.java:87)
	at org.apache.harmony.x.print.cups.CUPSPrintServiceProvider.findDefaultPrintService(CUPSPrintServiceProvider.java:471)
	at org.apache.harmony.x.print.cups.CUPSPrintServiceProvider.getDefaultPrintService(CUPSPrintServiceProvider.java:168)
	at javax.print.PrintServiceLookup.lookupDefaultPrintService(PrintServiceLookup.java:138)
	at javax.print.attribute.HashAttributeTest.testEquals(HashAttributeTest.java:283)
	at java.lang.reflect.VMReflection.invokeMethod(Native Method)
	at java.lang.reflect.Method.invoke(Unknown Source)
	at junit.framework.TestCase.runTest(TestCase.java:164)
	at junit.framework.TestCase.runBare(TestCase.java:128)
	at junit.framework.TestResult$1.protect(TestResult.java)
	at junit.framework.TestResult.runProtected(TestResult.java)
	at junit.framework.TestResult.run(TestResult.java:104)
	at junit.framework.TestCase.run(TestCase.java)
	at junit.framework.TestSuite.runTest(TestSuite.java)
	at junit.framework.TestSuite.run(TestSuite.java:224)
	at junit.framework.TestSuite.runTest(TestSuite.java)
	at junit.framework.TestSuite.run(TestSuite.java:224)
	at org.apache.tools.ant.taskdefs.optional.junit.JUnitTestRunner.run(JUnitTestRunner.java:294)
	at org.apache.tools.ant.taskdefs.optional.junit.JUnitTestRunner.launch(JUnitTestRunner.java:670)
	at org.apache.tools.ant.taskdefs.optional.junit.JUnitTestRunner.main(JUnitTestRunner.java:545)
Compiling REGEX classes
Compiling REGEX tests
Since fork is false, ignoring memoryMaximumSize setting
Compiling RMI classes
Compiling RMI api tests
Since fork is false, ignoring memoryMaximumSize setting
Running RMI api tests
Unexporting MyRemoteObject1[UnicastServerRef[endpoint:[[10.125.122.35:58754]](local), ObjID[65536,
UID[4202cba0:110786a5119:-7ff7]]]] ...
Done.
Unexporting MyRemoteObject1[UnicastServerRef[endpoint:[[10.125.122.35:58755]](local), ObjID[65537,
UID[4202cba0:110786a5119:-7ff6]]]] ...
Done.
Unexporting MyRemoteObject1[UnicastServerRef[endpoint:[[10.125.122.35:58756]](local), ObjID[65538,
UID[4202cba0:110786a5119:-7ff5]]]] ...
Done.
Unexporting MyRemoteObject1[UnicastServerRef[endpoint:[[10.125.122.35:58757]](local), ObjID[65539,
UID[4202cba0:110786a5119:-7ff4]]]] ...
Done.
Unexporting MyRemoteObject1[UnicastServerRef[endpoint:[[10.125.122.35:58758]](local), ObjID[65540,
UID[4202cba0:110786a5119:-7ff3]]]] ...
Done.
Unexporting MyRemoteObject1[UnicastServerRef[endpoint:[[10.125.122.35:58759]](local), ObjID[65541,
UID[4202cba0:110786a5119:-7ff2]]]] ...
Done.
Unexporting MyRemoteObject1[UnicastServerRef[endpoint:[[10.125.122.35:58760]](local), ObjID[65542,
UID[4202cba0:110786a5119:-7ff1]]]] ...
Done.
Unexporting MyRemoteObject1[UnicastServerRef[endpoint:[[10.125.122.35:58761]](local), ObjID[65543,
UID[4202cba0:110786a5119:-7ff0]]]] ...
Done.
LogStream[tst]:
Compiling SECURITY classes
Compiling SECURITY test support files
Since fork is false, ignoring memoryMaximumSize setting
Compiling SECURITY api tests
Since fork is false, ignoring memoryMaximumSize setting
Compiling SECURITY api injected tests
Since fork is false, ignoring memoryMaximumSize setting
Compiling SECURITY impl injected tests
Since fork is false, ignoring memoryMaximumSize setting
Compiling SECURITY impl tests
Since fork is false, ignoring memoryMaximumSize setting
Running SECURITY api tests
Running SECURITY api.injected tests
Running SECURITY impl tests
Running SECURITY impl injected tests
Compiling SOUND classes
Compiling SOUND tests
Since fork is false, ignoring memoryMaximumSize setting
Compiling SQL classes
Compiling SQL tests
Since fork is false, ignoring memoryMaximumSize setting
Compiling Sun Compat classes
Compiling SUNCOMPAT tests
Compiling SWING classes
Compiling SWING tests
Since fork is false, ignoring memoryMaximumSize setting
Compiling TEXT classes
Compiling TEXT tests
Since fork is false, ignoring memoryMaximumSize setting
Compiling TOOLS classes
Compiling Tools tests
Since fork is false, ignoring memoryMaximumSize setting
Compiling X-NET classes
Compiling X-NET test support files
Compiling X-NET api tests
Since fork is false, ignoring memoryMaximumSize setting
Compiling X-NET impl injected tests
Since fork is false, ignoring memoryMaximumSize setting
Compiling X-NET impl tests
Since fork is false, ignoring memoryMaximumSize setting
Running X-NET api tests
Running X-NET impl tests
Running X-NET impl injected tests
The test report is in /export/cruise/trunk/cc/projects/classlib/trunk/build/test_report/html/index.html

***********************************************************
Unit Tests: (19284)
        
failure: test_isCompatibleWithLjava_lang_String org.apache.harmony.luni.tests.java.lang.PackageTest
Unit Test Error Details:	(1)
                
Test: test_isCompatibleWithLjava_lang_StringClass: org.apache.harmony.luni.tests.java.lang.PackageTestjunit.framework.AssertionFailedError:
Exception during isCompatibleWith test : Wrong version to check: should not start or end with
'.'
	at org.apache.harmony.luni.tests.java.lang.PackageTest.test_isCompatibleWithLjava_lang_String(PackageTest.java:333)
	at java.lang.reflect.VMReflection.invokeMethod(Native Method)


***********************************************************
Modifications since last successful build:	(34)
            
modified varlax  /harmony/enhanced/drlvm/trunk/vm/jitrino/src/codegenerator/ia32/Ia32IRManager.cpp
01/31/2007 18:54:34 Applied HARMONY-3063 [drlvm][jit] ArrayCopyRepMove does not work on EM64TTested
on SUSE9@x64
modified varlax  /harmony/enhanced/drlvm/trunk/vm/jitrino/src/translator/java/JavaByteCodeTranslator.cpp
01/31/2007 18:54:34 Applied HARMONY-3063 [drlvm][jit] ArrayCopyRepMove does not work on EM64TTested
on SUSE9@x64
modified varlax  /harmony/enhanced/drlvm/trunk/vm/jitrino/src/codegenerator/ia32/Ia32InstCodeSelector.cpp
01/31/2007 18:54:34 Applied HARMONY-3063 [drlvm][jit] ArrayCopyRepMove does not work on EM64TTested
on SUSE9@x64
modified ayza  /harmony/enhanced/classlib/trunk/modules/logging/src/main/java/org/apache/harmony/logging/internal/nls/messages.properties
01/31/2007 18:48:05 Implementation of LogManager.getLoggingMXBean() was added - HARMONY-3075
([classlib][logging] implementation of getLoggingMXBean)
modified ayza  /harmony/enhanced/classlib/trunk/modules/logging/src/main/java/java/util/logging/LogManager.java
01/31/2007 18:48:05 Implementation of LogManager.getLoggingMXBean() was added - HARMONY-3075
([classlib][logging] implementation of getLoggingMXBean)
add cc-drlvm log20070131182544Lbuild.46 01/31/2007 18:25:44drlvm
add cc-classlib log20070131181020Lbuild.45 01/31/2007 18:10:20classlib
modified tellison  /harmony/enhanced/classlib/trunk/modules/jndi/src/test/java/org/apache/harmony/jndi/tests/javax/naming/spi/NamingManagerTest.java
01/31/2007 18:09:15 Fix JNDI test so it doesn't leave resource behind.
added ayza  /harmony/enhanced/classlib/trunk/modules/lang-management/src/test/impl/java/org/apache/harmony/lang/management/SingleInstanceDynamicMXBeanImplTestBase.java
01/31/2007 17:59:41 Applying the patch from HARMONY-2019 ([classlib][awt] Container.remove(null)
expected NPE)
modified ayza  /harmony/enhanced/classlib/trunk/modules/lang-management/src/test/impl/java/org/apache/harmony/lang/management/ThreadMXBeanImplTest.java
01/31/2007 17:59:41 Applying the patch from HARMONY-2019 ([classlib][awt] Container.remove(null)
expected NPE)
modified ayza  /harmony/enhanced/classlib/trunk/modules/lang-management/src/test/impl/java/org/apache/harmony/lang/management/MemoryMXBeanImplTest.java
01/31/2007 17:59:41 Applying the patch from HARMONY-2019 ([classlib][awt] Container.remove(null)
expected NPE)
modified ayza  /harmony/enhanced/classlib/trunk/modules/lang-management/src/test/impl/java/org/apache/harmony/lang/management/MemoryManagerImplTest.java
01/31/2007 17:59:41 Applying the patch from HARMONY-2019 ([classlib][awt] Container.remove(null)
expected NPE)
deleted ayza  /harmony/enhanced/classlib/trunk/modules/lang-management/src/test/impl/java/org/apache/harmony/lang/management/SingleInstanceDynamicMXBeanImplTest.java
01/31/2007 17:59:41 Applying the patch from HARMONY-2019 ([classlib][awt] Container.remove(null)
expected NPE)
modified ayza  /harmony/enhanced/classlib/trunk/modules/lang-management/src/test/impl/java/org/apache/harmony/lang/management/CompilationMXBeanImplTest.java
01/31/2007 17:59:41 Applying the patch from HARMONY-2019 ([classlib][awt] Container.remove(null)
expected NPE)
added ayza  /harmony/enhanced/classlib/trunk/modules/lang-management/src/test/impl/java/org/apache/harmony/lang/management/DynamicMXBeanImplTestBase.java
01/31/2007 17:59:41 Applying the patch from HARMONY-2019 ([classlib][awt] Container.remove(null)
expected NPE)
added ayza  /harmony/enhanced/classlib/trunk/modules/lang-management/src/test/impl/java/org/apache/harmony/lang/management/MultiInstanceDynamicMXBeanImplTestBase.java
01/31/2007 17:59:41 Applying the patch from HARMONY-2019 ([classlib][awt] Container.remove(null)
expected NPE)
modified ayza  /harmony/enhanced/classlib/trunk/modules/lang-management/src/test/impl/java/org/apache/harmony/lang/management/RuntimeMXBeanImplTest.java
01/31/2007 17:59:41 Applying the patch from HARMONY-2019 ([classlib][awt] Container.remove(null)
expected NPE)
deleted ayza  /harmony/enhanced/classlib/trunk/modules/lang-management/src/test/impl/java/org/apache/harmony/lang/management/DynamicMXBeanImplTest.java
01/31/2007 17:59:41 Applying the patch from HARMONY-2019 ([classlib][awt] Container.remove(null)
expected NPE)
deleted ayza  /harmony/enhanced/classlib/trunk/modules/lang-management/src/test/impl/java/org/apache/harmony/lang/management/MultiInstanceDynamicMXBeanImplTest.java
01/31/2007 17:59:41 Applying the patch from HARMONY-2019 ([classlib][awt] Container.remove(null)
expected NPE)
modified ayza  /harmony/enhanced/classlib/trunk/modules/lang-management/src/test/impl/java/org/apache/harmony/lang/management/LoggingMXBeanImplTest.java
01/31/2007 17:59:41 Applying the patch from HARMONY-2019 ([classlib][awt] Container.remove(null)
expected NPE)
modified ayza  /harmony/enhanced/classlib/trunk/modules/lang-management/src/test/impl/java/org/apache/harmony/lang/management/OperatingSystemMXBeanImplTest.java
01/31/2007 17:59:41 Applying the patch from HARMONY-2019 ([classlib][awt] Container.remove(null)
expected NPE)
modified ayza  /harmony/enhanced/classlib/trunk/modules/lang-management/src/test/impl/java/org/apache/harmony/lang/management/GarbageCollectorMXBeanImplTest.java
01/31/2007 17:59:41 Applying the patch from HARMONY-2019 ([classlib][awt] Container.remove(null)
expected NPE)
modified ayza  /harmony/enhanced/classlib/trunk/modules/lang-management/src/test/impl/java/org/apache/harmony/lang/management/MemoryPoolMXBeanImplTest.java
01/31/2007 17:59:41 Applying the patch from HARMONY-2019 ([classlib][awt] Container.remove(null)
expected NPE)
modified ayza  /harmony/enhanced/classlib/trunk/modules/lang-management/src/test/impl/java/org/apache/harmony/lang/management/ClassLoadingMXBeanImplTest.java
01/31/2007 17:59:41 Applying the patch from HARMONY-2019 ([classlib][awt] Container.remove(null)
expected NPE)
modified tellison  /harmony/enhanced/classlib/trunk/depends/jars 01/31/2007 17:58:19 Add new
Yoko dir to svn ignore list.
modified varlax  /harmony/enhanced/drlvm/trunk/vm/vmcore/src/kernel_classes/javasrc/java/lang/Package.java
01/31/2007 17:39:43 HARMONY-2470: [classlib] PackageTest and [drlvm] Package.isCompatible()
fixed
modified varlax  /harmony/enhanced/classlib/trunk/modules/luni/src/test/java/org/apache/harmony/luni/tests/java/lang/PackageTest.java
01/31/2007 17:39:43 HARMONY-2470: [classlib] PackageTest and [drlvm] Package.isCompatible()
fixed
modified varlax  /harmony/enhanced/classlib/trunk/modules/luni/make/exclude.windows.x86.ibm
01/31/2007 17:39:43 HARMONY-2470: [classlib] PackageTest and [drlvm] Package.isCompatible()
fixed
modified varlax  /harmony/enhanced/classlib/trunk/modules/luni/make/exclude.linux.x86.ibm
01/31/2007 17:39:43 HARMONY-2470: [classlib] PackageTest and [drlvm] Package.isCompatible()
fixed
modified varlax  /harmony/enhanced/drlvm/trunk/vm/vmcore/src/kernel_classes/javasrc/java/lang/Package.java
01/31/2007 17:39:43 HARMONY-2470: [classlib] PackageTest and [drlvm] Package.isCompatible()
fixed
modified varlax  /harmony/enhanced/classlib/trunk/modules/luni/src/test/java/org/apache/harmony/luni/tests/java/lang/PackageTest.java
01/31/2007 17:39:43 HARMONY-2470: [classlib] PackageTest and [drlvm] Package.isCompatible()
fixed
modified varlax  /harmony/enhanced/classlib/trunk/modules/luni/make/exclude.windows.x86.ibm
01/31/2007 17:39:43 HARMONY-2470: [classlib] PackageTest and [drlvm] Package.isCompatible()
fixed
modified varlax  /harmony/enhanced/classlib/trunk/modules/luni/make/exclude.linux.x86.ibm
01/31/2007 17:39:43 HARMONY-2470: [classlib] PackageTest and [drlvm] Package.isCompatible()
fixed
modified smishura  /harmony/enhanced/drlvm/trunk/build/make/targets/cunit.test.xml 01/31/2007
17:34:26 Apply patch for HARMONY-3009:[drlvm][testing] generation of results of cunit test
run in html viewTested on Windows and Linux. After applying the patch I'd observed strange
'test_native_basic' failures (2 times) on Windows. But after full VM rebuild I can not reproduce
it any more.

Mime
View raw message