harmony-alerts mailing list archives

Site index · List index
Message view « Date » · « Thread »
Top « Date » · « Thread »
From nom...@intel.com
Subject [build-test alert] BUILD FAILED Windows XP SP2 msvc debug: classlib over drlvm
Date Tue, 30 Jan 2007 10:33:12 GMT
BUILD FAILED:
	Ant Error Message:
C:\cruise\trunk\cc\projects\classlib\trunk\build.xml:167: The following error occurred while
executing this line: C:\cruise\trunk\cc\projects\classlib\trunk\make\build-test.xml:138: There
were test errors.

Date of build:	01/30/2007 15:58:51
Time to build:	32 minutes 51 seconds
Last changed:	01/30/2007 14:52:11
Last log entry:	drlvm

***********************************************************
Errors/Warnings:	(187)
            

========================================
Testing class libraries...
========================================

Checking for depends/jars/yoko_M2-20061115/yoko.jar
Checking for depends/jars/yoko_M2-20061115/yoko-core.jar
Checking for depends/jars/yoko_M1-20061027/yoko-rmi.jar
Checking for depends/jars/bcel-5.2/bcel-5.2.jar
Checking for depends/jars/xalan-j_2.7.0/xalan.jar
Checking for depends/jars/xerces_2.8.0/resolver.jar
Checking for depends/jars/xerces_2.8.0/xercesImpl.jar
Checking for depends/jars/xerces_2.8.0/xml-apis.jar
Checking for depends/jars/junit_3.8.2/junit.jar
Checking for depends/jars/bcprov-jdk15-134/bcprov.jar
Checking for depends/jars/icu4j_3.4.4/icu4j_3_4_4.jar
Checking for depends/jars/mx4j_3.0.1/mx4j.jar
Checking for depends/jars/mx4j_3.0.1/mx4j-remote.jar
Checking for depends/jars/ecj_3.2/ecj_3.2.jar
Checking for depends/jars/jetty/jetty-6.0.0.jar
Checking for depends/jars/jetty/jetty-util-6.0.0.jar
Checking for depends/jars/jetty/servlet-api-2.5-6.0.0.jar
Checking for depends/libs/windows.x86/msvcr71.dll
Checking for depends/libs/windows.x86/swing_awt_deps_winxp_2006-09-28.tgz
Since fork is false, ignoring memoryMaximumSize setting
Compiling ACCESSIBILITY classes
Compiling ACCESSIBILITY tests
Since fork is false, ignoring memoryMaximumSize setting
Compiling ANNOTATION classes
Compiling ANNOTATION tests
Since fork is false, ignoring memoryMaximumSize setting
Compiling APPLET classes
Compiling APPLET tests
Since fork is false, ignoring memoryMaximumSize setting
Compiling ARCHIVE classes
Compiling ARCHIVE tests
Since fork is false, ignoring memoryMaximumSize setting
Compiling AUTH classes
Compiling AUTH tests
Since fork is false, ignoring memoryMaximumSize setting
Compiling AWT classes
Compiling AWT tests
Since fork is false, ignoring memoryMaximumSize setting
java.lang.RuntimeException: expected from EDT
	at java.awt.EventDispatchThreadRTest$1.run(EventDispatchThreadRTest.java:29)
	at java.awt.event.InvocationEvent.runAndNotify(InvocationEvent.java:90)
	at java.awt.event.InvocationEvent.dispatch(InvocationEvent.java:77)
	at java.awt.EventQueueCore.dispatchEventImpl(EventQueueCore.java:138)
	at java.awt.EventQueue.dispatchEvent(EventQueue.java:144)
	at java.awt.EventDispatchThread.runModalLoop(EventDispatchThread.java:73)
	at java.awt.EventDispatchThread.run(EventDispatchThread.java:45)
Compiling BEANS classes
Compiling support classes for BEANS tests
Compiling internal BEANS tests
Compiling BEANS tests
Since fork is false, ignoring memoryMaximumSize setting
Running internal BEANS tests
Running BEANS tests
Compiling CRYPTO classes
Compiling CRYPTO test support files
Since fork is false, ignoring memoryMaximumSize setting
Compiling CRYPTO api tests
Since fork is false, ignoring memoryMaximumSize setting
Compiling CRYPTO api injected tests
Since fork is false, ignoring memoryMaximumSize setting
Compiling CRYPTO impl injected tests
Since fork is false, ignoring memoryMaximumSize setting
Compiling CRYPTO impl tests
Since fork is false, ignoring memoryMaximumSize setting
Running CRYPTO api tests
Running CRYPTO api.injected tests
Running CRYPTO impl tests
Running CRYPTO impl injected tests
Compiling ImageIO classes
Compiling ImageIO tests
Compiling INSTRUMENT classes
Compiling INSTRUMENT tests
Since fork is false, ignoring memoryMaximumSize setting
Compiling JNDI classes
Compiling JNDI tests
Since fork is false, ignoring memoryMaximumSize setting
Compiling LANG-MANAGEMENT classes
Compiling LANG-MANAGEMENT API tests
Compiling LANG-MANAGEMENT Implementation tests
Compiling LOGGING classes
Compiling LOGGING tests
Since fork is false, ignoring memoryMaximumSize setting
Compiling LUNI classes
Compiling LUNI JUnit Tests
Since fork is false, ignoring memoryMaximumSize setting
Running LUNI JUnit Tests
Compiling MATH classes
Compiling MATH tests
Since fork is false, ignoring memoryMaximumSize setting
Compiling MISC classes
Compiling MISC tests
Since fork is false, ignoring memoryMaximumSize setting
Compiling NIO classes
Compiling NIO tests
Since fork is false, ignoring memoryMaximumSize setting
Compiling NIO_CHAR classes
Compiling NIO_CHAR tests
Since fork is false, ignoring memoryMaximumSize setting
Cannot find unmappable byte array for US-ASCII
Cannot find unmappable byte array for gb18030
Cannot find unmappable byte array for ISO-8859-1
Cannot find malform byte array for ISO-8859-1
Cannot find unmappable byte array for UTF-16BE
Cannot find malform byte array for UTF-16BE
Cannot find unmappable byte array for UTF-16LE
Cannot find malform byte array for UTF-16LE
Cannot find unmappable byte array for UTF-8
Compiling PACK200 classes
Compiling PACK200 tests
Since fork is false, ignoring memoryMaximumSize setting
Running PACK200 tests
Compiling PREFS classes
Compiling PREFS tests
Since fork is false, ignoring memoryMaximumSize setting
Compiling PRINT classes
Compiling Print tests
Since fork is false, ignoring memoryMaximumSize setting
Compiling REGEX classes
Compiling REGEX tests
Since fork is false, ignoring memoryMaximumSize setting
Compiling RMI classes
Compiling RMI api tests
Since fork is false, ignoring memoryMaximumSize setting
Running RMI api tests
Unexporting MyRemoteObject1[UnicastServerRef[endpoint:[[10.125.122.37:3065]](local), ObjID[65536,
UID[20af77d0:11072809f5e:-7ff7]]]] ...
Done.
Unexporting MyRemoteObject1[UnicastServerRef[endpoint:[[10.125.122.37:3066]](local), ObjID[65537,
UID[20af77d0:11072809f5e:-7ff6]]]] ...
Done.
Unexporting MyRemoteObject1[UnicastServerRef[endpoint:[[10.125.122.37:3067]](local), ObjID[65538,
UID[20af77d0:11072809f5e:-7ff5]]]] ...
Done.
Unexporting MyRemoteObject1[UnicastServerRef[endpoint:[[10.125.122.37:3068]](local), ObjID[65539,
UID[20af77d0:11072809f5e:-7ff4]]]] ...
Done.
Unexporting MyRemoteObject1[UnicastServerRef[endpoint:[[10.125.122.37:3069]](local), ObjID[65540,
UID[20af77d0:11072809f5e:-7ff3]]]] ...
Done.
Unexporting MyRemoteObject1[UnicastServerRef[endpoint:[[10.125.122.37:3070]](local), ObjID[65541,
UID[20af77d0:11072809f5e:-7ff2]]]] ...
Done.
Unexporting MyRemoteObject1[UnicastServerRef[endpoint:[[10.125.122.37:3071]](local), ObjID[65542,
UID[20af77d0:11072809f5e:-7ff1]]]] ...
Done.
Unexporting MyRemoteObject1[UnicastServerRef[endpoint:[[10.125.122.37:3072]](local), ObjID[65543,
UID[20af77d0:11072809f5e:-7ff0]]]] ...
Done.
LogStream[tst]:
Compiling SECURITY classes
Compiling SECURITY test support files
Since fork is false, ignoring memoryMaximumSize setting
Compiling SECURITY api tests
Since fork is false, ignoring memoryMaximumSize setting
Compiling SECURITY api injected tests
Since fork is false, ignoring memoryMaximumSize setting
Compiling SECURITY impl injected tests
Since fork is false, ignoring memoryMaximumSize setting
Compiling SECURITY impl tests
Since fork is false, ignoring memoryMaximumSize setting
Running SECURITY api tests
Running SECURITY api.injected tests
Running SECURITY impl tests
Running SECURITY impl injected tests
Compiling SOUND classes
Compiling SOUND tests
Since fork is false, ignoring memoryMaximumSize setting
Compiling SQL classes
Compiling SQL tests
Since fork is false, ignoring memoryMaximumSize setting
Compiling Sun Compat classes
Compiling SUNCOMPAT tests
Compiling SWING classes
Compiling SWING tests
Since fork is false, ignoring memoryMaximumSize setting
Compiling TEXT classes
Compiling TEXT tests
Since fork is false, ignoring memoryMaximumSize setting
Compiling TOOLS classes
Compiling Tools tests
Since fork is false, ignoring memoryMaximumSize setting
Compiling X-NET classes
Compiling X-NET test support files
Compiling X-NET api tests
Since fork is false, ignoring memoryMaximumSize setting
Compiling X-NET impl injected tests
Since fork is false, ignoring memoryMaximumSize setting
Compiling X-NET impl tests
Since fork is false, ignoring memoryMaximumSize setting
Running X-NET api tests
Running X-NET impl tests
Running X-NET impl injected tests
The test report is in C:\cruise\trunk\cc\projects\classlib\trunk\build\test_report\html\index.html

***********************************************************
Unit Tests: (19370)
        
error: test_getJarFile29 tests.api.java.net.JarURLConnectionTest
Unit Test Error Details:	(1)
                
Test: test_getJarFile29Class: tests.api.java.net.JarURLConnectionTestjava.util.zip.ZipException:
Unable to open: \\C\DOCUME~1\LABDRL~1\LOCALS~1\Temp\1+2 313138test.jar
	at java.util.zip.ZipFile.openZip(ZipFile.java:120)
	at java.util.zip.ZipFile.<init>(ZipFile.java:93)
	at java.util.jar.JarFile.<init>(JarFile.java)
	at org.apache.harmony.luni.internal.net.www.protocol.jar.JarURLConnection.openJarFile(JarURLConnection.java:268)
	at org.apache.harmony.luni.internal.net.www.protocol.jar.JarURLConnection.findJarFile(JarURLConnection.java:198)
	at org.apache.harmony.luni.internal.net.www.protocol.jar.JarURLConnection.connect(JarURLConnection.java:158)
	at org.apache.harmony.luni.internal.net.www.protocol.jar.JarURLConnection.getJarFile(JarURLConnection.java:175)
	at tests.api.java.net.JarURLConnectionTest.test_getJarFile29(JarURLConnectionTest.java:146)
	at java.lang.reflect.VMReflection.invokeMethod(Native Method)


***********************************************************
Modifications since last successful build:	(2)
            
add cc-drlvm log20070130145211Lbuild.48 01/30/2007 14:52:11drlvm
add cc-classlib log20070130143449Lbuild.42 01/30/2007 14:34:49classlib

Mime
View raw message