harmony-alerts mailing list archives

Site index · List index
Message view « Date » · « Thread »
Top « Date » · « Thread »
From nom...@hursley.ibm.com
Subject [continuum] BUILD FAILURE: Classlib/linux.ia32 Build/Test
Date Mon, 29 Jan 2007 11:32:33 GMT
Online report : http://people.apache.org/~hindessm/continuum/classlib/linux.ia32/2007/01/29/20070129-113233.failure.log.gz
Build statistics:
  State: Failed
  Previous State: Ok
  Started at: Mon, 29 Jan 2007 10:29:23 +0000
  Finished at: Mon, 29 Jan 2007 11:32:31 +0000
  Total time: 1h 3m 7s
  Build Trigger: Schedule
  Exit code: 1
  Building machine hostname: hy2
  Operating system : Linux(unknown)
  Java version : 1.5.0_06(Sun Microsystems Inc.)

Changes
                            classlib/modules/swing/src/test/api/java/common/javax/swing/DefaultListModelTest.java
            classlib/modules/swing/src/test/api/java/common/javax/swing/plaf/basic/BasicScrollBarUITest.java
            classlib/modules/swing/src/main/java/common/org/apache/harmony/x/swing/internal/nls/messages.properties
            classlib/modules/swing/src/main/java/common/javax/swing/DefaultListModel.java
            classlib/modules/nio/src/main/java/java/nio/channels/SocketChannel.java
            classlib/modules/nio/src/main/java/java/nio/channels/DatagramChannel.java
            classlib/modules/pack200/.classpath
            classlib/modules/pack200/META-INF/MANIFEST.MF
            classlib/modules/pack200/src/test/java/org/apache/harmony/pack200/tests/SegmentTest.java
            classlib/modules/pack200/src/test/java/org/apache/harmony/pack200/tests/ClassVersionTest.java
            classlib/modules/pack200/src/main/java/org/apache/harmony/pack200/AttributeLayout.java
            classlib/modules/pack200/src/main/java/org/apache/harmony/pack200/Segment.java
            classlib/modules/pack200/src/main/java/org/apache/harmony/pack200/PopulationCodec.java
            classlib/modules/pack200/src/main/java/org/apache/harmony/pack200/BHSDCodec.java
            classlib/modules/pack200/src/main/java/org/apache/harmony/pack200/bytecode/CPFieldRef.java
            classlib/modules/pack200/src/main/java/org/apache/harmony/pack200/bytecode/Attribute.java
            classlib/modules/pack200/src/main/java/org/apache/harmony/pack200/bytecode/ExceptionsAttribute.java
            classlib/modules/pack200/src/main/java/org/apache/harmony/pack200/bytecode/CPUTF8.java
            classlib/modules/pack200/src/main/java/org/apache/harmony/pack200/bytecode/ConstantValueAttribute.java
            classlib/modules/pack200/src/main/java/org/apache/harmony/pack200/bytecode/CPConstant.java
            classlib/modules/pack200/src/main/java/org/apache/harmony/pack200/bytecode/CPInteger.java
            classlib/modules/pack200/src/main/java/org/apache/harmony/pack200/bytecode/CPLong.java
            classlib/modules/pack200/src/main/java/org/apache/harmony/pack200/bytecode/SourceFileAttribute.java
            classlib/modules/pack200/src/main/java/org/apache/harmony/pack200/bytecode/CPNameAndType.java
            classlib/modules/pack200/src/main/java/org/apache/harmony/pack200/bytecode/CPFloat.java
            classlib/modules/pack200/src/main/java/org/apache/harmony/pack200/bytecode/CPClass.java
            classlib/modules/pack200/src/main/java/org/apache/harmony/pack200/bytecode/CPString.java
            classlib/modules/pack200/src/main/java/org/apache/harmony/pack200/bytecode/CPMember.java
            classlib/modules/pack200/src/main/java/org/apache/harmony/pack200/bytecode/CPDouble.java
            classlib/modules/pack200/src/main/java5/org/apache/harmony/pack200/Pack200Adapter.java
            classlib/modules/pack200/src/main/java5/org/apache/harmony/pack200/Pack200PackerAdapter.java
            classlib/modules/pack200/src/main/java5/org/apache/harmony/pack200/Pack200UnpackerAdapter.java
            classlib/modules/pack200/make/exclude.common
            classlib/modules/pack200/make/hyproperties.xml
            classlib/modules/pack200/.settings/org.eclipse.jdt.core.prefs
            classlib/modules/pack200/build.xml
            classlib/modules/luni/src/main/java/java/net/Socket.java
            classlib/modules/luni/src/main/java/java/net/DatagramSocket.java
            classlib/modules/luni/src/main/java/org/apache/harmony/luni/platform/OSNetworkSystem.java
            classlib/modules/luni/src/main/java/org/apache/harmony/luni/platform/INetworkSystem.java
            classlib/modules/luni/src/main/native/luni/unix/libhyluni.exp
            classlib/modules/luni/src/main/native/luni/shared/nethelp.c
            classlib/modules/luni/src/main/native/luni/shared/OSNetworkSystem.c
        
****************************************************************************
Output:
****************************************************************************
Buildfile: build.xml

svn-prop:

build:
   [delete] Deleting directory /home/hybld/continuum-working-directory/6/classlib/deploy
     [echo] Classlib revision is 500999
     [echo] Post process: true
     [echo] JAPI: true
     [echo] Building with reference jdk/javac
     [exec] Buildfile: build.xml

     [exec] -init-hdk-for-clean:
     [exec]     [mkdir] Created dir: /home/hybld/continuum-working-directory/6/classlib/deploy/build/ant
     [exec]      [copy] Copying 1 file to /home/hybld/continuum-working-directory/6/classlib/deploy/build/ant

     [exec] clean-java:

     [exec] -modules-clean-bin:

     [exec] clean:
     [exec]    [delete] Deleting 30 files from /home/hybld/continuum-working-directory/6/classlib/build/classes
     [exec]    [delete] Deleting 12 files from /home/hybld/continuum-working-directory/6/classlib/modules/accessibility/bin/test

     [exec] clean:
     [exec]    [delete] Deleting 13 files from /home/hybld/continuum-working-directory/6/classlib/build/classes
     [exec]    [delete] Deleting 1 files from /home/hybld/continuum-working-directory/6/classlib/modules/annotation/bin/test

     [exec] clean:
     [exec]    [delete] Deleting 35 files from /home/hybld/continuum-working-directory/6/classlib/build/classes
     [exec]    [delete] Deleting 1 files from /home/hybld/continuum-working-directory/6/classlib/modules/applet/bin/test

     [exec] clean:
     [exec]    [delete] Deleting 41 files from /home/hybld/continuum-working-directory/6/classlib/build/classes
     [exec]    [delete] Deleting 34 files from /home/hybld/continuum-working-directory/6/classlib/modules/archive/bin/test

     [exec] clean-native-includes:
     [exec]    [delete] /home/hybld/continuum-working-directory/6/classlib/deploy/include
not found.

     [exec] clean:
     [exec]    [delete] Deleting 112 files from /home/hybld/continuum-working-directory/6/classlib/build/classes
     [exec]    [delete] Deleting 226 files from /home/hybld/continuum-working-directory/6/classlib/modules/auth/bin/test

     [exec] clean:
     [exec]    [delete] Deleting 901 files from /home/hybld/continuum-working-directory/6/classlib/build/classes
     [exec]    [delete] Deleting 608 files from /home/hybld/continuum-working-directory/6/classlib/modules/awt/bin/test

     [exec] clean:
     [exec]    [delete] Deleting 107 files from /home/hybld/continuum-working-directory/6/classlib/build/classes
     [exec]    [delete] Deleting 238 files from /home/hybld/continuum-working-directory/6/classlib/modules/beans/bin/test

     [exec] clean:
     [exec]    [delete] Deleting 125 files from /home/hybld/continuum-working-directory/6/classlib/build/classes
     [exec]    [delete] /home/hybld/continuum-working-directory/6/classlib/modules/concurrent/bin/test
not found.

     [exec] clean:
     [exec]    [delete] Deleting 48 files from /home/hybld/continuum-working-directory/6/classlib/build/classes
     [exec]    [delete] Deleting 90 files from /home/hybld/continuum-working-directory/6/classlib/modules/crypto/bin/test

     [exec] clean:
     [exec]    [delete] Deleting 87 files from /home/hybld/continuum-working-directory/6/classlib/build/classes

     [exec] clean:
     [exec]    [delete] Deleting 9 files from /home/hybld/continuum-working-directory/6/classlib/build/classes
     [exec]    [delete] Deleting 20 files from /home/hybld/continuum-working-directory/6/classlib/modules/instrument/bin/test

     [exec] clean:
     [exec]    [delete] Deleting 154 files from /home/hybld/continuum-working-directory/6/classlib/build/classes
     [exec]    [delete] Deleting 163 files from /home/hybld/continuum-working-directory/6/classlib/modules/jndi/bin/test

     [exec] clean:
     [exec]    [delete] Deleting 43 files from /home/hybld/continuum-working-directory/6/classlib/build/classes
     [exec]    [delete] /home/hybld/continuum-working-directory/6/classlib/modules/lang-management/${hy.lang-management.bin.test}
not found.

     [exec] clean:
     [exec]    [delete] Deleting 34 files from /home/hybld/continuum-working-directory/6/classlib/build/classes
     [exec]    [delete] Deleting 99 files from /home/hybld/continuum-working-directory/6/classlib/modules/logging/bin/test

     [exec] clean:
     [exec]    [delete] Deleting 963 files from /home/hybld/continuum-working-directory/6/classlib/build/classes
     [exec]    [delete] Deleting 906 files from /home/hybld/continuum-working-directory/6/classlib/modules/luni/bin/test

     [exec] clean-native-includes:
     [exec]    [delete] /home/hybld/continuum-working-directory/6/classlib/deploy/include
not found.
     [exec]    [delete] /home/hybld/continuum-working-directory/6/classlib/deploy/jdk/include
not found.

     [exec] clean:
     [exec]    [delete] Deleting 29 files from /home/hybld/continuum-working-directory/6/classlib/build/classes

     [exec] clean:
     [exec]    [delete] Deleting 14 files from /home/hybld/continuum-working-directory/6/classlib/build/classes
     [exec]    [delete] Deleting 25 files from /home/hybld/continuum-working-directory/6/classlib/modules/math/bin/test

     [exec] clean:
     [exec]    [delete] Deleting 14 files from /home/hybld/continuum-working-directory/6/classlib/build/classes
     [exec]    [delete] Deleting 1 files from /home/hybld/continuum-working-directory/6/classlib/modules/misc/bin/test

     [exec] clean:
     [exec]    [delete] Deleting 146 files from /home/hybld/continuum-working-directory/6/classlib/build/classes
     [exec]    [delete] Deleted 5 directories from /home/hybld/continuum-working-directory/6/classlib/build/classes
     [exec]    [delete] Deleting 156 files from /home/hybld/continuum-working-directory/6/classlib/modules/nio/bin/test

...

     [exec]     [junit] Running org.apache.harmony.pack200.tests.bytecode.ConstantPoolTest
     [exec]     [junit] Tests run: 1, Failures: 0, Errors: 0, Time elapsed: 0.361 sec
     [exec]     [junit] Tests run: 5, Failures: 0, Errors: 0, Time elapsed: 0.061 sec
     [exec]     [junit] Tests run: 3, Failures: 1, Errors: 0, Time elapsed: 0.063 sec
     [exec]     [junit] TEST org.apache.harmony.pack200.tests.ClassVersionTest FAILED
     [exec]     [junit] Tests run: 2, Failures: 0, Errors: 0, Time elapsed: 0.049 sec
     [exec]     [junit] Tests run: 9, Failures: 0, Errors: 0, Time elapsed: 0.02 sec
     [exec]     [junit] Tests run: 1, Failures: 0, Errors: 0, Time elapsed: 0.01 sec
     [exec]     [junit] Tests run: 1, Failures: 0, Errors: 0, Time elapsed: 0.007 sec
     [exec]     [junit] Tests run: 1, Failures: 0, Errors: 0, Time elapsed: 0.027 sec

...

     [exec]     [junit] Tests run: 8, Failures: 0, Errors: 0, Time elapsed: 0.019 sec
     [exec]     [junit] Tests run: 3, Failures: 0, Errors: 0, Time elapsed: 0.006 sec
     [exec]     [junit] Tests FAILED

     [exec] touch-failures-file:

     [exec] touch-errors-file:


...

     [exec] gen-report:

     [exec] check-test-result:

     [exec] BUILD FAILED
     [exec] /home/hybld/continuum-working-directory/6/classlib/build.xml:167: The following
error occurred while executing this line:
     [exec] /home/hybld/continuum-working-directory/6/classlib/make/build-test.xml:139: There
were test failures.

     [exec] Total time: 46 minutes 4 seconds
     [exec] Result: 1
     [echo] Tests.failed is set to true

japi:

     [exec] Processing class java.lang,Object:+
     [exec] Processing package java.lang,:============================================================================+-++++++++++++++++++++++++-+++++++++++++++++++++++++++++++++++++++++++++++++--^+^+++++++++--++++++++++

...

     [exec] Processing package java.lang.management,:============================================================================++++-+++++++++++
     [exec] Processing package java.lang.ref,:============================================================================+++++
     [exec] Processing package java.lang.reflect,:============================================================================+++++++++++++++++++++
     [exec] Processing class ,java:
     [exec] Failed to Japize java: java.lang.RuntimeException: NoClassDefFoundError: java
     [exec] java.lang.RuntimeException: NoClassDefFoundError: java
     [exec] 	at net.wuffies.japi.ClassFile.forName(ClassFile.java:163)
     [exec] 	at net.wuffies.japi.Japize.getClassWrapper(Japize.java:1425)
     [exec] 	at net.wuffies.japi.Japize.japizeClass(Japize.java:748)
     [exec] 	at net.wuffies.japi.Japize.processClass(Japize.java:516)

...

     [exec] 	at net.wuffies.japi.Japize.doJapize(Japize.java:443)
     [exec] 	at net.wuffies.japi.Japize.main(Japize.java:316)

     [exec] Processing class ,javax:
     [exec] Failed to Japize javax: java.lang.RuntimeException: NoClassDefFoundError: javax
     [exec] java.lang.RuntimeException: NoClassDefFoundError: javax
     [exec] 	at net.wuffies.japi.ClassFile.forName(ClassFile.java:163)
     [exec] 	at net.wuffies.japi.Japize.getClassWrapper(Japize.java:1425)
     [exec] 	at net.wuffies.japi.Japize.japizeClass(Japize.java:748)
     [exec] 	at net.wuffies.japi.Japize.processClass(Japize.java:516)

...

     [exec] 	at net.wuffies.japi.Japize.doJapize(Japize.java:443)
     [exec] 	at net.wuffies.japi.Japize.main(Japize.java:316)

     [exec] Processing class ,org:
     [exec] Failed to Japize org: java.lang.RuntimeException: NoClassDefFoundError: org
     [exec] java.lang.RuntimeException: NoClassDefFoundError: org
     [exec] 	at net.wuffies.japi.ClassFile.forName(ClassFile.java:163)
     [exec] 	at net.wuffies.japi.Japize.getClassWrapper(Japize.java:1425)
     [exec] 	at net.wuffies.japi.Japize.japizeClass(Japize.java:748)
     [exec] 	at net.wuffies.japi.Japize.processClass(Japize.java:516)

...

update-index:

test-result:

BUILD FAILED
/home/hybld/continuum-working-directory/6/build.xml:204: There were test failures.

Total time: 63 minutes 6 seconds

****************************************************************************

...

Mime
View raw message