harmony-alerts mailing list archives

Site index · List index
Message view « Date » · « Thread »
Top « Date » · « Thread »
From nom...@intel.com
Subject [build-test alert] BUILD FAILED Linux SUSE 9 64bit gcc debug: classlib over drlvm
Date Thu, 25 Jan 2007 18:20:32 GMT
BUILD FAILED:
	Ant Error Message:
/export/cruise/trunk/cc/projects/classlib/trunk/build.xml:167: The following error occurred
while executing this line: /export/cruise/trunk/cc/projects/classlib/trunk/make/build-test.xml:139:
There were test failures.

Date of build:	01/25/2007 21:54:40
Time to build:	144 minutes 57 seconds
Last changed:	01/25/2007 21:32:29
Last log entry:	drlvm

***********************************************************
Errors/Warnings:	(328)
            
Unable to load file: java.io.FileNotFoundException: /export/cruise/trunk/cc/projects/classlib/trunk/modules/concurrent/make/exclude.common
(No such file or directory)
Unable to load file: java.io.FileNotFoundException: /export/cruise/trunk/cc/projects/classlib/trunk/modules/concurrent/make/exclude.linux.x86_64.drl
(No such file or directory)
Unable to load file: java.io.FileNotFoundException: /export/cruise/trunk/cc/projects/classlib/trunk/modules/concurrent/make/exclude.linux.x86_64.drl.interm
(No such file or directory)
Unable to load file: java.io.FileNotFoundException: /export/cruise/trunk/cc/projects/classlib/trunk/modules/imageio/make/exclude.common
(No such file or directory)
Unable to load file: java.io.FileNotFoundException: /export/cruise/trunk/cc/projects/classlib/trunk/modules/imageio/make/exclude.linux.x86_64.drl
(No such file or directory)
Unable to load file: java.io.FileNotFoundException: /export/cruise/trunk/cc/projects/classlib/trunk/modules/imageio/make/exclude.linux.x86_64.drl.interm
(No such file or directory)
Unable to load file: java.io.FileNotFoundException: /export/cruise/trunk/cc/projects/classlib/trunk/modules/instrument/make/exclude.linux.x86_64.drl.interm
(No such file or directory)
Unable to load file: java.io.FileNotFoundException: /export/cruise/trunk/cc/projects/classlib/trunk/modules/jndi/make/exclude.common
(No such file or directory)
Unable to load file: java.io.FileNotFoundException: /export/cruise/trunk/cc/projects/classlib/trunk/modules/jndi/make/exclude.linux.x86_64.drl
(No such file or directory)
Unable to load file: java.io.FileNotFoundException: /export/cruise/trunk/cc/projects/classlib/trunk/modules/jndi/make/exclude.linux.x86_64.drl.interm
(No such file or directory)
Unable to load file: java.io.FileNotFoundException: /export/cruise/trunk/cc/projects/classlib/trunk/modules/logging/make/exclude.common
(No such file or directory)
Unable to load file: java.io.FileNotFoundException: /export/cruise/trunk/cc/projects/classlib/trunk/modules/logging/make/exclude.linux.x86_64.drl
(No such file or directory)
Unable to load file: java.io.FileNotFoundException: /export/cruise/trunk/cc/projects/classlib/trunk/modules/logging/make/exclude.linux.x86_64.drl.interm
(No such file or directory)
Unable to load file: java.io.FileNotFoundException: /export/cruise/trunk/cc/projects/classlib/trunk/modules/luni/make/exclude.linux.x86_64.drl.interm
(No such file or directory)
Unable to load file: java.io.FileNotFoundException: /export/cruise/trunk/cc/projects/classlib/trunk/modules/math/make/exclude.common
(No such file or directory)
Unable to load file: java.io.FileNotFoundException: /export/cruise/trunk/cc/projects/classlib/trunk/modules/math/make/exclude.linux.x86_64.drl
(No such file or directory)
Unable to load file: java.io.FileNotFoundException: /export/cruise/trunk/cc/projects/classlib/trunk/modules/math/make/exclude.linux.x86_64.drl.interm
(No such file or directory)
Unable to load file: java.io.FileNotFoundException: /export/cruise/trunk/cc/projects/classlib/trunk/modules/misc/make/exclude.common
(No such file or directory)
Unable to load file: java.io.FileNotFoundException: /export/cruise/trunk/cc/projects/classlib/trunk/modules/misc/make/exclude.linux.x86_64.drl
(No such file or directory)
Unable to load file: java.io.FileNotFoundException: /export/cruise/trunk/cc/projects/classlib/trunk/modules/misc/make/exclude.linux.x86_64.drl.interm
(No such file or directory)
Test org.apache.harmony.security.tests.java.security.PermissionCollectionTest FAILED

***********************************************************
Unit Tests: (18931)
        
All Tests Passed

***********************************************************
Modifications since last successful build:	(8)
            
add cc-drlvm log20070125213229Lbuild.193 01/25/2007 21:32:29drlvm
modified gshimansky  /harmony/enhanced/drlvm/trunk/src/test/regression/H0000/run.test.xml
01/25/2007 21:06:07 Fixed regression test to specify correct java.library.path
modified ayza  /harmony/enhanced/classlib/trunk/modules/swing/src/main/java/common/javax/swing/plaf/basic/BasicSpinnerUI.java
01/25/2007 21:01:34 Applying the patch from HARMONY-2019 ([classlib][awt] Container.remove(null)
expected NPE)
modified ayza  /harmony/enhanced/classlib/trunk/modules/awt/src/main/java/common/java/awt/Container.java
01/25/2007 21:01:34 Applying the patch from HARMONY-2019 ([classlib][awt] Container.remove(null)
expected NPE)
modified ayza  /harmony/enhanced/classlib/trunk/modules/swing/src/main/java/common/javax/swing/plaf/metal/MetalFileChooserUI.java
01/25/2007 21:01:34 Applying the patch from HARMONY-2019 ([classlib][awt] Container.remove(null)
expected NPE)
modified ayza  /harmony/enhanced/classlib/trunk/modules/awt/src/test/api/java/common/java/awt/ContainerRTest.java
01/25/2007 21:01:34 Applying the patch from HARMONY-2019 ([classlib][awt] Container.remove(null)
expected NPE)
add cc-classlib log20070125200831Lbuild.166 01/25/2007 20:08:31classlib
modified hindessm  /harmony/enhanced/classlib/trunk/modules/portlib/src/test/native/hyfile/shared/hyfile.c
01/25/2007 17:50:06 Proper fix for FreeBSD compile problem.

Mime
View raw message