harmony-alerts mailing list archives

Site index · List index
Message view « Date » · « Thread »
Top « Date » · « Thread »
From nom...@intel.com
Subject [build-test alert] BUILD FAILED Windows XP SP2 msvc debug: classlib over drlvm
Date Thu, 25 Jan 2007 11:40:15 GMT
BUILD FAILED:
	Ant Error Message:
C:\cruise\trunk\cc\projects\classlib\trunk\build.xml:167: The following error occurred while
executing this line: C:\cruise\trunk\cc\projects\classlib\trunk\make\build-test.xml:139: There
were test failures.

Date of build:	01/25/2007 17:07:04
Time to build:	31 minutes 42 seconds
Last changed:	01/25/2007 16:34:20
Last log entry:	Applying the patch from HARMONY-1964 ([classlib][awt]Junit AWT TestRunner
throws NPE in "Errors and Failures" text area)

***********************************************************
Errors/Warnings:	(226)
            
Unable to load file: java.io.FileNotFoundException: C:\cruise\trunk\cc\projects\classlib\trunk\modules\concurrent\make\exclude.common
(The system cannot find the file specified)
Unable to load file: java.io.FileNotFoundException: C:\cruise\trunk\cc\projects\classlib\trunk\modules\concurrent\make\exclude.windows.x86.drl
(The system cannot find the file specified)
Unable to load file: java.io.FileNotFoundException: C:\cruise\trunk\cc\projects\classlib\trunk\modules\concurrent\make\exclude.windows.x86.drl.interm
(The system cannot find the file specified)
Unable to load file: java.io.FileNotFoundException: C:\cruise\trunk\cc\projects\classlib\trunk\modules\imageio\make\exclude.common
(The system cannot find the file specified)
Unable to load file: java.io.FileNotFoundException: C:\cruise\trunk\cc\projects\classlib\trunk\modules\imageio\make\exclude.windows.x86.drl
(The system cannot find the file specified)
Unable to load file: java.io.FileNotFoundException: C:\cruise\trunk\cc\projects\classlib\trunk\modules\imageio\make\exclude.windows.x86.drl.interm
(The system cannot find the file specified)
Unable to load file: java.io.FileNotFoundException: C:\cruise\trunk\cc\projects\classlib\trunk\modules\instrument\make\exclude.windows.x86.drl.interm
(The system cannot find the file specified)
Unable to load file: java.io.FileNotFoundException: C:\cruise\trunk\cc\projects\classlib\trunk\modules\jndi\make\exclude.common
(The system cannot find the file specified)
Unable to load file: java.io.FileNotFoundException: C:\cruise\trunk\cc\projects\classlib\trunk\modules\jndi\make\exclude.windows.x86.drl
(The system cannot find the file specified)
Unable to load file: java.io.FileNotFoundException: C:\cruise\trunk\cc\projects\classlib\trunk\modules\jndi\make\exclude.windows.x86.drl.interm
(The system cannot find the file specified)
Unable to load file: java.io.FileNotFoundException: C:\cruise\trunk\cc\projects\classlib\trunk\modules\logging\make\exclude.common
(The system cannot find the file specified)
Unable to load file: java.io.FileNotFoundException: C:\cruise\trunk\cc\projects\classlib\trunk\modules\logging\make\exclude.windows.x86.drl
(The system cannot find the file specified)
Unable to load file: java.io.FileNotFoundException: C:\cruise\trunk\cc\projects\classlib\trunk\modules\logging\make\exclude.windows.x86.drl.interm
(The system cannot find the file specified)
Tests FAILED
Unable to load file: java.io.FileNotFoundException: C:\cruise\trunk\cc\projects\classlib\trunk\modules\math\make\exclude.common
(The system cannot find the file specified)
Unable to load file: java.io.FileNotFoundException: C:\cruise\trunk\cc\projects\classlib\trunk\modules\math\make\exclude.windows.x86.drl
(The system cannot find the file specified)
Unable to load file: java.io.FileNotFoundException: C:\cruise\trunk\cc\projects\classlib\trunk\modules\math\make\exclude.windows.x86.drl.interm
(The system cannot find the file specified)
Unable to load file: java.io.FileNotFoundException: C:\cruise\trunk\cc\projects\classlib\trunk\modules\misc\make\exclude.common
(The system cannot find the file specified)
Unable to load file: java.io.FileNotFoundException: C:\cruise\trunk\cc\projects\classlib\trunk\modules\misc\make\exclude.windows.x86.drl
(The system cannot find the file specified)
Unable to load file: java.io.FileNotFoundException: C:\cruise\trunk\cc\projects\classlib\trunk\modules\misc\make\exclude.windows.x86.drl.interm
(The system cannot find the file specified)

***********************************************************
Unit Tests: (19365)
        
failure: test_getRemoteSocketAddress tests.api.java.net.DatagramSocketTest
failure: test_getLocalSocketAddress tests.api.java.net.DatagramSocketTest
Unit Test Error Details:	(2)
                
Test: test_getRemoteSocketAddressClass: tests.api.java.net.DatagramSocketTestjunit.framework.AssertionFailedError:
Exception during getRemoteSocketAddress test: java.net.BindException: The address is already
in use
	at tests.api.java.net.DatagramSocketTest.test_getRemoteSocketAddress(DatagramSocketTest.java:1615)
	at java.lang.reflect.VMReflection.invokeMethod(Native Method)

Test: test_getLocalSocketAddressClass: tests.api.java.net.DatagramSocketTestjunit.framework.AssertionFailedError:
Exception during getLocalSocketAddress test: java.net.BindException: The address is already
in use
	at tests.api.java.net.DatagramSocketTest.test_getLocalSocketAddress(DatagramSocketTest.java:1688)
	at java.lang.reflect.VMReflection.invokeMethod(Native Method)


***********************************************************
Modifications since last successful build:	(6)
            
modified ayza  /harmony/enhanced/classlib/trunk/modules/awt/src/main/java/common/java/awt/TextArea.java
01/25/2007 16:34:20 Applying the patch from HARMONY-1964 ([classlib][awt]Junit AWT TestRunner
throws NPE in "Errors and Failures" text area)
add cc-drlvm log20070125160301Lbuild.27 01/25/2007 16:03:01drlvm
add cc-classlib log20070125154543Lbuild.26 01/25/2007 15:45:43classlib
modified pyang  /harmony/enhanced/classlib/trunk/modules/archive/src/test/java/org/apache/harmony/archive/tests/java/util/zip/InflaterInputStreamTest.java
01/25/2007 15:42:56 Apply patch for HARMONY-2427( [classlib][archive] [compatibility] Harmony
checks correctness of java.util.zip.GZIPInputStream.read(BII) arguments even if EOF was reached
but RI returns -1)
modified pyang  /harmony/enhanced/classlib/trunk/modules/archive/src/main/java/java/util/zip/GZIPInputStream.java
01/25/2007 15:42:56 Apply patch for HARMONY-2427( [classlib][archive] [compatibility] Harmony
checks correctness of java.util.zip.GZIPInputStream.read(BII) arguments even if EOF was reached
but RI returns -1)
modified pyang  /harmony/enhanced/classlib/trunk/modules/archive/src/test/java/org/apache/harmony/archive/tests/java/util/zip/GZIPInputStreamTest.java
01/25/2007 15:42:56 Apply patch for HARMONY-2427( [classlib][archive] [compatibility] Harmony
checks correctness of java.util.zip.GZIPInputStream.read(BII) arguments even if EOF was reached
but RI returns -1)

Mime
View raw message