harmony-alerts mailing list archives

Site index · List index
Message view « Date » · « Thread »
Top « Date » · « Thread »
From nom...@intel.com
Subject [build-test alert] BUILD FAILED Linux SUSE 9 gcc debug: classlib over drlvm
Date Wed, 24 Jan 2007 16:04:41 GMT
BUILD FAILED:
	Ant Error Message:
/export/cruise/trunk/cc/projects/classlib/trunk/build.xml:167: The following error occurred
while executing this line: /export/cruise/trunk/cc/projects/classlib/trunk/make/build-test.xml:138:
There were test errors.

Date of build:	01/24/2007 21:24:47
Time to build:	39 minutes 17 seconds
Last changed:	01/24/2007 21:20:34
Last log entry:	Removed remaining reference to SYSLIBFILES.


***********************************************************
Errors/Warnings:	(330)
            
Tests FAILED
Unable to load file: java.io.FileNotFoundException: /export/cruise/trunk/cc/projects/classlib/trunk/modules/beans/make/exclude.linux.x86.drl.interm
(No such file or directory)
Unable to load file: java.io.FileNotFoundException: /export/cruise/trunk/cc/projects/classlib/trunk/modules/concurrent/make/exclude.common
(No such file or directory)
Unable to load file: java.io.FileNotFoundException: /export/cruise/trunk/cc/projects/classlib/trunk/modules/concurrent/make/exclude.linux.x86.drl
(No such file or directory)
Unable to load file: java.io.FileNotFoundException: /export/cruise/trunk/cc/projects/classlib/trunk/modules/concurrent/make/exclude.linux.x86.drl.interm
(No such file or directory)
Unable to load file: java.io.FileNotFoundException: /export/cruise/trunk/cc/projects/classlib/trunk/modules/imageio/make/exclude.common
(No such file or directory)
Unable to load file: java.io.FileNotFoundException: /export/cruise/trunk/cc/projects/classlib/trunk/modules/imageio/make/exclude.linux.x86.drl
(No such file or directory)
Unable to load file: java.io.FileNotFoundException: /export/cruise/trunk/cc/projects/classlib/trunk/modules/imageio/make/exclude.linux.x86.drl.interm
(No such file or directory)
Unable to load file: java.io.FileNotFoundException: /export/cruise/trunk/cc/projects/classlib/trunk/modules/instrument/make/exclude.linux.x86.drl.interm
(No such file or directory)
Unable to load file: java.io.FileNotFoundException: /export/cruise/trunk/cc/projects/classlib/trunk/modules/jndi/make/exclude.common
(No such file or directory)
Unable to load file: java.io.FileNotFoundException: /export/cruise/trunk/cc/projects/classlib/trunk/modules/jndi/make/exclude.linux.x86.drl
(No such file or directory)
Unable to load file: java.io.FileNotFoundException: /export/cruise/trunk/cc/projects/classlib/trunk/modules/jndi/make/exclude.linux.x86.drl.interm
(No such file or directory)
Unable to load file: java.io.FileNotFoundException: /export/cruise/trunk/cc/projects/classlib/trunk/modules/logging/make/exclude.common
(No such file or directory)
Unable to load file: java.io.FileNotFoundException: /export/cruise/trunk/cc/projects/classlib/trunk/modules/logging/make/exclude.linux.x86.drl
(No such file or directory)
Unable to load file: java.io.FileNotFoundException: /export/cruise/trunk/cc/projects/classlib/trunk/modules/logging/make/exclude.linux.x86.drl.interm
(No such file or directory)
Unable to load file: java.io.FileNotFoundException: /export/cruise/trunk/cc/projects/classlib/trunk/modules/luni/make/exclude.linux.x86.drl.interm
(No such file or directory)
Tests FAILED
Unable to load file: java.io.FileNotFoundException: /export/cruise/trunk/cc/projects/classlib/trunk/modules/math/make/exclude.common
(No such file or directory)
Unable to load file: java.io.FileNotFoundException: /export/cruise/trunk/cc/projects/classlib/trunk/modules/math/make/exclude.linux.x86.drl
(No such file or directory)
Unable to load file: java.io.FileNotFoundException: /export/cruise/trunk/cc/projects/classlib/trunk/modules/math/make/exclude.linux.x86.drl.interm
(No such file or directory)
Unable to load file: java.io.FileNotFoundException: /export/cruise/trunk/cc/projects/classlib/trunk/modules/misc/make/exclude.common
(No such file or directory)
Unable to load file: java.io.FileNotFoundException: /export/cruise/trunk/cc/projects/classlib/trunk/modules/misc/make/exclude.linux.x86.drl
(No such file or directory)
Unable to load file: java.io.FileNotFoundException: /export/cruise/trunk/cc/projects/classlib/trunk/modules/misc/make/exclude.linux.x86.drl.interm
(No such file or directory)
Tests FAILED
Result: 1
Tests FAILED

***********************************************************
Unit Tests: (19257)
        
error: test_getJarEntryLjava_lang_String org.apache.harmony.archive.tests.java.util.jar.JarFileTest
error: testImplies_04 org.apache.harmony.security.tests.java.security.CodeSourceTest
failure: testReceiveSend_64K org.apache.harmony.nio.tests.java.nio.channels.DatagramChannelTest
failure: testReadWrite_Block_64K org.apache.harmony.nio.tests.java.nio.channels.DatagramChannelTest
failure: test_Constructor tests.api.java.net.UnknownHostExceptionTest
Unit Test Error Details:	(5)
                
Test: test_getJarEntryLjava_lang_StringClass: org.apache.harmony.archive.tests.java.util.jar.JarFileTestjava.lang.NullPointerException
	at java.net.InetAddress$Cache.add(InetAddress.java)
	at java.net.InetAddress.lookupHostByName(InetAddress.java:438)
	at java.net.InetAddress.getByName(InetAddress.java:271)
	at java.net.InetSocketAddress.<init>(InetSocketAddress.java:64)
	at java.net.InetSocketAddress.<init>(InetSocketAddress.java)
	at org.apache.harmony.luni.internal.net.www.protocol.http.HttpURLConnection.getHTTPConnection(HttpURLConnection.java:634)
	at org.apache.harmony.luni.internal.net.www.protocol.http.HttpURLConnection.connect(HttpURLConnection.java:616)
	at org.apache.harmony.luni.internal.net.www.protocol.http.HttpURLConnection.sendRequest(HttpURLConnection.java:1015)
	at org.apache.harmony.luni.internal.net.www.protocol.http.HttpURLConnection.doRequestInternal(HttpURLConnection.java:1341)
	at org.apache.harmony.luni.internal.net.www.protocol.http.HttpURLConnection.doRequest(HttpURLConnection.java:1335)
	at org.apache.harmony.luni.internal.net.www.protocol.http.HttpURLConnection.getInputStream(HttpURLConnection.java:849)
	at java.net.URL.openStream(URL.java:663)
	at org.apache.harmony.archive.tests.java.util.jar.JarFileTest.test_getJarEntryLjava_lang_String(JarFileTest.java:151)
	at java.lang.reflect.VMReflection.invokeMethod(Native Method)

Test: testImplies_04Class: org.apache.harmony.security.tests.java.security.CodeSourceTestjava.lang.NullPointerException
	at java.net.InetAddress$Cache.add(InetAddress.java)
	at java.net.InetAddress.lookupHostByName(InetAddress.java:438)
	at java.net.InetAddress.getByName(InetAddress.java:271)
	at java.net.URLStreamHandler.getHostAddress(URLStreamHandler.java:393)
	at java.net.URLStreamHandler.hostsEqual(URLStreamHandler.java:423)
	at java.net.URLStreamHandler.sameFile(URLStreamHandler.java:447)
	at java.net.URLStreamHandler.equals(URLStreamHandler.java)
	at java.net.URL.equals(URL.java:526)
	at java.security.CodeSource.implies(CodeSource.java:333)
	at org.apache.harmony.security.tests.java.security.CodeSourceTest.testImplies_04(CodeSourceTest.java:460)
	at java.lang.reflect.VMReflection.invokeMethod(Native Method)

Test: testReceiveSend_64KClass: org.apache.harmony.nio.tests.java.nio.channels.DatagramChannelTestjunit.framework.AssertionFailedError:
Should throw SocketException!
	at org.apache.harmony.nio.tests.java.nio.channels.DatagramChannelTest.testReceiveSend_64K(DatagramChannelTest.java:1403)
	at java.lang.reflect.VMReflection.invokeMethod(Native Method)

Test: testReadWrite_Block_64KClass: org.apache.harmony.nio.tests.java.nio.channels.DatagramChannelTestjunit.framework.AssertionFailedError:
Should throw IOException
	at org.apache.harmony.nio.tests.java.nio.channels.DatagramChannelTest.testReadWrite_Block_64K(DatagramChannelTest.java:2145)
	at java.lang.reflect.VMReflection.invokeMethod(Native Method)

Test: test_ConstructorClass: tests.api.java.net.UnknownHostExceptionTestjunit.framework.AssertionFailedError:
Exception during test : null
	at tests.api.java.net.UnknownHostExceptionTest.test_Constructor(UnknownHostExceptionTest.java:35)
	at java.lang.reflect.VMReflection.invokeMethod(Native Method)


***********************************************************
Modifications since last successful build:	(37)
            
modified hindessm  /harmony/enhanced/classlib/trunk/depends/build/rules.mk 01/24/2007 21:20:34
Removed remaining reference to SYSLIBFILES.
added ayza  /harmony/enhanced/classlib/trunk/modules/luni/make/exclude.windows.x86.drl.interm
01/24/2007 21:08:04 Adding intermittent test failures to exclude list. Archive, awt, luni,
security and nio modules are affected. This commit relates to HARMONY-2970.
added ayza  /harmony/enhanced/classlib/trunk/modules/security/make/exclude.windows.x86.drl.interm
01/24/2007 21:08:04 Adding intermittent test failures to exclude list. Archive, awt, luni,
security and nio modules are affected. This commit relates to HARMONY-2970.
added ayza  /harmony/enhanced/classlib/trunk/modules/awt/make/exclude.windows.x86.drl.interm
01/24/2007 21:08:04 Adding intermittent test failures to exclude list. Archive, awt, luni,
security and nio modules are affected. This commit relates to HARMONY-2970.
added ayza  /harmony/enhanced/classlib/trunk/modules/luni/make/exclude.linux.x86.drl.interm
01/24/2007 21:08:04 Adding intermittent test failures to exclude list. Archive, awt, luni,
security and nio modules are affected. This commit relates to HARMONY-2970.
added ayza  /harmony/enhanced/classlib/trunk/modules/nio/make/exclude.windows.x86.drl.interm
01/24/2007 21:08:04 Adding intermittent test failures to exclude list. Archive, awt, luni,
security and nio modules are affected. This commit relates to HARMONY-2970.
added ayza  /harmony/enhanced/classlib/trunk/modules/archive/make/exclude.linux.x86.drl.interm
01/24/2007 21:08:04 Adding intermittent test failures to exclude list. Archive, awt, luni,
security and nio modules are affected. This commit relates to HARMONY-2970.
modified hindessm  /harmony/enhanced/classlib/trunk/modules/portlib/src/test/native/hyfile/shared/hyfile.c
01/24/2007 20:44:05 Attempt to ensure that created files/directories are removed.
modified ayza  /harmony/enhanced/classlib/trunk/modules/awt/make/exclude.windows.x86_64.drl
01/24/2007 20:42:38 Enabling the new exclude lists model for accessibility, annotation, applet,
archive, auth and awt modules. This commit relates to HARMONY-2970.
modified ayza  /harmony/enhanced/classlib/trunk/modules/auth/make/exclude.linux.x86_64.ibm
01/24/2007 20:42:38 Enabling the new exclude lists model for accessibility, annotation, applet,
archive, auth and awt modules. This commit relates to HARMONY-2970.
modified ayza  /harmony/enhanced/classlib/trunk/modules/annotation/build.xml 01/24/2007 20:42:38
Enabling the new exclude lists model for accessibility, annotation, applet, archive, auth
and awt modules. This commit relates to HARMONY-2970.
modified ayza  /harmony/enhanced/classlib/trunk/modules/auth/make/exclude.linux.x86.drl 01/24/2007
20:42:38 Enabling the new exclude lists model for accessibility, annotation, applet, archive,
auth and awt modules. This commit relates to HARMONY-2970.
modified ayza  /harmony/enhanced/classlib/trunk/modules/awt/make/exclude.linux.x86_64.drl
01/24/2007 20:42:38 Enabling the new exclude lists model for accessibility, annotation, applet,
archive, auth and awt modules. This commit relates to HARMONY-2970.
modified ayza  /harmony/enhanced/classlib/trunk/modules/auth/make/exclude.windows.x86_64.drl
01/24/2007 20:42:38 Enabling the new exclude lists model for accessibility, annotation, applet,
archive, auth and awt modules. This commit relates to HARMONY-2970.
modified ayza  /harmony/enhanced/classlib/trunk/modules/archive/build.xml 01/24/2007 20:42:38
Enabling the new exclude lists model for accessibility, annotation, applet, archive, auth
and awt modules. This commit relates to HARMONY-2970.
modified ayza  /harmony/enhanced/classlib/trunk/modules/auth/make/exclude.linux.x86_64.drl
01/24/2007 20:42:38 Enabling the new exclude lists model for accessibility, annotation, applet,
archive, auth and awt modules. This commit relates to HARMONY-2970.
modified ayza  /harmony/enhanced/classlib/trunk/modules/applet/build.xml 01/24/2007 20:42:38
Enabling the new exclude lists model for accessibility, annotation, applet, archive, auth
and awt modules. This commit relates to HARMONY-2970.
modified ayza  /harmony/enhanced/classlib/trunk/modules/awt/make/exclude.windows.x86.ibm 01/24/2007
20:42:38 Enabling the new exclude lists model for accessibility, annotation, applet, archive,
auth and awt modules. This commit relates to HARMONY-2970.
modified ayza  /harmony/enhanced/classlib/trunk/modules/accessibility/build.xml 01/24/2007
20:42:38 Enabling the new exclude lists model for accessibility, annotation, applet, archive,
auth and awt modules. This commit relates to HARMONY-2970.
modified ayza  /harmony/enhanced/classlib/trunk/modules/archive/make/exclude.linux.x86_64.ibm
01/24/2007 20:42:38 Enabling the new exclude lists model for accessibility, annotation, applet,
archive, auth and awt modules. This commit relates to HARMONY-2970.
added ayza  /harmony/enhanced/classlib/trunk/modules/awt/make/exclude.common 01/24/2007 20:42:38
Enabling the new exclude lists model for accessibility, annotation, applet, archive, auth
and awt modules. This commit relates to HARMONY-2970.
modified ayza  /harmony/enhanced/classlib/trunk/modules/awt/build.xml 01/24/2007 20:42:38
Enabling the new exclude lists model for accessibility, annotation, applet, archive, auth
and awt modules. This commit relates to HARMONY-2970.
modified ayza  /harmony/enhanced/classlib/trunk/modules/awt/make/exclude.linux.x86.ibm 01/24/2007
20:42:38 Enabling the new exclude lists model for accessibility, annotation, applet, archive,
auth and awt modules. This commit relates to HARMONY-2970.
modified ayza  /harmony/enhanced/classlib/trunk/modules/auth/make/exclude.windows.x86.ibm
01/24/2007 20:42:38 Enabling the new exclude lists model for accessibility, annotation, applet,
archive, auth and awt modules. This commit relates to HARMONY-2970.
modified ayza  /harmony/enhanced/classlib/trunk/modules/awt/make/exclude.windows.x86_64.ibm
01/24/2007 20:42:38 Enabling the new exclude lists model for accessibility, annotation, applet,
archive, auth and awt modules. This commit relates to HARMONY-2970.
added ayza  /harmony/enhanced/classlib/trunk/modules/auth/make/exclude.common 01/24/2007 20:42:38
Enabling the new exclude lists model for accessibility, annotation, applet, archive, auth
and awt modules. This commit relates to HARMONY-2970.
modified ayza  /harmony/enhanced/classlib/trunk/modules/auth/make/exclude.linux.x86.ibm 01/24/2007
20:42:38 Enabling the new exclude lists model for accessibility, annotation, applet, archive,
auth and awt modules. This commit relates to HARMONY-2970.
modified ayza  /harmony/enhanced/classlib/trunk/modules/auth/build.xml 01/24/2007 20:42:38
Enabling the new exclude lists model for accessibility, annotation, applet, archive, auth
and awt modules. This commit relates to HARMONY-2970.
modified ayza  /harmony/enhanced/classlib/trunk/make/properties.xml 01/24/2007 20:42:38 Enabling
the new exclude lists model for accessibility, annotation, applet, archive, auth and awt modules.
This commit relates to HARMONY-2970.
modified ayza  /harmony/enhanced/classlib/trunk/modules/awt/make/exclude.linux.x86_64.ibm
01/24/2007 20:42:38 Enabling the new exclude lists model for accessibility, annotation, applet,
archive, auth and awt modules. This commit relates to HARMONY-2970.
modified ayza  /harmony/enhanced/classlib/trunk/modules/auth/make/exclude.windows.x86_64.ibm
01/24/2007 20:42:38 Enabling the new exclude lists model for accessibility, annotation, applet,
archive, auth and awt modules. This commit relates to HARMONY-2970.
modified ayza  /harmony/enhanced/classlib/trunk/modules/awt/make/exclude.linux.x86.drl 01/24/2007
20:42:38 Enabling the new exclude lists model for accessibility, annotation, applet, archive,
auth and awt modules. This commit relates to HARMONY-2970.
modified ayza  /harmony/enhanced/classlib/trunk/modules/auth/make/exclude.windows.x86.drl
01/24/2007 20:42:38 Enabling the new exclude lists model for accessibility, annotation, applet,
archive, auth and awt modules. This commit relates to HARMONY-2970.
add cc-drlvm log20070124201732Lbuild.20 01/24/2007 20:17:32drlvm
add cc-classlib log20070124200219Lbuild.22 01/24/2007 20:02:19classlib
modified hindessm  /harmony/enhanced/classlib/trunk/modules/portlib/src/main/native/port/unix/hyerrorhelpers.c
01/24/2007 19:55:47 Make errorMessage use the thread-safe strerror_r rather than strerror.
modified hindessm  /harmony/enhanced/classlib/trunk/modules/portlib/build.xml 01/24/2007 19:33:24
Fixing native test logic.

Mime
View raw message