harmony-alerts mailing list archives

Site index · List index
Message view « Date » · « Thread »
Top « Date » · « Thread »
From nom...@intel.com
Subject [build-test alert] BUILD FAILED Windows XP SP2 msvc debug: classlib over drlvm
Date Tue, 23 Jan 2007 16:50:32 GMT
BUILD FAILED:
	Ant Error Message:
C:\cruise\trunk\cc\projects\classlib\trunk\build.xml:167: The following error occurred while
executing this line: C:\cruise\trunk\cc\projects\classlib\trunk\make\build-test.xml:52: The
following error occurred while executing this line: C:\cruise\trunk\cc\projects\classlib\trunk\make\properties.xml:323:
The following error occurred while executing this line: C:\cruise\trunk\cc\projects\classlib\trunk\modules\portlib\build.xml:138:
The following error occurred while executing this line: C:\cruise\trunk\cc\projects\classlib\trunk\make\properties.xml:338:
exec returned: 2

Date of build:	01/23/2007 22:35:55
Time to build:	14 minutes 6 seconds
Last changed:	01/23/2007 21:31:08
Last log entry:	drlvm

***********************************************************
Errors/Warnings:	(136)
            
Unable to load file: java.io.FileNotFoundException: C:\cruise\trunk\cc\projects\classlib\trunk\modules\beans\make\exclude.windows.x86.drl.interm
(The system cannot find the file specified)
Unable to load file: java.io.FileNotFoundException: C:\cruise\trunk\cc\projects\classlib\trunk\modules\concurrent\make\exclude.common
(The system cannot find the file specified)
Unable to load file: java.io.FileNotFoundException: C:\cruise\trunk\cc\projects\classlib\trunk\modules\concurrent\make\exclude.windows.x86.drl
(The system cannot find the file specified)
Unable to load file: java.io.FileNotFoundException: C:\cruise\trunk\cc\projects\classlib\trunk\modules\concurrent\make\exclude.windows.x86.drl.interm
(The system cannot find the file specified)
Unable to load file: java.io.FileNotFoundException: C:\cruise\trunk\cc\projects\classlib\trunk\modules\imageio\make\exclude.common
(The system cannot find the file specified)
Unable to load file: java.io.FileNotFoundException: C:\cruise\trunk\cc\projects\classlib\trunk\modules\imageio\make\exclude.windows.x86.drl
(The system cannot find the file specified)
Unable to load file: java.io.FileNotFoundException: C:\cruise\trunk\cc\projects\classlib\trunk\modules\imageio\make\exclude.windows.x86.drl.interm
(The system cannot find the file specified)
Unable to load file: java.io.FileNotFoundException: C:\cruise\trunk\cc\projects\classlib\trunk\modules\instrument\make\exclude.windows.x86.drl.interm
(The system cannot find the file specified)
Unable to load file: java.io.FileNotFoundException: C:\cruise\trunk\cc\projects\classlib\trunk\modules\jndi\make\exclude.common
(The system cannot find the file specified)
Unable to load file: java.io.FileNotFoundException: C:\cruise\trunk\cc\projects\classlib\trunk\modules\jndi\make\exclude.windows.x86.drl
(The system cannot find the file specified)
Unable to load file: java.io.FileNotFoundException: C:\cruise\trunk\cc\projects\classlib\trunk\modules\jndi\make\exclude.windows.x86.drl.interm
(The system cannot find the file specified)
Unable to load file: java.io.FileNotFoundException: C:\cruise\trunk\cc\projects\classlib\trunk\modules\logging\make\exclude.common
(The system cannot find the file specified)
Unable to load file: java.io.FileNotFoundException: C:\cruise\trunk\cc\projects\classlib\trunk\modules\logging\make\exclude.windows.x86.drl
(The system cannot find the file specified)
Unable to load file: java.io.FileNotFoundException: C:\cruise\trunk\cc\projects\classlib\trunk\modules\logging\make\exclude.windows.x86.drl.interm
(The system cannot find the file specified)
Unable to load file: java.io.FileNotFoundException: C:\cruise\trunk\cc\projects\classlib\trunk\modules\luni\make\exclude.windows.x86.drl.interm
(The system cannot find the file specified)
Unable to load file: java.io.FileNotFoundException: C:\cruise\trunk\cc\projects\classlib\trunk\modules\math\make\exclude.common
(The system cannot find the file specified)
Unable to load file: java.io.FileNotFoundException: C:\cruise\trunk\cc\projects\classlib\trunk\modules\math\make\exclude.windows.x86.drl
(The system cannot find the file specified)
Unable to load file: java.io.FileNotFoundException: C:\cruise\trunk\cc\projects\classlib\trunk\modules\math\make\exclude.windows.x86.drl.interm
(The system cannot find the file specified)
Unable to load file: java.io.FileNotFoundException: C:\cruise\trunk\cc\projects\classlib\trunk\modules\misc\make\exclude.common
(The system cannot find the file specified)
Unable to load file: java.io.FileNotFoundException: C:\cruise\trunk\cc\projects\classlib\trunk\modules\misc\make\exclude.windows.x86.drl
(The system cannot find the file specified)
Unable to load file: java.io.FileNotFoundException: C:\cruise\trunk\cc\projects\classlib\trunk\modules\misc\make\exclude.windows.x86.drl.interm
(The system cannot find the file specified)

***********************************************************
Unit Tests: (11902)
        
All Tests Passed

***********************************************************
Modifications since last successful build:	(4)
            
add cc-drlvm log20070123213108Lbuild.11 01/23/2007 21:31:08drlvm
add cc-classlib log20070123211352Lbuild.11 01/23/2007 21:13:52classlib
modified gshimansky  /harmony/enhanced/drlvm/trunk/vm/vmcore/src/jvmti/jvmti.cpp 01/23/2007
21:09:35 Applied HARMONY-3027 [drlvm][jvmti] VM fails to initialize wtih an agent specified
by -agentlib: optionTests passed on Ubuntu6 x86, Windows 2003 server x86 and SuSE9 x86_64.The
agentlib option seems to work now
modified gshimansky  /harmony/enhanced/drlvm/trunk/vm/em/src/DrlEMImpl.cpp 01/23/2007 21:09:35
Applied HARMONY-3027 [drlvm][jvmti] VM fails to initialize wtih an agent specified by -agentlib:
optionTests passed on Ubuntu6 x86, Windows 2003 server x86 and SuSE9 x86_64.The agentlib option
seems to work now

Mime
View raw message