harmony-alerts mailing list archives

Site index · List index
Message view « Date » · « Thread »
Top « Date » · « Thread »
From nom...@intel.com
Subject [build-test alert] BUILD FAILED Windows XP SP2 msvc debug: classlib over drlvm
Date Thu, 18 Jan 2007 10:01:09 GMT
BUILD FAILED:
	Ant Error Message:
C:\cc.harmony\trunk\cc\projects\classlib\trunk\build.xml:167: The following error occurred
while executing this line: C:\cc.harmony\trunk\cc\projects\classlib\trunk\make\build-test.xml:139:
There were test failures.

Date of build:	01/18/2007 15:19:34
Time to build:	39 minutes 21 seconds
Last changed:	01/18/2007 15:09:20
Last log entry:	drlvm

***********************************************************
Errors/Warnings:(195)
            
Unable to load file: java.io.FileNotFoundException: C:\cc.harmony\trunk\cc\projects\classlib\trunk\modules\beans\make\exclude.windows.x86.drl.interm
(The system cannot find the file specified)
Unable to load file: java.io.FileNotFoundException: C:\cc.harmony\trunk\cc\projects\classlib\trunk\modules\concurrent\make\exclude.common
(The system cannot find the file specified)
Unable to load file: java.io.FileNotFoundException: C:\cc.harmony\trunk\cc\projects\classlib\trunk\modules\concurrent\make\exclude.windows.x86.drl
(The system cannot find the file specified)
Unable to load file: java.io.FileNotFoundException: C:\cc.harmony\trunk\cc\projects\classlib\trunk\modules\concurrent\make\exclude.windows.x86.drl.interm
(The system cannot find the file specified)
Unable to load file: java.io.FileNotFoundException: C:\cc.harmony\trunk\cc\projects\classlib\trunk\modules\crypto\make\exclude.common
(The system cannot find the file specified)
Unable to load file: java.io.FileNotFoundException: C:\cc.harmony\trunk\cc\projects\classlib\trunk\modules\crypto\make\exclude.windows.x86.drl
(The system cannot find the file specified)
Unable to load file: java.io.FileNotFoundException: C:\cc.harmony\trunk\cc\projects\classlib\trunk\modules\crypto\make\exclude.windows.x86.drl.interm
(The system cannot find the file specified)
Unable to load file: java.io.FileNotFoundException: C:\cc.harmony\trunk\cc\projects\classlib\trunk\modules\imageio\make\exclude.common
(The system cannot find the file specified)
Unable to load file: java.io.FileNotFoundException: C:\cc.harmony\trunk\cc\projects\classlib\trunk\modules\imageio\make\exclude.windows.x86.drl
(The system cannot find the file specified)
Unable to load file: java.io.FileNotFoundException: C:\cc.harmony\trunk\cc\projects\classlib\trunk\modules\imageio\make\exclude.windows.x86.drl.interm
(The system cannot find the file specified)
Unable to load file: java.io.FileNotFoundException: C:\cc.harmony\trunk\cc\projects\classlib\trunk\modules\instrument\make\exclude.windows.x86.drl.interm
(The system cannot find the file specified)
Unable to load file: java.io.FileNotFoundException: C:\cc.harmony\trunk\cc\projects\classlib\trunk\modules\jndi\make\exclude.common
(The system cannot find the file specified)
Unable to load file: java.io.FileNotFoundException: C:\cc.harmony\trunk\cc\projects\classlib\trunk\modules\jndi\make\exclude.windows.x86.drl
(The system cannot find the file specified)
Unable to load file: java.io.FileNotFoundException: C:\cc.harmony\trunk\cc\projects\classlib\trunk\modules\jndi\make\exclude.windows.x86.drl.interm
(The system cannot find the file specified)
Unable to load file: java.io.FileNotFoundException: C:\cc.harmony\trunk\cc\projects\classlib\trunk\modules\logging\make\exclude.common
(The system cannot find the file specified)
Unable to load file: java.io.FileNotFoundException: C:\cc.harmony\trunk\cc\projects\classlib\trunk\modules\logging\make\exclude.windows.x86.drl
(The system cannot find the file specified)
Unable to load file: java.io.FileNotFoundException: C:\cc.harmony\trunk\cc\projects\classlib\trunk\modules\logging\make\exclude.windows.x86.drl.interm
(The system cannot find the file specified)
Unable to load file: java.io.FileNotFoundException: C:\cc.harmony\trunk\cc\projects\classlib\trunk\modules\luni\make\exclude.windows.x86.drl.interm
(The system cannot find the file specified)
Tests FAILED
Unable to load file: java.io.FileNotFoundException: C:\cc.harmony\trunk\cc\projects\classlib\trunk\modules\math\make\exclude.common
(The system cannot find the file specified)
Unable to load file: java.io.FileNotFoundException: C:\cc.harmony\trunk\cc\projects\classlib\trunk\modules\math\make\exclude.windows.x86.drl
(The system cannot find the file specified)
Unable to load file: java.io.FileNotFoundException: C:\cc.harmony\trunk\cc\projects\classlib\trunk\modules\math\make\exclude.windows.x86.drl.interm
(The system cannot find the file specified)
Unable to load file: java.io.FileNotFoundException: C:\cc.harmony\trunk\cc\projects\classlib\trunk\modules\misc\make\exclude.common
(The system cannot find the file specified)
Unable to load file: java.io.FileNotFoundException: C:\cc.harmony\trunk\cc\projects\classlib\trunk\modules\misc\make\exclude.windows.x86.drl
(The system cannot find the file specified)
Unable to load file: java.io.FileNotFoundException: C:\cc.harmony\trunk\cc\projects\classlib\trunk\modules\misc\make\exclude.windows.x86.drl.interm
(The system cannot find the file specified)

***********************************************************
Unit Tests: (19260)
        
failure: test_getLocalSocketAddress tests.api.java.net.DatagramSocketTest
Unit Test Error Details:	(1)
                
Test: test_getLocalSocketAddressClass: tests.api.java.net.DatagramSocketTestjunit.framework.AssertionFailedError:
Exception during getLocalSocketAddress test: java.net.BindException: The address is already
in use
	at tests.api.java.net.DatagramSocketTest.test_getLocalSocketAddress(DatagramSocketTest.java:1688)
	at java.lang.reflect.VMReflection.invokeMethod(Native Method)


***********************************************************
Modifications since last successful build:	(3)
            
add cc-drlvm log20070118150920Lbuild.163 01/18/2007 15:09:20drlvm
modified smishura  /harmony/enhanced/classlib/trunk/modules/security/src/test/api/java.injected/java/security/SignatureTest.java
01/18/2007 15:05:51 Fix JUnit style
modified varlax  /harmony/enhanced/drlvm/trunk/vm/jitrino/src/codegenerator/ipf/include/IpfCodeSelector.h
01/18/2007 13:32:49 H-1578 follow-up IPF compilation fix

Mime
View raw message