harmony-alerts mailing list archives

Site index · List index
Message view « Date » · « Thread »
Top « Date » · « Thread »
From nom...@intel.com
Subject [build-test alert] BUILD FAILED Linux SUSE 9 64bit gcc debug: classlib over drlvm
Date Wed, 17 Jan 2007 10:51:52 GMT
BUILD FAILED:
	Ant Error Message:
/export/users/viv/trunk/cc/projects/classlib/trunk/build.xml:167: The following error occurred
while executing this line: /export/users/viv/trunk/cc/projects/classlib/trunk/make/build-test.xml:139:
There were test failures.

Date of build:	01/17/2007 15:27:12
Time to build:	83 minutes 45 seconds
Last changed:	01/17/2007 14:39:51
Last log entry:	drlvm

***********************************************************
Errors/Warnings:	(332)
            
Unable to load file: java.io.FileNotFoundException: /export/users/viv/trunk/cc/projects/classlib/trunk/modules/beans/make/exclude.linux.x86_64.drl.interm
(No such file or directory)
Unable to load file: java.io.FileNotFoundException: /export/users/viv/trunk/cc/projects/classlib/trunk/modules/concurrent/make/exclude.common
(No such file or directory)
Unable to load file: java.io.FileNotFoundException: /export/users/viv/trunk/cc/projects/classlib/trunk/modules/concurrent/make/exclude.linux.x86_64.drl
(No such file or directory)
Unable to load file: java.io.FileNotFoundException: /export/users/viv/trunk/cc/projects/classlib/trunk/modules/concurrent/make/exclude.linux.x86_64.drl.interm
(No such file or directory)
Unable to load file: java.io.FileNotFoundException: /export/users/viv/trunk/cc/projects/classlib/trunk/modules/crypto/make/exclude.common
(No such file or directory)
Unable to load file: java.io.FileNotFoundException: /export/users/viv/trunk/cc/projects/classlib/trunk/modules/crypto/make/exclude.linux.x86_64.drl
(No such file or directory)
Unable to load file: java.io.FileNotFoundException: /export/users/viv/trunk/cc/projects/classlib/trunk/modules/crypto/make/exclude.linux.x86_64.drl.interm
(No such file or directory)
Unable to load file: java.io.FileNotFoundException: /export/users/viv/trunk/cc/projects/classlib/trunk/modules/imageio/make/exclude.common
(No such file or directory)
Unable to load file: java.io.FileNotFoundException: /export/users/viv/trunk/cc/projects/classlib/trunk/modules/imageio/make/exclude.linux.x86_64.drl
(No such file or directory)
Unable to load file: java.io.FileNotFoundException: /export/users/viv/trunk/cc/projects/classlib/trunk/modules/imageio/make/exclude.linux.x86_64.drl.interm
(No such file or directory)
Unable to load file: java.io.FileNotFoundException: /export/users/viv/trunk/cc/projects/classlib/trunk/modules/instrument/make/exclude.linux.x86_64.drl.interm
(No such file or directory)
Unable to load file: java.io.FileNotFoundException: /export/users/viv/trunk/cc/projects/classlib/trunk/modules/jndi/make/exclude.common
(No such file or directory)
Unable to load file: java.io.FileNotFoundException: /export/users/viv/trunk/cc/projects/classlib/trunk/modules/jndi/make/exclude.linux.x86_64.drl
(No such file or directory)
Unable to load file: java.io.FileNotFoundException: /export/users/viv/trunk/cc/projects/classlib/trunk/modules/jndi/make/exclude.linux.x86_64.drl.interm
(No such file or directory)
Unable to load file: java.io.FileNotFoundException: /export/users/viv/trunk/cc/projects/classlib/trunk/modules/logging/make/exclude.common
(No such file or directory)
Unable to load file: java.io.FileNotFoundException: /export/users/viv/trunk/cc/projects/classlib/trunk/modules/logging/make/exclude.linux.x86_64.drl
(No such file or directory)
Unable to load file: java.io.FileNotFoundException: /export/users/viv/trunk/cc/projects/classlib/trunk/modules/logging/make/exclude.linux.x86_64.drl.interm
(No such file or directory)
Unable to load file: java.io.FileNotFoundException: /export/users/viv/trunk/cc/projects/classlib/trunk/modules/luni/make/exclude.linux.x86_64.drl.interm
(No such file or directory)
Unable to load file: java.io.FileNotFoundException: /export/users/viv/trunk/cc/projects/classlib/trunk/modules/math/make/exclude.common
(No such file or directory)
Unable to load file: java.io.FileNotFoundException: /export/users/viv/trunk/cc/projects/classlib/trunk/modules/math/make/exclude.linux.x86_64.drl
(No such file or directory)
Unable to load file: java.io.FileNotFoundException: /export/users/viv/trunk/cc/projects/classlib/trunk/modules/math/make/exclude.linux.x86_64.drl.interm
(No such file or directory)
Unable to load file: java.io.FileNotFoundException: /export/users/viv/trunk/cc/projects/classlib/trunk/modules/misc/make/exclude.common
(No such file or directory)
Unable to load file: java.io.FileNotFoundException: /export/users/viv/trunk/cc/projects/classlib/trunk/modules/misc/make/exclude.linux.x86_64.drl
(No such file or directory)
Unable to load file: java.io.FileNotFoundException: /export/users/viv/trunk/cc/projects/classlib/trunk/modules/misc/make/exclude.linux.x86_64.drl.interm
(No such file or directory)
Test javax.swing.text.AbstractDocument_ElementEditTest FAILED

***********************************************************
Unit Tests: (18926)
        
All Tests Passed

***********************************************************
Modifications since last successful build:	(10)
            
add cc-drlvm log20070117143951Lbuild.166 01/17/2007 14:39:51drlvm
add cc-classlib log20070117142835Lbuild.144 01/17/2007 14:28:35classlib
modified varlax  /harmony/enhanced/drlvm/trunk/vm/vmcore/src/jit/jit_runtime_support.cpp 01/17/2007
14:22:43 Applied HARMONY-2924 [drlvm] spelling errors in vmocre/jit
modified varlax  /harmony/enhanced/drlvm/trunk/vm/vmcore/src/jit/primitives_support.cpp 01/17/2007
14:22:43 Applied HARMONY-2924 [drlvm] spelling errors in vmocre/jit
modified varlax  /harmony/enhanced/drlvm/trunk/vm/vmcore/src/jit/compile.cpp 01/17/2007 14:22:43
Applied HARMONY-2924 [drlvm] spelling errors in vmocre/jit
modified varlax  /harmony/enhanced/drlvm/trunk/vm/vmcore/src/jit/native_overrides.cpp 01/17/2007
14:22:43 Applied HARMONY-2924 [drlvm] spelling errors in vmocre/jit
modified hindessm  /harmony/enhanced/classlib/trunk/modules/swing/src/test/api/java/common/javax/swing/text/AbstractDocument_BranchElementTest.java
01/17/2007 14:21:35 Applying patches from "[#HARMONY-2777] [classlib][swing]j.s.text.AbstractDocument.BranchElement.get{Start,
End}Offset throwArrayIndexOutOfBoundsException rather than NPE" (again).  Included theadditional
fix to AbstractDocumentTest.java.
modified hindessm  /harmony/enhanced/classlib/trunk/modules/swing/src/main/java/common/javax/swing/text/AbstractDocument.java
01/17/2007 14:21:35 Applying patches from "[#HARMONY-2777] [classlib][swing]j.s.text.AbstractDocument.BranchElement.get{Start,
End}Offset throwArrayIndexOutOfBoundsException rather than NPE" (again).  Included theadditional
fix to AbstractDocumentTest.java.
modified hindessm  /harmony/enhanced/classlib/trunk/modules/swing/src/test/api/java/common/javax/swing/text/AbstractDocumentTest.java
01/17/2007 14:21:35 Applying patches from "[#HARMONY-2777] [classlib][swing]j.s.text.AbstractDocument.BranchElement.get{Start,
End}Offset throwArrayIndexOutOfBoundsException rather than NPE" (again).  Included theadditional
fix to AbstractDocumentTest.java.
modified varlax  /harmony/enhanced/drlvm/trunk/vm/jitrino/src/codegenerator/ia32/Ia32GCMap.cpp
01/17/2007 14:20:20 Applied HARMONY-2292 [drlvm][jit] warning (unused variable at GCMap.cpp:361)

Mime
View raw message