harmony-alerts mailing list archives

Site index · List index
Message view « Date » · « Thread »
Top « Date » · « Thread »
From nom...@intel.com
Subject [build-test alert] BUILD FAILED Linux SUSE 9 gcc debug: classlib over drlvm
Date Tue, 16 Jan 2007 20:13:05 GMT
BUILD FAILED:
	Ant Error Message:
/export/viv/trunk/cc/projects/classlib/trunk/build.xml:167: The following error occurred while
executing this line: /export/viv/trunk/cc/projects/classlib/trunk/make/build-test.xml:138:
There were test errors.

Date of build:	01/17/2007 01:34:39
Time to build:	37 minutes 43 seconds
Last changed:	01/17/2007 00:22:44
Last log entry:	drlvm

***********************************************************
Errors/Warnings:	(288)
            
Unable to load file: java.io.FileNotFoundException: /export/viv/trunk/cc/projects/classlib/trunk/modules/beans/make/exclude.linux.x86.drl.interm
(No such file or directory)
Unable to load file: java.io.FileNotFoundException: /export/viv/trunk/cc/projects/classlib/trunk/modules/concurrent/make/exclude.common
(No such file or directory)
Unable to load file: java.io.FileNotFoundException: /export/viv/trunk/cc/projects/classlib/trunk/modules/concurrent/make/exclude.linux.x86.drl
(No such file or directory)
Unable to load file: java.io.FileNotFoundException: /export/viv/trunk/cc/projects/classlib/trunk/modules/concurrent/make/exclude.linux.x86.drl.interm
(No such file or directory)
Unable to load file: java.io.FileNotFoundException: /export/viv/trunk/cc/projects/classlib/trunk/modules/crypto/make/exclude.common
(No such file or directory)
Unable to load file: java.io.FileNotFoundException: /export/viv/trunk/cc/projects/classlib/trunk/modules/crypto/make/exclude.linux.x86.drl
(No such file or directory)
Unable to load file: java.io.FileNotFoundException: /export/viv/trunk/cc/projects/classlib/trunk/modules/crypto/make/exclude.linux.x86.drl.interm
(No such file or directory)
Unable to load file: java.io.FileNotFoundException: /export/viv/trunk/cc/projects/classlib/trunk/modules/imageio/make/exclude.common
(No such file or directory)
Unable to load file: java.io.FileNotFoundException: /export/viv/trunk/cc/projects/classlib/trunk/modules/imageio/make/exclude.linux.x86.drl
(No such file or directory)
Unable to load file: java.io.FileNotFoundException: /export/viv/trunk/cc/projects/classlib/trunk/modules/imageio/make/exclude.linux.x86.drl.interm
(No such file or directory)
Unable to load file: java.io.FileNotFoundException: /export/viv/trunk/cc/projects/classlib/trunk/modules/instrument/make/exclude.linux.x86.drl.interm
(No such file or directory)
Unable to load file: java.io.FileNotFoundException: /export/viv/trunk/cc/projects/classlib/trunk/modules/jndi/make/exclude.common
(No such file or directory)
Unable to load file: java.io.FileNotFoundException: /export/viv/trunk/cc/projects/classlib/trunk/modules/jndi/make/exclude.linux.x86.drl
(No such file or directory)
Unable to load file: java.io.FileNotFoundException: /export/viv/trunk/cc/projects/classlib/trunk/modules/jndi/make/exclude.linux.x86.drl.interm
(No such file or directory)
Unable to load file: java.io.FileNotFoundException: /export/viv/trunk/cc/projects/classlib/trunk/modules/logging/make/exclude.common
(No such file or directory)
Unable to load file: java.io.FileNotFoundException: /export/viv/trunk/cc/projects/classlib/trunk/modules/logging/make/exclude.linux.x86.drl
(No such file or directory)
Unable to load file: java.io.FileNotFoundException: /export/viv/trunk/cc/projects/classlib/trunk/modules/logging/make/exclude.linux.x86.drl.interm
(No such file or directory)
Unable to load file: java.io.FileNotFoundException: /export/viv/trunk/cc/projects/classlib/trunk/modules/luni/make/exclude.linux.x86.drl.interm
(No such file or directory)
Unable to load file: java.io.FileNotFoundException: /export/viv/trunk/cc/projects/classlib/trunk/modules/math/make/exclude.common
(No such file or directory)
Unable to load file: java.io.FileNotFoundException: /export/viv/trunk/cc/projects/classlib/trunk/modules/math/make/exclude.linux.x86.drl
(No such file or directory)
Unable to load file: java.io.FileNotFoundException: /export/viv/trunk/cc/projects/classlib/trunk/modules/math/make/exclude.linux.x86.drl.interm
(No such file or directory)
Unable to load file: java.io.FileNotFoundException: /export/viv/trunk/cc/projects/classlib/trunk/modules/misc/make/exclude.common
(No such file or directory)
Unable to load file: java.io.FileNotFoundException: /export/viv/trunk/cc/projects/classlib/trunk/modules/misc/make/exclude.linux.x86.drl
(No such file or directory)
Unable to load file: java.io.FileNotFoundException: /export/viv/trunk/cc/projects/classlib/trunk/modules/misc/make/exclude.linux.x86.drl.interm
(No such file or directory)
Tests FAILED

***********************************************************
Unit Tests: (19018)
        
error: testCreateBranchElement javax.swing.text.AbstractDocumentTest
Unit Test Error Details:	(1)
                
Test: testCreateBranchElementClass: javax.swing.text.AbstractDocumentTestjava.lang.NullPointerException
	at javax.swing.text.AbstractDocument$BranchElement.getStartOffset(AbstractDocument.java:419)
	at javax.swing.text.AbstractDocumentTest.testCreateBranchElement(AbstractDocumentTest.java:165)
	at java.lang.reflect.VMReflection.invokeMethod(Native Method)


***********************************************************
Modifications since last successful build:	(6)
            
add cc-drlvm log20070117002244Lbuild.120 01/17/2007 00:22:44drlvm
modified gshimansky  /harmony/enhanced/drlvm/trunk/vm/interpreter/src/interpreter.cpp 01/16/2007
23:45:21 Applied HARMONY-2976. [drlvm][interpreter] VM crashes instead of throwing NullPointerExceptionTests
passed on Ubuntu x86, Windows 2003 server x86, SuSE9 x86_64
modified hindessm  /harmony/enhanced/classlib/trunk/modules/swing/src/main/java/common/javax/swing/text/StyleConstants.java
01/16/2007 23:10:21 Applying patches from "[#HARMONY-1767][classlib][swing]javax.swing.text.html.ComponentView(Element)
throwsunexpected NullPointerException on user's implementation".
modified hindessm  /harmony/enhanced/classlib/trunk/modules/swing/src/test/api/java/common/javax/swing/text/ComponentViewTest.java
01/16/2007 23:10:21 Applying patches from "[#HARMONY-1767][classlib][swing]javax.swing.text.html.ComponentView(Element)
throwsunexpected NullPointerException on user's implementation".
modified hindessm  /harmony/enhanced/classlib/trunk/modules/swing/src/test/api/java/common/javax/swing/text/AbstractDocument_BranchElementTest.java
01/16/2007 23:01:40 Applying patches from "[#HARMONY-2777] [classlib][swing]j.s.text.AbstractDocument.BranchElement.get{Start,
End}Offset throwArrayIndexOutOfBoundsException rather than NPE".
modified hindessm  /harmony/enhanced/classlib/trunk/modules/swing/src/main/java/common/javax/swing/text/AbstractDocument.java
01/16/2007 23:01:40 Applying patches from "[#HARMONY-2777] [classlib][swing]j.s.text.AbstractDocument.BranchElement.get{Start,
End}Offset throwArrayIndexOutOfBoundsException rather than NPE".

Mime
View raw message