harmony-alerts mailing list archives

Site index · List index
Message view « Date » · « Thread »
Top « Date » · « Thread »
From nom...@intel.com
Subject [build-test alert] BUILD FAILED Linux SUSE 9 64bit gcc debug: classlib over drlvm
Date Mon, 15 Jan 2007 23:51:42 GMT
BUILD FAILED:
	Ant Error Message:
/export/users/viv/trunk/cc/projects/classlib/trunk/build.xml:167: The following error occurred
while executing this line: /export/users/viv/trunk/cc/projects/classlib/trunk/make/build-test.xml:138:
There were test errors.

Date of build:	01/16/2007 04:13:44
Time to build:	97 minutes 12 seconds
Last changed:	01/16/2007 03:25:54
Last log entry:	drlvm

***********************************************************
Errors/Warnings:	(318)
            
Unable to load file: java.io.FileNotFoundException: /export/users/viv/trunk/cc/projects/classlib/trunk/modules/beans/make/exclude.linux.x86_64.drl.interm
(No such file or directory)
Unable to load file: java.io.FileNotFoundException: /export/users/viv/trunk/cc/projects/classlib/trunk/modules/concurrent/make/exclude.common
(No such file or directory)
Unable to load file: java.io.FileNotFoundException: /export/users/viv/trunk/cc/projects/classlib/trunk/modules/concurrent/make/exclude.linux.x86_64.drl
(No such file or directory)
Unable to load file: java.io.FileNotFoundException: /export/users/viv/trunk/cc/projects/classlib/trunk/modules/concurrent/make/exclude.linux.x86_64.drl.interm
(No such file or directory)
Unable to load file: java.io.FileNotFoundException: /export/users/viv/trunk/cc/projects/classlib/trunk/modules/crypto/make/exclude.common
(No such file or directory)
Unable to load file: java.io.FileNotFoundException: /export/users/viv/trunk/cc/projects/classlib/trunk/modules/crypto/make/exclude.linux.x86_64.drl
(No such file or directory)
Unable to load file: java.io.FileNotFoundException: /export/users/viv/trunk/cc/projects/classlib/trunk/modules/crypto/make/exclude.linux.x86_64.drl.interm
(No such file or directory)
Unable to load file: java.io.FileNotFoundException: /export/users/viv/trunk/cc/projects/classlib/trunk/modules/imageio/make/exclude.common
(No such file or directory)
Unable to load file: java.io.FileNotFoundException: /export/users/viv/trunk/cc/projects/classlib/trunk/modules/imageio/make/exclude.linux.x86_64.drl
(No such file or directory)
Unable to load file: java.io.FileNotFoundException: /export/users/viv/trunk/cc/projects/classlib/trunk/modules/imageio/make/exclude.linux.x86_64.drl.interm
(No such file or directory)
Test javax.swing.plaf.metal.MetalSliderUITest FAILED (timeout)

***********************************************************
Unit Tests: (18917)
        
error: unknown javax.swing.plaf.metal.MetalSliderUITest
Unit Test Error Details:	(1)
                
Test: unknownClass: javax.swing.plaf.metal.MetalSliderUITestjunit.framework.AssertionFailedError:
Timeout occurred


***********************************************************
Modifications since last successful build:	(6)
            
add cc-drlvm log20070116032554Lbuild.157 01/16/2007 03:25:54drlvm
add cc-classlib log20070116031423Lbuild.135 01/16/2007 03:14:23classlib
modified hindessm  /harmony/enhanced/classlib/trunk/modules/awt/src/test/api/java/common/java/awt/ContainerRTest.java
01/16/2007 02:40:41 Applying just the regression test from "[#HARMONY-2915] [classlib][swing]j.s.text.BoxView
incorrectly layouts where its child views are resizable".
modified hindessm  /harmony/enhanced/classlib/trunk/modules/swing/src/test/api/java/common/javax/swing/text/BoxView_WithChildrenTest.java
01/16/2007 02:38:58 Applying patches from "[#HARMONY-2915] [classlib][swing] j.s.text.BoxViewincorrectly
layouts where its child views are resizable".
modified hindessm  /harmony/enhanced/classlib/trunk/modules/swing/src/main/java/common/org/apache/harmony/x/swing/SizeRequirementsHelper.java
01/16/2007 02:38:58 Applying patches from "[#HARMONY-2915] [classlib][swing] j.s.text.BoxViewincorrectly
layouts where its child views are resizable".
modified hindessm  /harmony/enhanced/classlib/trunk/modules/swing/src/test/api/java/common/org/apache/harmony/x/swing/SizeRequirementsHelperRTest.java
01/16/2007 02:38:58 Applying patches from "[#HARMONY-2915] [classlib][swing] j.s.text.BoxViewincorrectly
layouts where its child views are resizable".

Mime
View raw message