harmony-alerts mailing list archives

Site index · List index
Message view « Date » · « Thread »
Top « Date » · « Thread »
From nom...@intel.com
Subject [build-test alert] BUILD FAILED Linux SUSE 9 64bit gcc debug: classlib over drlvm
Date Wed, 10 Jan 2007 22:07:50 GMT
BUILD FAILED:
	Ant Error Message:
/export/users/viv/trunk/cc/projects/classlib/trunk/build.xml:167: The following error occurred
while executing this line: /export/users/viv/trunk/cc/projects/classlib/trunk/make/build-test.xml:289:
Could not create task or type of type: replaceregexp.  Ant could not find the task or a class
this task relies upon.  This is common and has a number of causes; the usual  solutions are
to read the manual pages then download and install needed JAR files, or fix the build file:
  - You have misspelt 'replaceregexp'.    Fix: check your spelling.  - The task needs an external
JAR file to execute      and this is not found at the right place in the classpath.    Fix:
check the documentation for dependencies.    Fix: declare the task.  - The task is an Ant
optional task and the JAR file and/or libraries      implementing the functionality were not
found at the time you      yourself built your installation of Ant from the Ant sources. 
  Fix: Look in the ANT_HOME/lib for the 'ant-' JAR!
  corresponding to the      task and make sure it contains more than merely a META-INF/MANIFEST.MF.
     If all it contains is the manifest, then rebuild Ant with the needed      libraries present
in /export/users/viv/trunk/cc/lib/optional/ , or alternatively,      download a pre-built
release version from apache.org  - The build file was written for a later version of Ant 
  Fix: upgrade to at least the latest release version of Ant  - The task is not an Ant core
or optional task       and needs to be declared using <taskdef>.  - You are attempting
to use a task defined using      <presetdef> or <macrodef> but have spelt wrong
or not     defined it at the point of use  Remember that for JAR files to be visible to Ant
tasks implemented in ANT_HOME/lib, the files must be in the same directory or on the classpath
 Please neither file bug reports on this problem, nor email the Ant mailing lists, until all
of these causes have been explored, as this is not an Ant bug.

Date of build:	01/11/2007 02:47:43
Time to build:	79 minutes 41 seconds
Last changed:	01/11/2007 02:46:28
Last log entry:	H2652, write barrier and inlining support for gc_gen "build test" runs on
winxp and RHEL4 w/ gcc4.0.2


***********************************************************
Errors/Warnings:	(275)
            
Test javax.swing.table.DefaultTableCellRendererTest FAILED

***********************************************************
Unit Tests: (18912)
        
error: testCFII_ConnectTwice_Server_NonBlock org.apache.harmony.nio.tests.java.nio.channels.SocketChannelTest
Unit Test Error Details:	(1)
                
Test: testCFII_ConnectTwice_Server_NonBlockClass: org.apache.harmony.nio.tests.java.nio.channels.SocketChannelTestjava.net.BindException:
The address is not available
	at org.apache.harmony.luni.platform.OSNetworkSystem.socketBindImpl(OSNetworkSystem.java)
	at org.apache.harmony.luni.platform.OSNetworkSystem.bind(OSNetworkSystem.java)
	at org.apache.harmony.luni.net.PlainSocketImpl.bind(PlainSocketImpl.java:161)
	at java.net.ServerSocket.<init>(ServerSocket.java:115)
	at java.net.ServerSocket.<init>(ServerSocket.java:71)
	at org.apache.harmony.nio.tests.java.nio.channels.SocketChannelTest.ensureServerOpen(SocketChannelTest.java:1347)
	at org.apache.harmony.nio.tests.java.nio.channels.SocketChannelTest.testCFII_ConnectTwice_Server_NonBlock(SocketChannelTest.java)
	at java.lang.reflect.VMReflection.invokeMethod(Native Method)


***********************************************************
Modifications since last successful build:	(10)
            
modified wjwashburn  /harmony/enhanced/drlvm/trunk/build/make/deploy.xml 01/11/2007 02:46:28
H2652, write barrier and inlining support for gc_gen "build test" runs on winxp and RHEL4
w/ gcc4.0.2
modified wjwashburn  /harmony/enhanced/drlvm/trunk/vm/jitrino/src/optimizer/Inst.cpp 01/11/2007
02:46:28 H2652, write barrier and inlining support for gc_gen "build test" runs on winxp and
RHEL4 w/ gcc4.0.2
modified wjwashburn  /harmony/enhanced/drlvm/trunk/vm/jitrino/src/codegenerator/ia32/Ia32Printer.cpp
01/11/2007 02:46:28 H2652, write barrier and inlining support for gc_gen "build test" runs
on winxp and RHEL4 w/ gcc4.0.2
modified wjwashburn  /harmony/enhanced/drlvm/trunk/vm/jitrino/src/optimizer/helper_inliner.cpp
01/11/2007 02:46:28 H2652, write barrier and inlining support for gc_gen "build test" runs
on winxp and RHEL4 w/ gcc4.0.2
modified wjwashburn  /harmony/enhanced/drlvm/trunk/vm/jitrino/src/optimizer/inliner.cpp 01/11/2007
02:46:28 H2652, write barrier and inlining support for gc_gen "build test" runs on winxp and
RHEL4 w/ gcc4.0.2
modified wjwashburn  /harmony/enhanced/drlvm/trunk/vm/gc_gen/src/jni/helper.cpp 01/11/2007
02:46:28 H2652, write barrier and inlining support for gc_gen "build test" runs on winxp and
RHEL4 w/ gcc4.0.2
modified wjwashburn  /harmony/enhanced/drlvm/trunk/vm/jitrino/src/translator/java/JavaByteCodeTranslator.cpp
01/11/2007 02:46:28 H2652, write barrier and inlining support for gc_gen "build test" runs
on winxp and RHEL4 w/ gcc4.0.2
modified wjwashburn  /harmony/enhanced/drlvm/trunk/vm/jitrino/src/codegenerator/ia32/Ia32InstCodeSelector.cpp
01/11/2007 02:46:28 H2652, write barrier and inlining support for gc_gen "build test" runs
on winxp and RHEL4 w/ gcc4.0.2
modified wjwashburn  /harmony/enhanced/drlvm/trunk/vm/gc_gen/javasrc/org/apache/harmony/drlvm/gc_gen/GCHelper.java
01/11/2007 02:46:28 H2652, write barrier and inlining support for gc_gen "build test" runs
on winxp and RHEL4 w/ gcc4.0.2
modified wjwashburn  /harmony/enhanced/drlvm/trunk/vm/vmcore/src/kernel_classes/javasrc/org/apache/harmony/drlvm/VMHelper.java
01/11/2007 02:46:28 H2652, write barrier and inlining support for gc_gen "build test" runs
on winxp and RHEL4 w/ gcc4.0.2

Mime
View raw message