harmony-alerts mailing list archives

Site index · List index
Message view « Date » · « Thread »
Top « Date » · « Thread »
From nom...@hursley.ibm.com
Subject [continuum] BUILD FAILURE: Classlib/linux.ia32 Build/Test
Date Sat, 06 Jan 2007 19:05:14 GMT
Online report : http://people.apache.org/~hindessm/continuum/classlib/linux.ia32/2007/01/06/20070106-190514.failure.log.gz
Build statistics:
  State: Failed
  Previous State: Ok
  Started at: Sat, 6 Jan 2007 19:02:49 +0000
  Finished at: Sat, 6 Jan 2007 19:05:13 +0000
  Total time: 2m 23s
  Build Trigger: Schedule
  Exit code: 1
  Building machine hostname: hy2
  Operating system : Linux(unknown)
  Java version : 1.5.0_06(Sun Microsystems Inc.)

Changes
                            classlib/modules/archive/src/test/java/org/apache/harmony/archive/tests/AllTests.java
            classlib/modules/pack200/META-INF/MANIFEST.MF
            classlib/modules/pack200/src/test/java/org/apache/harmony/pack200/tests/AttributeLayoutMapTest.java
            classlib/modules/pack200/src/test/java/org/apache/harmony/pack200/tests/AttributeLayoutTest.java
            classlib/modules/pack200/src/test/java/org/apache/harmony/pack200/tests/SegmentTest.java
            classlib/modules/pack200/src/test/java/org/apache/harmony/pack200/tests/CodecEncodingTest.java
            classlib/modules/pack200/src/test/java/org/apache/harmony/pack200/tests/PopulationCodecTest.java
            classlib/modules/pack200/src/test/java/org/apache/harmony/pack200/tests/AllTests.java
            classlib/modules/pack200/src/test/java/org/apache/harmony/pack200/tests/HelloWorld.java
            classlib/modules/pack200/src/test/java/org/apache/harmony/pack200/tests/CodecTest.java
            classlib/modules/pack200/src/test/java/org/apache/harmony/pack200/tests/SegmentOptionsTest.java
            classlib/modules/pack200/src/test/java/org/apache/harmony/pack200/tests/bytecode/ConstantPoolTest.java
            classlib/modules/pack200/src/test/java/org/apache/harmony/pack200/tests/bytecode/ClassFileEntryTest.java
            classlib/modules/pack200/src/test/resources/org/apache/harmony/pack200/tests/HelloWorld.pack
            classlib/modules/pack200/src/test/resources/org/apache/harmony/pack200/tests/JustResources.pack
            classlib/modules/pack200/src/main/java/org/apache/harmony/pack200/Codec.java
            classlib/modules/pack200/src/main/java/org/apache/harmony/pack200/BHSDCodec.java
            classlib/modules/pack200/src/main/java/org/apache/harmony/pack200/SegmentOptions.java
            classlib/modules/pack200/src/main/java/org/apache/harmony/pack200/bytecode/CPMethod.java
            classlib/modules/pack200/src/main/java/org/apache/harmony/pack200/bytecode/CPFieldRef.java
            classlib/modules/pack200/src/main/java/org/apache/harmony/pack200/bytecode/Attribute.java
            classlib/modules/pack200/src/main/java/org/apache/harmony/pack200/bytecode/ClassFile.java
            classlib/modules/pack200/src/main/java/org/apache/harmony/pack200/bytecode/ConstantPoolEntry.java
            classlib/modules/pack200/src/main/java/org/apache/harmony/pack200/bytecode/ExceptionsAttribute.java
            classlib/modules/pack200/src/main/java/org/apache/harmony/pack200/bytecode/CPField.java
            classlib/modules/pack200/src/main/java/org/apache/harmony/pack200/bytecode/ClassConstantPool.java
            classlib/modules/pack200/src/main/java/org/apache/harmony/pack200/bytecode/CPUTF8.java
            classlib/modules/pack200/src/main/java/org/apache/harmony/pack200/bytecode/ConstantValueAttribute.java
            classlib/modules/pack200/src/main/java/org/apache/harmony/pack200/bytecode/CPConstant.java
            classlib/modules/pack200/src/main/java/org/apache/harmony/pack200/bytecode/CPInteger.java
            classlib/modules/pack200/src/main/java/org/apache/harmony/pack200/bytecode/CPLong.java
            classlib/modules/pack200/src/main/java/org/apache/harmony/pack200/bytecode/SourceFileAttribute.java
            classlib/modules/pack200/src/main/java/org/apache/harmony/pack200/bytecode/CPConstantNumber.java
            classlib/modules/pack200/src/main/java/org/apache/harmony/pack200/bytecode/ClassFileEntry.java
            classlib/modules/pack200/src/main/java/org/apache/harmony/pack200/bytecode/CPNameAndType.java
            classlib/modules/pack200/src/main/java/org/apache/harmony/pack200/bytecode/CPFloat.java
            classlib/modules/pack200/src/main/java/org/apache/harmony/pack200/bytecode/CPClass.java
            classlib/modules/pack200/src/main/java/org/apache/harmony/pack200/bytecode/CPString.java
            classlib/modules/pack200/src/main/java/org/apache/harmony/pack200/bytecode/CPMember.java
            classlib/modules/pack200/src/main/java/org/apache/harmony/pack200/bytecode/CPDouble.java
            classlib/modules/pack200/make/exclude.windows.x86_64.drl
            classlib/modules/pack200/make/exclude.linux.x86.ibm
            classlib/modules/pack200/make/exclude.linux.x86_64.drl
            classlib/modules/pack200/make/exclude.windows.x86_64.ibm
            classlib/modules/pack200/make/exclude.windows.x86.drl
            classlib/modules/pack200/make/exclude.linux.x86_64.ibm
            classlib/modules/pack200/make/exclude.linux.x86.drl
            classlib/modules/pack200/make/exclude.windows.x86.ibm
            classlib/modules/pack200/make/hyproperties.xml
            classlib/modules/pack200/build.xml

****************************************************************************
Output:
****************************************************************************
Buildfile: build.xml

build:
   [delete] Deleting directory /home/hybld/continuum-working-directory/6/classlib/deploy
     [echo] Classlib revision is 493538
     [echo] Post process: true
     [echo] JAPI: true
     [echo] Building with reference jdk/javac
     [exec] Buildfile: build.xml

     [exec] -init-hdk-for-clean:
     [exec]     [mkdir] Created dir: /home/hybld/continuum-working-directory/6/classlib/deploy/build/ant
     [exec]      [copy] Copying 1 file to /home/hybld/continuum-working-directory/6/classlib/deploy/build/ant

     [exec] clean-java:

     [exec] -modules-clean-bin:

     [exec] clean:
     [exec]    [delete] Deleting 30 files from /home/hybld/continuum-working-directory/6/classlib/build/classes
     [exec]    [delete] Deleting 12 files from /home/hybld/continuum-working-directory/6/classlib/modules/accessibility/bin/test

     [exec] clean:
     [exec]    [delete] Deleting 13 files from /home/hybld/continuum-working-directory/6/classlib/build/classes

     [exec] clean:
     [exec]    [delete] Deleting 35 files from /home/hybld/continuum-working-directory/6/classlib/build/classes
     [exec]    [delete] Deleting 1 files from /home/hybld/continuum-working-directory/6/classlib/modules/applet/bin/test

     [exec] clean:
     [exec]    [delete] Deleting 41 files from /home/hybld/continuum-working-directory/6/classlib/build/classes
     [exec]    [delete] Deleting 49 files from /home/hybld/continuum-working-directory/6/classlib/modules/archive/bin/test

     [exec] clean-native-includes:
     [exec]    [delete] /home/hybld/continuum-working-directory/6/classlib/deploy/include
not found.

     [exec] clean:
     [exec]    [delete] Deleting 113 files from /home/hybld/continuum-working-directory/6/classlib/build/classes
     [exec]    [delete] Deleting 226 files from /home/hybld/continuum-working-directory/6/classlib/modules/auth/bin/test

     [exec] clean:
     [exec]    [delete] Deleting 901 files from /home/hybld/continuum-working-directory/6/classlib/build/classes
     [exec]    [delete] Deleting 589 files from /home/hybld/continuum-working-directory/6/classlib/modules/awt/bin/test

     [exec] clean:
     [exec]    [delete] Deleting 107 files from /home/hybld/continuum-working-directory/6/classlib/build/classes
     [exec]    [delete] Deleting 238 files from /home/hybld/continuum-working-directory/6/classlib/modules/beans/bin/test

     [exec] clean:
     [exec]    [delete] Deleting 125 files from /home/hybld/continuum-working-directory/6/classlib/build/classes
     [exec]    [delete] /home/hybld/continuum-working-directory/6/classlib/modules/concurrent/bin/test
not found.

     [exec] clean:
     [exec]    [delete] Deleting 48 files from /home/hybld/continuum-working-directory/6/classlib/build/classes
     [exec]    [delete] Deleting 91 files from /home/hybld/continuum-working-directory/6/classlib/modules/crypto/bin/test

     [exec] clean:
     [exec]    [delete] Deleting 87 files from /home/hybld/continuum-working-directory/6/classlib/build/classes

     [exec] clean:
     [exec]    [delete] Deleting 9 files from /home/hybld/continuum-working-directory/6/classlib/build/classes
     [exec]    [delete] Deleting 20 files from /home/hybld/continuum-working-directory/6/classlib/modules/instrument/bin/test

     [exec] clean:
     [exec]    [delete] Deleting 154 files from /home/hybld/continuum-working-directory/6/classlib/build/classes
     [exec]    [delete] Deleting 163 files from /home/hybld/continuum-working-directory/6/classlib/modules/jndi/bin/test

     [exec] clean:
     [exec]    [delete] Deleting 15 files from /home/hybld/continuum-working-directory/6/classlib/build/classes
     [exec]    [delete] Deleting 2 files from /home/hybld/continuum-working-directory/6/classlib/modules/lang-management/bin/test

     [exec] clean:
     [exec]    [delete] Deleting 34 files from /home/hybld/continuum-working-directory/6/classlib/build/classes
     [exec]    [delete] Deleting 99 files from /home/hybld/continuum-working-directory/6/classlib/modules/logging/bin/test

     [exec] clean:
     [exec]    [delete] Deleting 963 files from /home/hybld/continuum-working-directory/6/classlib/build/classes
     [exec]    [delete] Deleting 903 files from /home/hybld/continuum-working-directory/6/classlib/modules/luni/bin/test

     [exec] clean-native-includes:
     [exec]    [delete] /home/hybld/continuum-working-directory/6/classlib/deploy/include
not found.
     [exec]    [delete] /home/hybld/continuum-working-directory/6/classlib/deploy/jdk/include
not found.

     [exec] clean:
     [exec]    [delete] Deleting 29 files from /home/hybld/continuum-working-directory/6/classlib/build/classes

     [exec] clean:
     [exec]    [delete] Deleting 14 files from /home/hybld/continuum-working-directory/6/classlib/build/classes
     [exec]    [delete] Deleting 25 files from /home/hybld/continuum-working-directory/6/classlib/modules/math/bin/test

...

     [exec] -clean-bin-catch-all:
     [exec]    [delete] Deleting 37 files from /home/hybld/continuum-working-directory/6/classlib/build/classes
     [exec]    [delete] Deleted 307 directories from /home/hybld/continuum-working-directory/6/classlib/build/classes

     [exec] BUILD FAILED
     [exec] /home/hybld/continuum-working-directory/6/classlib/build.xml:123: The following
error occurred while executing this line:
     [exec] /home/hybld/continuum-working-directory/6/classlib/make/build-java.xml:96: ...

     [exec] Built files still exist after module clean targets have run.  This
     [exec] probably means that one or more patternsets are incomplete.  The
     [exec] remaining files are:

...

     [exec] /home/hybld/continuum-working-directory/6/classlib/build/classes/org/apache/harmony/archive/internal/pack200/bytecode/SourceFileAttribute.class

     [exec] Total time: 2 minutes 10 seconds

BUILD FAILED
/home/hybld/continuum-working-directory/6/build.xml:114: exec returned: 1

Total time: 2 minutes 20 seconds

****************************************************************************

...

Mime
View raw message