harmony-alerts mailing list archives

Site index · List index
Message view « Date » · « Thread »
Top « Date » · « Thread »
From nom...@hursley.ibm.com
Subject [continuum] BUILD FAILURE: Classlib/linux.ia32 Build/Test
Date Fri, 05 Jan 2007 12:34:13 GMT
Online report : http://people.apache.org/~hindessm/continuum/classlib/linux.ia32/2007/01/05/20070105-123413.failure.log.gz
Build statistics:
  State: Failed
  Previous State: Failed
  Started at: Fri, 5 Jan 2007 11:33:44 +0000
  Finished at: Fri, 5 Jan 2007 12:34:11 +0000
  Total time: 1h 0m 26s
  Build Trigger: Schedule
  Exit code: 1
  Building machine hostname: hy2
  Operating system : Linux(unknown)
  Java version : 1.5.0_06(Sun Microsystems Inc.)

Changes
                            classlib/modules/luni/src/test/java/tests/api/java/net/URLTest.java
            classlib/modules/luni/src/test/java/tests/api/java/net/SocketTest.java
            classlib/modules/luni/src/test/java/tests/api/java/net/DatagramSocketTest.java
            classlib/modules/luni/src/main/java/java/net/URLStreamHandler.java
            classlib/modules/luni/src/main/java/java/net/DatagramSocket.java
            classlib/modules/luni/src/main/java/org/apache/harmony/luni/net/PlainSocketImpl.java
            classlib/modules/luni/src/main/java/org/apache/harmony/luni/util/ExternalMessages.properties
        
****************************************************************************
Output:
****************************************************************************
Buildfile: build.xml

build:
   [delete] Deleting directory /home/hybld/continuum-working-directory/6/classlib/deploy
     [echo] Classlib revision is 492988
     [echo] Post process: true
     [echo] JAPI: true
     [echo] Building with reference jdk/javac
     [exec] Buildfile: build.xml

     [exec] -init-hdk-for-clean:
     [exec]     [mkdir] Created dir: /home/hybld/continuum-working-directory/6/classlib/deploy/build/ant
     [exec]      [copy] Copying 1 file to /home/hybld/continuum-working-directory/6/classlib/deploy/build/ant

     [exec] clean-java:

     [exec] -modules-clean-bin:

     [exec] clean:
     [exec]    [delete] Deleting 30 files from /home/hybld/continuum-working-directory/6/classlib/build/classes
     [exec]    [delete] Deleting 12 files from /home/hybld/continuum-working-directory/6/classlib/modules/accessibility/bin/test

     [exec] clean:
     [exec]    [delete] Deleting 13 files from /home/hybld/continuum-working-directory/6/classlib/build/classes

     [exec] clean:
     [exec]    [delete] Deleting 35 files from /home/hybld/continuum-working-directory/6/classlib/build/classes
     [exec]    [delete] Deleting 1 files from /home/hybld/continuum-working-directory/6/classlib/modules/applet/bin/test

     [exec] clean:
     [exec]    [delete] Deleting 78 files from /home/hybld/continuum-working-directory/6/classlib/build/classes
     [exec]    [delete] Deleting 49 files from /home/hybld/continuum-working-directory/6/classlib/modules/archive/bin/test

     [exec] clean-native-includes:
     [exec]    [delete] /home/hybld/continuum-working-directory/6/classlib/deploy/include
not found.

     [exec] clean:
     [exec]    [delete] Deleting 113 files from /home/hybld/continuum-working-directory/6/classlib/build/classes
     [exec]    [delete] Deleting 226 files from /home/hybld/continuum-working-directory/6/classlib/modules/auth/bin/test

     [exec] clean:
     [exec]    [delete] Deleting 901 files from /home/hybld/continuum-working-directory/6/classlib/build/classes
     [exec]    [delete] Deleting 589 files from /home/hybld/continuum-working-directory/6/classlib/modules/awt/bin/test

     [exec] clean:
     [exec]    [delete] Deleting 107 files from /home/hybld/continuum-working-directory/6/classlib/build/classes
     [exec]    [delete] Deleting 238 files from /home/hybld/continuum-working-directory/6/classlib/modules/beans/bin/test

     [exec] clean:
     [exec]    [delete] Deleting 125 files from /home/hybld/continuum-working-directory/6/classlib/build/classes
     [exec]    [delete] /home/hybld/continuum-working-directory/6/classlib/modules/concurrent/bin/test
not found.

     [exec] clean:
     [exec]    [delete] Deleting 48 files from /home/hybld/continuum-working-directory/6/classlib/build/classes
     [exec]    [delete] Deleting 91 files from /home/hybld/continuum-working-directory/6/classlib/modules/crypto/bin/test

     [exec] clean:
     [exec]    [delete] Deleting 87 files from /home/hybld/continuum-working-directory/6/classlib/build/classes

     [exec] clean:
     [exec]    [delete] Deleting 9 files from /home/hybld/continuum-working-directory/6/classlib/build/classes
     [exec]    [delete] Deleting 20 files from /home/hybld/continuum-working-directory/6/classlib/modules/instrument/bin/test

     [exec] clean:
     [exec]    [delete] Deleting 154 files from /home/hybld/continuum-working-directory/6/classlib/build/classes
     [exec]    [delete] Deleting 163 files from /home/hybld/continuum-working-directory/6/classlib/modules/jndi/bin/test

     [exec] clean:
     [exec]    [delete] Deleting 15 files from /home/hybld/continuum-working-directory/6/classlib/build/classes
     [exec]    [delete] Deleting 2 files from /home/hybld/continuum-working-directory/6/classlib/modules/lang-management/bin/test

     [exec] clean:
     [exec]    [delete] Deleting 34 files from /home/hybld/continuum-working-directory/6/classlib/build/classes
     [exec]    [delete] Deleting 99 files from /home/hybld/continuum-working-directory/6/classlib/modules/logging/bin/test

     [exec] clean:
     [exec]    [delete] Deleting 963 files from /home/hybld/continuum-working-directory/6/classlib/build/classes
     [exec]    [delete] Deleting 901 files from /home/hybld/continuum-working-directory/6/classlib/modules/luni/bin/test

     [exec] clean-native-includes:
     [exec]    [delete] /home/hybld/continuum-working-directory/6/classlib/deploy/include
not found.
     [exec]    [delete] /home/hybld/continuum-working-directory/6/classlib/deploy/jdk/include
not found.

     [exec] clean:
     [exec]    [delete] Deleting 29 files from /home/hybld/continuum-working-directory/6/classlib/build/classes

     [exec] clean:
     [exec]    [delete] Deleting 14 files from /home/hybld/continuum-working-directory/6/classlib/build/classes
     [exec]    [delete] Deleting 25 files from /home/hybld/continuum-working-directory/6/classlib/modules/math/bin/test

     [exec] clean:
     [exec]    [delete] Deleting 14 files from /home/hybld/continuum-working-directory/6/classlib/build/classes
     [exec]    [delete] Deleting 1 files from /home/hybld/continuum-working-directory/6/classlib/modules/misc/bin/test

     [exec] clean:
     [exec]    [delete] Deleting 146 files from /home/hybld/continuum-working-directory/6/classlib/build/classes
     [exec]    [delete] Deleted 5 directories from /home/hybld/continuum-working-directory/6/classlib/build/classes
     [exec]    [delete] Deleting 156 files from /home/hybld/continuum-working-directory/6/classlib/modules/nio/bin/test
     [exec]    [delete] Deleted 19 directories from /home/hybld/continuum-working-directory/6/classlib/modules/nio/bin/test

     [exec] clean:
     [exec]    [delete] Deleting 20 files from /home/hybld/continuum-working-directory/6/classlib/build/classes
     [exec]    [delete] Deleting 77 files from /home/hybld/continuum-working-directory/6/classlib/modules/nio_char/bin/test

     [exec] clean:

     [exec] clean-native-includes:
     [exec]    [delete] /home/hybld/continuum-working-directory/6/classlib/deploy/include
not found.

     [exec] clean:
     [exec]    [delete] Deleting 32 files from /home/hybld/continuum-working-directory/6/classlib/build/classes
     [exec]    [delete] Deleting 34 files from /home/hybld/continuum-working-directory/6/classlib/modules/prefs/bin/test

     [exec] clean:
     [exec]    [delete] Deleting 205 files from /home/hybld/continuum-working-directory/6/classlib/build/classes
     [exec]    [delete] Deleting 60 files from /home/hybld/continuum-working-directory/6/classlib/modules/print/bin/test

     [exec] clean:
     [exec]    [delete] Deleting 177 files from /home/hybld/continuum-working-directory/6/classlib/build/classes
     [exec]    [delete] Deleting 13 files from /home/hybld/continuum-working-directory/6/classlib/modules/regex/bin/test

     [exec] clean:
     [exec]    [delete] Deleting 230 files from /home/hybld/continuum-working-directory/6/classlib/build/classes
     [exec]    [delete] Deleting 53 files from /home/hybld/continuum-working-directory/6/classlib/modules/rmi/bin/test

     [exec] clean:
     [exec]    [delete] Deleting 428 files from /home/hybld/continuum-working-directory/6/classlib/build/classes
     [exec]    [delete] Deleting 618 files from /home/hybld/continuum-working-directory/6/classlib/modules/security/bin/test

     [exec] clean:
     [exec]    [delete] Deleting 2 files from /home/hybld/continuum-working-directory/6/classlib/build/classes

     [exec] clean:
     [exec]    [delete] Deleting 72 files from /home/hybld/continuum-working-directory/6/classlib/build/classes
     [exec]    [delete] Deleting 53 files from /home/hybld/continuum-working-directory/6/classlib/modules/sound/bin/test

     [exec] clean:
     [exec]    [delete] Deleting 74 files from /home/hybld/continuum-working-directory/6/classlib/build/classes
     [exec]    [delete] Deleting 54 files from /home/hybld/continuum-working-directory/6/classlib/modules/sql/bin/test

     [exec] clean:
     [exec]    [delete] Deleting 5 files from /home/hybld/continuum-working-directory/6/classlib/build/classes

     [exec] clean:
     [exec]    [delete] Deleting 1591 files from /home/hybld/continuum-working-directory/6/classlib/build/classes
     [exec]    [delete] Deleting 1502 files from /home/hybld/continuum-working-directory/6/classlib/modules/swing/bin/test

     [exec] clean:
     [exec]    [delete] Deleting 40 files from /home/hybld/continuum-working-directory/6/classlib/build/classes
     [exec]    [delete] Deleting 32 files from /home/hybld/continuum-working-directory/6/classlib/modules/text/bin/test

     [exec] clean:
     [exec]    [delete] Deleting 35 files from /home/hybld/continuum-working-directory/6/classlib/build/classes
     [exec]    [delete] Deleting 4 files from /home/hybld/continuum-working-directory/6/classlib/modules/tools/bin/test

     [exec] clean:
     [exec]    [delete] Deleting 123 files from /home/hybld/continuum-working-directory/6/classlib/build/classes

...

     [exec]     [junit] Tests run: 4, Failures: 0, Errors: 0, Time elapsed: 0.005 sec
     [exec]     [junit] Tests run: 18, Failures: 0, Errors: 0, Time elapsed: 0.012 sec
     [exec]     [junit] Tests run: 1, Failures: 0, Errors: 0, Time elapsed: 0.005 sec
     [exec]     [junit] Tests run: 34, Failures: 0, Errors: 1, Time elapsed: 15.27 sec
     [exec]     [junit] TEST tests.api.java.net.DatagramSocketTest FAILED
     [exec]     [junit] Tests run: 8, Failures: 0, Errors: 0, Time elapsed: 0.027 sec
     [exec]     [junit] Tests run: 2, Failures: 0, Errors: 0, Time elapsed: 0.003 sec
     [exec]     [junit] Tests run: 2, Failures: 0, Errors: 0, Time elapsed: 0.003 sec
     [exec]     [junit] Tests run: 9, Failures: 0, Errors: 0, Time elapsed: 4.215 sec
     [exec]     [junit] Tests run: 2, Failures: 0, Errors: 0, Time elapsed: 0.005 sec

...

     [exec]     [junit] Tests run: 23, Failures: 0, Errors: 0, Time elapsed: 0.122 sec
     [exec]     [junit] Tests run: 19, Failures: 0, Errors: 0, Time elapsed: 0.051 sec
     [exec]     [junit] Tests run: 48, Failures: 0, Errors: 0, Time elapsed: 0.255 sec
     [exec]     [junit] Tests run: 16, Failures: 0, Errors: 0, Time elapsed: 0.351 sec
     [exec]     [junit] Tests FAILED

     [exec] touch-failures-file:

     [exec] touch-errors-file:


...

     [exec] gen-report:

     [exec] check-test-result:

     [exec] BUILD FAILED
     [exec] /home/hybld/continuum-working-directory/6/classlib/build.xml:167: The following
error occurred while executing this line:
     [exec] /home/hybld/continuum-working-directory/6/classlib/make/build-test.xml:138: There
were test errors.

     [exec] Total time: 43 minutes 47 seconds
     [exec] Result: 1
     [echo] Tests.failed is set to true

japi:

     [exec] Processing class java.lang,Object:+
     [exec] Processing package java.lang,:==========================================================================+-++++++++++++++++++++++++-+++++++++++++++++++++++++++++++++++++++++++++++++--^+^+++++++++--++++++++++

...

     [exec] Processing package java.lang.management,:==========================================================================+++++++++++++++
     [exec] Processing package java.lang.ref,:==========================================================================+++++
     [exec] Processing package java.lang.reflect,:==========================================================================+++++++++++++++++++++
     [exec] Processing class ,java:
     [exec] Failed to Japize java: java.lang.RuntimeException: NoClassDefFoundError: java
     [exec] java.lang.RuntimeException: NoClassDefFoundError: java
     [exec] 	at net.wuffies.japi.ClassFile.forName(ClassFile.java:163)
     [exec] 	at net.wuffies.japi.Japize.getClassWrapper(Japize.java:1425)
     [exec] 	at net.wuffies.japi.Japize.japizeClass(Japize.java:748)
     [exec] 	at net.wuffies.japi.Japize.processClass(Japize.java:516)

...

     [exec] 	at net.wuffies.japi.Japize.doJapize(Japize.java:443)
     [exec] 	at net.wuffies.japi.Japize.main(Japize.java:316)

     [exec] Processing class ,javax:
     [exec] Failed to Japize javax: java.lang.RuntimeException: NoClassDefFoundError: javax
     [exec] java.lang.RuntimeException: NoClassDefFoundError: javax
     [exec] 	at net.wuffies.japi.ClassFile.forName(ClassFile.java:163)
     [exec] 	at net.wuffies.japi.Japize.getClassWrapper(Japize.java:1425)
     [exec] 	at net.wuffies.japi.Japize.japizeClass(Japize.java:748)
     [exec] 	at net.wuffies.japi.Japize.processClass(Japize.java:516)

...

     [exec] 	at net.wuffies.japi.Japize.doJapize(Japize.java:443)
     [exec] 	at net.wuffies.japi.Japize.main(Japize.java:316)

     [exec] Processing class ,org:
     [exec] Failed to Japize org: java.lang.RuntimeException: NoClassDefFoundError: org
     [exec] java.lang.RuntimeException: NoClassDefFoundError: org
     [exec] 	at net.wuffies.japi.ClassFile.forName(ClassFile.java:163)
     [exec] 	at net.wuffies.japi.Japize.getClassWrapper(Japize.java:1425)
     [exec] 	at net.wuffies.japi.Japize.japizeClass(Japize.java:748)
     [exec] 	at net.wuffies.japi.Japize.processClass(Japize.java:516)

...

update-index:

test-result:

BUILD FAILED
/home/hybld/continuum-working-directory/6/build.xml:193: There were test errors.

Total time: 60 minutes 25 seconds

****************************************************************************

...

Mime
View raw message