harmony-alerts mailing list archives

Site index · List index
Message view « Date » · « Thread »
Top « Date » · « Thread »
From ge...@apache.org
Subject [build-test alert] BUILD FAILED lnx gcc debug: classlib over drlvm
Date Wed, 31 Jan 2007 14:30:20 GMT
BUILD FAILED:
	Ant Error Message:
/home/geir/dev/apache/harmony/enhanced/buildtest/trunk/cc/projects/classlib/trunk/build.xml:167: The following error occurred while executing this line: /home/geir/dev/apache/harmony/enhanced/buildtest/trunk/cc/projects/classlib/trunk/make/build-test.xml:289: Could not create task or type of type: replaceregexp.  Ant could not find the task or a class this task relies upon.  This is common and has a number of causes; the usual  solutions are to read the manual pages then download and install needed JAR files, or fix the build file:   - You have misspelt 'replaceregexp'.    Fix: check your spelling.  - The task needs an external JAR file to execute      and this is not found at the right place in the classpath.    Fix: check the documentation for dependencies.    Fix: declare the task.  - The task is an Ant optional task and the JAR file and/or libraries      implementing the functionality were not found at the time you      yourself built your installation of Ant from the Ant
 sources.    Fix: Look in the ANT_HOME/lib for the 'ant-' JAR corresponding to the      task and make sure it contains more than merely a META-INF/MANIFEST.MF.      If all it contains is the manifest, then rebuild Ant with the needed      libraries present in /home/geir/dev/apache/harmony/enhanced/buildtest/trunk/cc/lib/optional/ , or alternatively,      download a pre-built release version from apache.org  - The build file was written for a later version of Ant    Fix: upgrade to at least the latest release version of Ant  - The task is not an Ant core or optional task       and needs to be declared using <taskdef>.  - You are attempting to use a task defined using      <presetdef> or <macrodef> but have spelt wrong or not     defined it at the point of use  Remember that for JAR files to be visible to Ant tasks implemented in ANT_HOME/lib, the files must be in the same directory or on the classpath  Please neither file bug reports on this problem, nor email the Ant mailing 
 lists,
 until all of these causes have been explored, as this is not an Ant bug.

Date of build:	01/31/2007 08:56:59
Time to build:	32 minutes 51 seconds
Last changed:	01/31/2007 08:41:10
Last log entry:	Applied HARMONY-2905 [drlvm][jvmti] java.lang.VerifyError is thrown for instrumented class

Tests passed on Ubuntu6 x86, Windows 2003 server x86 and SuSE9 x86_64



***********************************************************
Errors/Warnings:	(208)
            
Tests FAILED
Tests FAILED (timeout)

***********************************************************
Unit Tests: (16298)
        
error: testListEditor_ListEditor javax.swing.JSpinnerTest
error: testListEditor_formatter javax.swing.JSpinnerTest
error: testAddNull javax.swing.JTabbedPaneRTest
error: testRemoveAll javax.swing.JTabbedPaneTest
error: testUpdateUI javax.swing.JTabbedPaneTest
error: testGetTabCount javax.swing.JTabbedPaneTest
error: testGetTabRunCount javax.swing.JTabbedPaneTest
error: testFireStateChanged javax.swing.JTabbedPaneTest
error: testJTabbedPane javax.swing.JTabbedPaneTest
error: testJTabbedPaneint javax.swing.JTabbedPaneTest
error: testJTabbedPaneintint javax.swing.JTabbedPaneTest
error: testRemoveTabAt javax.swing.JTabbedPaneTest
error: testRemoveComponent javax.swing.JTabbedPaneTest
error: testRemoveint javax.swing.JTabbedPaneTest
error: testSetGetSelectedIndex javax.swing.JTabbedPaneTest
error: testSetGetTabLayoutPolicy javax.swing.JTabbedPaneTest
error: testSetGetTabPlacement javax.swing.JTabbedPaneTest
error: testIndexAtLocation javax.swing.JTabbedPaneTest
error: testSetGetDisplayedMnemonicIndexAt javax.swing.JTabbedPaneTest
error: testSetGetMnemonicAt javax.swing.JTabbedPaneTest
error: testSetIsEnabledAt javax.swing.JTabbedPaneTest
error: testAddComponent javax.swing.JTabbedPaneTest
error: testAddComponentint javax.swing.JTabbedPaneTest
error: testAddComponentObject javax.swing.JTabbedPaneTest
error: testAddComponentObjectint javax.swing.JTabbedPaneTest
error: testAddStringComponent javax.swing.JTabbedPaneTest
error: testAddRemoveChangeListener javax.swing.JTabbedPaneTest
error: testAddTabStringComponent javax.swing.JTabbedPaneTest
error: testAddTabStringIconComponent javax.swing.JTabbedPaneTest
error: testAddTabStringIconComponentString javax.swing.JTabbedPaneTest
error: testCreateChangeListener javax.swing.JTabbedPaneTest
error: testGetAccessibleContext javax.swing.JTabbedPaneTest
error: testGetBoundsAt javax.swing.JTabbedPaneTest
error: testGetChangeListeners javax.swing.JTabbedPaneTest
error: testSetTitleAt javax.swing.JTabbedPaneTest
error: testGetTitleAt javax.swing.JTabbedPaneTest
error: testGetToolTipTextMouseEvent javax.swing.JTabbedPaneTest
error: testGetUIClassID javax.swing.JTabbedPaneTest
error: testIndexOfComponent javax.swing.JTabbedPaneTest
error: testIndexOfTabIcon javax.swing.JTabbedPaneTest
error: testIndexOfTabString javax.swing.JTabbedPaneTest
error: testInsertTab javax.swing.JTabbedPaneTest
error: testParamString javax.swing.JTabbedPaneTest
error: testSetBackgroundAt javax.swing.JTabbedPaneTest
error: testGetBackgroundAt javax.swing.JTabbedPaneTest
error: testSetForegroundAt javax.swing.JTabbedPaneTest
error: testGetForegroundAt javax.swing.JTabbedPaneTest
error: testSetGetComponentAt javax.swing.JTabbedPaneTest
error: testSetGetDisabledIconAt javax.swing.JTabbedPaneTest
error: testSetGetIconAt javax.swing.JTabbedPaneTest
error: testSetGetModel javax.swing.JTabbedPaneTest
error: testSetGetSelectedComponentComponent javax.swing.JTabbedPaneTest
error: testSetGetToolTipTextAt javax.swing.JTabbedPaneTest
error: testSetGetUI javax.swing.JTabbedPaneTest
error: testSelectAllClearSelection javax.swing.JTableRTest
error: testReplaceSelection_AtTheBeginningOfParagraph javax.swing.JTextPaneRTest
error: testReplaceSelection_WithSelection javax.swing.JTextPaneRTest
error: testReplaceSelection_WithNoSelection javax.swing.JTextPaneRTest
error: testJTextPane javax.swing.JTextPaneTest
error: testGetUIClassID javax.swing.JTextPaneTest
error: testSetDocument javax.swing.JTextPaneTest
error: testSetStyledDocument javax.swing.JTextPaneTest
error: testGetStyledEditorKit javax.swing.JTextPaneTest
error: testCreateDefaultEditorKit javax.swing.JTextPaneTest
error: testSetEditorKit javax.swing.JTextPaneTest
error: testGetStyle javax.swing.JTextPaneTest
error: testAddStyle javax.swing.JTextPaneTest
error: testRemoveStyle javax.swing.JTextPaneTest
error: testGetLogicalStyle javax.swing.JTextPaneTest
error: testSetLogicalStyle javax.swing.JTextPaneTest
error: testGetParagraphAttributes javax.swing.JTextPaneTest
error: testSetParagraphAttributes javax.swing.JTextPaneTest
error: testGetCharacterAttributes javax.swing.JTextPaneTest
error: testSetCharacterAttributes javax.swing.JTextPaneTest
error: testGetInputAttributes javax.swing.JTextPaneTest
error: testInsertComponent javax.swing.JTextPaneTest
error: testInsertIcon javax.swing.JTextPaneTest
error: testReplaceSelection javax.swing.JTextPaneTest
error: testParamString javax.swing.JTextPaneTest
error: testSetPressed javax.swing.JToggleButtonModelTest
error: testToggleButtonModel javax.swing.JToggleButtonModelTest
error: testDefaultButtonModel javax.swing.JToggleButtonModelTest
error: testGetListeners javax.swing.JToggleButtonModelTest
error: testRemoveChangeListener javax.swing.JToggleButtonModelTest
error: testAddChangeListener javax.swing.JToggleButtonModelTest
error: testGetChangeListeners javax.swing.JToggleButtonModelTest
error: testSetGroup javax.swing.JToggleButtonModelTest
error: testGetGroup javax.swing.JToggleButtonModelTest
error: testSetActionCommand javax.swing.JToggleButtonModelTest
error: testGetActionCommand javax.swing.JToggleButtonModelTest
error: testGetSelectedObjects javax.swing.JToggleButtonModelTest
error: testRemoveItemListener javax.swing.JToggleButtonModelTest
error: testAddItemListener javax.swing.JToggleButtonModelTest
error: testGetItemListeners javax.swing.JToggleButtonModelTest
error: testFireItemStateChanged javax.swing.JToggleButtonModelTest
error: testFireActionPerformed1 javax.swing.JToggleButtonModelTest
error: testFireActionPerformed2 javax.swing.JToggleButtonModelTest
error: testFireStateChanged javax.swing.JToggleButtonModelTest
error: testRemoveActionListener javax.swing.JToggleButtonModelTest
error: testAddActionListener javax.swing.JToggleButtonModelTest
error: testGetActionListeners javax.swing.JToggleButtonModelTest
error: testSetSelected javax.swing.JToggleButtonModelTest
error: testSetRollover javax.swing.JToggleButtonModelTest
error: testSetEnabled1 javax.swing.JToggleButtonModelTest
error: testSetEnabled2 javax.swing.JToggleButtonModelTest
error: testSetArmed javax.swing.JToggleButtonModelTest
error: testSetMnemonic javax.swing.JToggleButtonModelTest
error: testIsSelected javax.swing.JToggleButtonModelTest
error: testIsRollover javax.swing.JToggleButtonModelTest
error: testIsPressed javax.swing.JToggleButtonModelTest
error: testIsEnabled javax.swing.JToggleButtonModelTest
error: testIsArmed javax.swing.JToggleButtonModelTest
error: testGetMnemonic javax.swing.JToggleButtonModelTest
error: testWriteObject javax.swing.JToggleButtonModelTest
error: testReadObject javax.swing.JToggleButtonModelTest
error: testGetAccessibleContext javax.swing.JToggleButtonTest
error: testParamString javax.swing.JToggleButtonTest
error: testGetUIClassID javax.swing.JToggleButtonTest
error: testUpdateUI javax.swing.JToggleButtonTest
error: testJToggleButtonStringIconboolean javax.swing.JToggleButtonTest
error: testJToggleButtonStringIcon javax.swing.JToggleButtonTest
error: testJToggleButtonIconboolean javax.swing.JToggleButtonTest
error: testJToggleButtonIcon javax.swing.JToggleButtonTest
error: testJToggleButtonAction javax.swing.JToggleButtonTest
error: testJToggleButtonStringboolean javax.swing.JToggleButtonTest
error: testJToggleButtonString javax.swing.JToggleButtonTest
error: testJToggleButton javax.swing.JToggleButtonTest
error: testSetAction1 javax.swing.JToggleButtonTest
error: testGetAccessibleContext javax.swing.JToolBarTest
error: testAddImpl javax.swing.JToolBarTest
error: testSetLayout javax.swing.JToolBarTest
error: testGetUIClassID javax.swing.JToolBarTest
error: testPaintBorder javax.swing.JToolBarTest
error: testUpdateUI javax.swing.JToolBarTest
error: testJToolBar javax.swing.JToolBarTest
error: testJToolBarint javax.swing.JToolBarTest
error: testJToolBarString javax.swing.JToolBarTest
error: testJToolBarStringint javax.swing.JToolBarTest
error: testSetGetUI javax.swing.JToolBarTest
error: testGetComponentIndex javax.swing.JToolBarTest
error: testGetComponentAtIndex javax.swing.JToolBarTest
error: testSetGetMargin javax.swing.JToolBarTest
error: testSetIsBorderPainted javax.swing.JToolBarTest
error: testSetIsFloatable javax.swing.JToolBarTest
error: testSetGetOrientation javax.swing.JToolBarTest
error: testSetIsRollover javax.swing.JToolBarTest
error: testAddSeparator javax.swing.JToolBarTest
error: testAddSeparatorDimension javax.swing.JToolBarTest
error: testAddAction javax.swing.JToolBarTest
error: testCreateActionComponent javax.swing.JToolBarTest
error: testCreateActionChangeListener javax.swing.JToolBarTest
error: testFocusable javax.swing.JToolBar_SeparatorRTest
error: testGetMaximumSize javax.swing.JToolBar_SeparatorTest
error: testGetMinimumSize javax.swing.JToolBar_SeparatorTest
error: testGetPreferredSize javax.swing.JToolBar_SeparatorTest
error: testGetUIClassID javax.swing.JToolBar_SeparatorTest
error: testSeparator javax.swing.JToolBar_SeparatorTest
error: testSeparatorDimension javax.swing.JToolBar_SeparatorTest
error: testSetGetSeparatorSize javax.swing.JToolBar_SeparatorTest
error: testGetUIClassID javax.swing.JToolTipTest
error: testGetUI javax.swing.JToolTipTest
error: testSetGetTipText javax.swing.JToolTipTest
error: testSetGetComponent javax.swing.JToolTipTest
error: testTreeSelectionRedirector javax.swing.JTreeTest
error: testJTree javax.swing.JTreeTest
error: testJTreeTreeModel javax.swing.JTreeTest
error: testJTreeTreeNodeBoolean javax.swing.JTreeTest
error: testJTreeTreeNode javax.swing.JTreeTest
error: testJTreeObjectArray javax.swing.JTreeTest
error: testJTreeVector javax.swing.JTreeTest
error: testJTreeHashtable javax.swing.JTreeTest
error: testGetAccessibleContext javax.swing.JTreeTest
error: testGetToolTipTextMouseEvent javax.swing.JTreeTest
error: testGetUIClassID javax.swing.JTreeTest
error: testSetAddRemoveSelectionInterval javax.swing.JTreeTest
error: testAddRemoveSelectionPathPathsRowRows javax.swing.JTreeTest
error: testAddGetRemoveTreeExpansionListener javax.swing.JTreeTest
error: testAddGetRemoveTreeSelectionListener javax.swing.JTreeTest
error: testAddGetRemoveTreeWillExpandListener javax.swing.JTreeTest
error: testClearSelection javax.swing.JTreeTest
error: testClearToggledPaths javax.swing.JTreeTest
error: testConvertValueToText javax.swing.JTreeTest
error: testCreateTreeModel javax.swing.JTreeTest
error: testCreateTreeModelListener javax.swing.JTreeTest
error: testTreeModelHandler javax.swing.JTreeTest
error: testExpandCollapsePathRow javax.swing.JTreeTest
error: testHasBeenExpanded javax.swing.JTreeTest
error: testFireTreeExpandedCollapsedWillExpandCollapse javax.swing.JTreeTest
error: testFireValueChanged javax.swing.JTreeTest
error: testGetSetAnchorSelectionPath javax.swing.JTreeTest
error: testGetClosestPathForLocation javax.swing.JTreeTest
error: testGetClosestRowForLocation javax.swing.JTreeTest
error: testGetDefaultTreeModel javax.swing.JTreeTest
error: testGetDescendantToggledPaths javax.swing.JTreeTest
error: testGetDragEnabled javax.swing.JTreeTest
error: testGetExpandedDescendants javax.swing.JTreeTest
error: testGetSetExpandsSelectedPaths javax.swing.JTreeTest
error: testGetSetInvokesStopCellEditing javax.swing.JTreeTest
error: testGetLastSelectedPathComponent javax.swing.JTreeTest
error: testGetLeadSelectionRow javax.swing.JTreeTest
error: testGetMinMaxSelectionRow javax.swing.JTreeTest
error: testGetNextMatch javax.swing.JTreeTest
error: testGetPathBetweenRows javax.swing.JTreeTest
error: testGetPathBounds javax.swing.JTreeTest
error: testGetRowBounds javax.swing.JTreeTest
error: testGetPathForLocation javax.swing.JTreeTest
error: testGetRowForLocation javax.swing.JTreeTest
error: testGetRowForPath javax.swing.JTreeTest
error: testGetPathForRow javax.swing.JTreeTest
error: testGetRowCount javax.swing.JTreeTest
error: testGetSetRowHeight javax.swing.JTreeTest
error: testGetSetScrollsOnExpand javax.swing.JTreeTest
error: testGetSelectionCount javax.swing.JTreeTest
error: testGetSelectionModel javax.swing.JTreeTest
error: testGetSetSelectionPaths javax.swing.JTreeTest
error: testGetSetShowsRootHandles javax.swing.JTreeTest
error: testGetToggleClickCount javax.swing.JTreeTest
error: testGetUI javax.swing.JTreeTest
error: testIsSetEditable javax.swing.JTreeTest
error: testIsExpanded javax.swing.JTreeTest
error: testIsFixedRowHeight javax.swing.JTreeTest
error: testIsLargeModel javax.swing.JTreeTest
error: testIsPathEditable javax.swing.JTreeTest
error: testSetIsRootVisible javax.swing.JTreeTest
error: testIsPathSelected javax.swing.JTreeTest
error: testIsRowSelected javax.swing.JTreeTest
error: testIsSelectionEmpty javax.swing.JTreeTest
error: testIsVisible javax.swing.JTreeTest
error: testMakeVisible javax.swing.JTreeTest
error: testRemoveDescendantSelectedPaths javax.swing.JTreeTest
error: testRemoveDescendantToggledPaths javax.swing.JTreeTest
error: testSetCellEditor javax.swing.JTreeTest
error: testGetCellEditor javax.swing.JTreeTest
error: testSetCellRenderer javax.swing.JTreeTest
error: testGetCellRenderer javax.swing.JTreeTest
error: testSetExpandedState javax.swing.JTreeTest
error: testGetSetLeadSelectionPath javax.swing.JTreeTest
error: testGetSetModel javax.swing.JTreeTest
error: testSetSelectionModel javax.swing.JTreeTest
error: testGetSetSelectionPath javax.swing.JTreeTest
error: testGetSetSelectionRow javax.swing.JTreeTest
error: testGetSetSelectionRows javax.swing.JTreeTest
error: testSetUITreeUI javax.swing.JTreeTest
error: testGetSetVisibleRowCount javax.swing.JTreeTest
error: testIsEditingStartEditingAtPathGetEditingPath javax.swing.JTreeTest
error: testGetPreferredScrollableViewportSize javax.swing.JTreeTest
error: testGetScrollableBlockIncrement javax.swing.JTreeTest
failure: testGetScrollableUnitIncrement javax.swing.JTreeTest
failure: testGetScrollableTracksViewportHeight javax.swing.JTreeTest
failure: testGetScrollableTracksViewportWidth javax.swing.JTreeTest
failure: testScrollRowPathToVisible javax.swing.JTreeTest
failure: testEmptySelectionModel javax.swing.JTree_EmptySelectionModelTest
failure: testSharedInstance javax.swing.JTree_EmptySelectionModelTest
failure: testSetAddRemoveSelectionPaths javax.swing.JTree_EmptySelectionModelTest
failure: testGetKeyStrokeString javax.swing.KeyStrokeTest
failure: testGetKeyStrokeCharacterint javax.swing.KeyStrokeTest
failure: testGetKeyStrokeForEvent javax.swing.KeyStrokeTest
failure: testGetKeyStrokeintintboolean javax.swing.KeyStrokeTest
failure: testGetKeyStrokeintint javax.swing.KeyStrokeTest
failure: testGetKeyStrokecharboolean javax.swing.KeyStrokeTest
failure: testGetKeyStrokechar javax.swing.KeyStrokeTest
failure: testToString javax.swing.LookAndFeelTest
failure: testMakeComponentInputMap javax.swing.LookAndFeelTest
failure: testMakeIcon javax.swing.LookAndFeelTest
failure: testMakeInputMap javax.swing.LookAndFeelTest
failure: testMakeKeyBindings javax.swing.LookAndFeelTest
failure: testMakeKeyBindingsFromErrorArray javax.swing.LookAndFeelTest
failure: testGetDefaults javax.swing.LookAndFeelTest
failure: testInstallColors javax.swing.LookAndFeelTest
failure: testInstallErrorColors javax.swing.LookAndFeelTest
failure: testInstallColorAndFonts javax.swing.LookAndFeelTest
failure: testInstallUninstallBorder javax.swing.LookAndFeelTest
failure: testLoadKeyBindings javax.swing.LookAndFeelTest
failure: testGetDesktopPropertyValue javax.swing.LookAndFeelTest
failure: testGetSupportsWindowsDecorations javax.swing.LookAndFeelTest
failure: testInstallProperty javax.swing.LookAndFeelTest
failure: testIsComponentPartOfCurrentMenu javax.swing.MenuSelectionManagerRTest
failure: testMenuSelectionManager javax.swing.MenuSelectionManagerTest
failure: testAddGetRemoveChangeListener javax.swing.MenuSelectionManagerTest
failure: testComponentForPoint javax.swing.MenuSelectionManagerTest
failure: testDefaultManager javax.swing.MenuSelectionManagerTest
failure: testFireStateChanged javax.swing.MenuSelectionManagerTest
failure: testIsComponentPartOfCurrentMenu javax.swing.MenuSelectionManagerTest
failure: testProcessKeyEvent javax.swing.MenuSelectionManagerTest
failure: testProcessMouseEvent javax.swing.MenuSelectionManagerTest
failure: testSetGetClearSelectedPath javax.swing.MenuSelectionManagerTest
failure: testSetSelectedPath javax.swing.MenuSelectionManagerTest
failure: testGetPreferredLayoutSize javax.swing.ScrollPaneLayoutTest
failure: testDefaultLayout javax.swing.ScrollPaneLayoutTest
failure: testSetHorizontalPolicy javax.swing.ScrollPaneLayoutTest
failure: testSetVerticalPolicy javax.swing.ScrollPaneLayoutTest
failure: testGetViewport javax.swing.ScrollPaneLayoutTest
failure: testGetHorizontalScrollbar javax.swing.ScrollPaneLayoutTest
failure: testGetVerticalScrollbar javax.swing.ScrollPaneLayoutTest
failure: testGetCorner javax.swing.ScrollPaneLayoutTest
failure: testGetRowHeader javax.swing.ScrollPaneLayoutTest
failure: testGetColumnHeader javax.swing.ScrollPaneLayoutTest
failure: testSyncWithScrollPane javax.swing.ScrollPaneLayoutTest
failure: testGetViewportBorderBounds javax.swing.ScrollPaneLayoutTest
failure: testRemoveLayoutComponent javax.swing.ScrollPaneLayoutTest
failure: testAddSingletonLayoutComponent javax.swing.ScrollPaneLayoutTest
failure: testMinimumLayoutSize javax.swing.ScrollPaneLayoutTest
failure: testSizeRequirementsintintintfloat javax.swing.SizeRequirementsTest
failure: testSizeRequirementsfloat javax.swing.SizeRequirementsTest
failure: testSizeRequirements javax.swing.SizeRequirementsTest
failure: testToString javax.swing.SizeRequirementsTest
failure: testGetTiledSizeRequirements javax.swing.SizeRequirementsTest
failure: testGetAlignedSizeRequirements javax.swing.SizeRequirementsTest
failure: testCalculateTiledPositionsintSizeRequirementsSizeRequirementsArrayintArrayintArrayboolean javax.swing.SizeRequirementsTest
failure: testCalculateTiledPositionsintSizeRequirementsSizeRequirementsArrayintArrayintArray javax.swing.SizeRequirementsTest
failure: testCalculateAlignedPositionsintSizeRequirementsSizeRequirementsArrayintArrayintArrayboolean javax.swing.SizeRequirementsTest
failure: testCalculateAlignedPositionsintSizeRequirementsSizeRequirementsArrayintArrayintArray javax.swing.SizeRequirementsTest
failure: testAdjustSizes javax.swing.SizeRequirementsTest
failure: testWriteObject javax.swing.SizeRequirementsTest
failure: testReadObject javax.swing.SizeRequirementsTest
failure: testSizeSequence javax.swing.SizeSequenceTest
failure: testGetIndex javax.swing.SizeSequenceTest
failure: testGetPosition javax.swing.SizeSequenceTest
failure: testGetSetSize javax.swing.SizeSequenceTest
failure: testGetSetSizes javax.swing.SizeSequenceTest
failure: testInsertRemoveEntries javax.swing.SizeSequenceTest
failure: testGetLocalName org.apache.harmony.logging.tests.java.util.logging.LevelTest
failure: test_isCompatibleWithLjava_lang_String org.apache.harmony.luni.tests.java.lang.PackageTest
Unit Test Error Details:	(323)
                
Test: testListEditor_ListEditorClass: javax.swing.JSpinnerTestjava.lang.OutOfMemoryError: Failed to create new thread
	at java.lang.Thread.start(Unknown Source)
	at org.apache.harmony.awt.wtk.ShutdownThread.start(ShutdownThread.java:58)
	at org.apache.harmony.awt.wtk.ShutdownWatchdog.keepAlive(ShutdownWatchdog.java:76)
	at org.apache.harmony.awt.wtk.ShutdownWatchdog.checkShutdown(ShutdownWatchdog.java:64)
	at org.apache.harmony.awt.wtk.ShutdownWatchdog.setAwtQueueEmpty(ShutdownWatchdog.java)
	at java.awt.EventQueueCore.postEvent(EventQueueCore.java:90)
	at java.awt.EventQueue.postEvent(EventQueue.java:116)
	at java.awt.Component.postEvent(Component.java)
	at java.awt.Component.finishHierarchyChange(Component.java)
	at java.awt.Container.addToContainer(Container.java:363)
	at java.awt.Container.addImpl(Container.java:420)
	at java.awt.Container.add(Container.java:252)
	at javax.swing.plaf.basic.BasicSpinnerUI.installUI(BasicSpinnerUI.java:229)
	at javax.swing.JComponent.setUI(JComponent.java:1284)
	at javax.swing.JSpinner.setUI(JSpinner.java)
	at javax.swing.JSpinner.updateUI(JSpinner.java:608)
	at javax.swing.JSpinner.<init>(JSpinner.java:585)
	at javax.swing.JSpinner.<init>(JSpinner.java:590)
	at javax.swing.JSpinnerTest.setUp(JSpinnerTest.java:51)
	at javax.swing.BasicSwingTestCase.runBareSuper(BasicSwingTestCase.java)
	at javax.swing.BasicSwingTestCase.runBareImpl(BasicSwingTestCase.java)
	at javax.swing.BasicSwingTestCase$1.run(BasicSwingTestCase.java)
	at java.lang.Thread.run(Unknown Source)

Test: testListEditor_formatterClass: javax.swing.JSpinnerTestjava.lang.OutOfMemoryError: Failed to create new thread
	at java.lang.Thread.start(Unknown Source)
	at javax.swing.BasicSwingTestCase.runBare(BasicSwingTestCase.java:133)

Test: testAddNullClass: javax.swing.JTabbedPaneRTestjava.lang.OutOfMemoryError: Failed to create new thread
	at java.lang.Thread.start(Unknown Source)
	at javax.swing.BasicSwingTestCase.runBare(BasicSwingTestCase.java:133)

Test: testRemoveAllClass: javax.swing.JTabbedPaneTestjava.lang.OutOfMemoryError: Failed to create new thread
	at java.lang.Thread.start(Unknown Source)
	at javax.swing.BasicSwingTestCase.runBare(BasicSwingTestCase.java:133)

Test: testUpdateUIClass: javax.swing.JTabbedPaneTestjava.lang.OutOfMemoryError: Failed to create new thread
	at java.lang.Thread.start(Unknown Source)
	at javax.swing.BasicSwingTestCase.runBare(BasicSwingTestCase.java:133)

Test: testGetTabCountClass: javax.swing.JTabbedPaneTestjava.lang.OutOfMemoryError: Failed to create new thread
	at java.lang.Thread.start(Unknown Source)
	at javax.swing.BasicSwingTestCase.runBare(BasicSwingTestCase.java:133)

Test: testGetTabRunCountClass: javax.swing.JTabbedPaneTestjava.lang.OutOfMemoryError: Failed to create new thread
	at java.lang.Thread.start(Unknown Source)
	at javax.swing.BasicSwingTestCase.runBare(BasicSwingTestCase.java:133)

Test: testFireStateChangedClass: javax.swing.JTabbedPaneTestjava.lang.OutOfMemoryError: Failed to create new thread
	at java.lang.Thread.start(Unknown Source)
	at javax.swing.BasicSwingTestCase.runBare(BasicSwingTestCase.java:133)

Test: testJTabbedPaneClass: javax.swing.JTabbedPaneTestjava.lang.OutOfMemoryError: Failed to create new thread
	at java.lang.Thread.start(Unknown Source)
	at javax.swing.BasicSwingTestCase.runBare(BasicSwingTestCase.java:133)

Test: testJTabbedPaneintClass: javax.swing.JTabbedPaneTestjava.lang.OutOfMemoryError: Failed to create new thread
	at java.lang.Thread.start(Unknown Source)
	at javax.swing.BasicSwingTestCase.runBare(BasicSwingTestCase.java:133)

Test: testJTabbedPaneintintClass: javax.swing.JTabbedPaneTestjava.lang.OutOfMemoryError: Failed to create new thread
	at java.lang.Thread.start(Unknown Source)
	at javax.swing.BasicSwingTestCase.runBare(BasicSwingTestCase.java:133)

Test: testRemoveTabAtClass: javax.swing.JTabbedPaneTestjava.lang.OutOfMemoryError: Failed to create new thread
	at java.lang.Thread.start(Unknown Source)
	at javax.swing.BasicSwingTestCase.runBare(BasicSwingTestCase.java:133)

Test: testRemoveComponentClass: javax.swing.JTabbedPaneTestjava.lang.OutOfMemoryError: Failed to create new thread
	at java.lang.Thread.start(Unknown Source)
	at javax.swing.BasicSwingTestCase.runBare(BasicSwingTestCase.java:133)

Test: testRemoveintClass: javax.swing.JTabbedPaneTestjava.lang.OutOfMemoryError: Failed to create new thread
	at java.lang.Thread.start(Unknown Source)
	at javax.swing.BasicSwingTestCase.runBare(BasicSwingTestCase.java:133)

Test: testSetGetSelectedIndexClass: javax.swing.JTabbedPaneTestjava.lang.OutOfMemoryError: Failed to create new thread
	at java.lang.Thread.start(Unknown Source)
	at javax.swing.BasicSwingTestCase.runBare(BasicSwingTestCase.java:133)

Test: testSetGetTabLayoutPolicyClass: javax.swing.JTabbedPaneTestjava.lang.OutOfMemoryError: Failed to create new thread
	at java.lang.Thread.start(Unknown Source)
	at javax.swing.BasicSwingTestCase.runBare(BasicSwingTestCase.java:133)

Test: testSetGetTabPlacementClass: javax.swing.JTabbedPaneTestjava.lang.OutOfMemoryError: Failed to create new thread
	at java.lang.Thread.start(Unknown Source)
	at javax.swing.BasicSwingTestCase.runBare(BasicSwingTestCase.java:133)

Test: testIndexAtLocationClass: javax.swing.JTabbedPaneTestjava.lang.OutOfMemoryError: Failed to create new thread
	at java.lang.Thread.start(Unknown Source)
	at javax.swing.BasicSwingTestCase.runBare(BasicSwingTestCase.java:133)

Test: testSetGetDisplayedMnemonicIndexAtClass: javax.swing.JTabbedPaneTestjava.lang.OutOfMemoryError: Failed to create new thread
	at java.lang.Thread.start(Unknown Source)
	at javax.swing.BasicSwingTestCase.runBare(BasicSwingTestCase.java:133)

Test: testSetGetMnemonicAtClass: javax.swing.JTabbedPaneTestjava.lang.OutOfMemoryError: Failed to create new thread
	at java.lang.Thread.start(Unknown Source)
	at javax.swing.BasicSwingTestCase.runBare(BasicSwingTestCase.java:133)

Test: testSetIsEnabledAtClass: javax.swing.JTabbedPaneTestjava.lang.OutOfMemoryError: Failed to create new thread
	at java.lang.Thread.start(Unknown Source)
	at javax.swing.BasicSwingTestCase.runBare(BasicSwingTestCase.java:133)

Test: testAddComponentClass: javax.swing.JTabbedPaneTestjava.lang.OutOfMemoryError: Failed to create new thread
	at java.lang.Thread.start(Unknown Source)
	at javax.swing.BasicSwingTestCase.runBare(BasicSwingTestCase.java:133)

Test: testAddComponentintClass: javax.swing.JTabbedPaneTestjava.lang.OutOfMemoryError: Failed to create new thread
	at java.lang.Thread.start(Unknown Source)
	at javax.swing.BasicSwingTestCase.runBare(BasicSwingTestCase.java:133)

Test: testAddComponentObjectClass: javax.swing.JTabbedPaneTestjava.lang.OutOfMemoryError: Failed to create new thread
	at java.lang.Thread.start(Unknown Source)
	at javax.swing.BasicSwingTestCase.runBare(BasicSwingTestCase.java:133)

Test: testAddComponentObjectintClass: javax.swing.JTabbedPaneTestjava.lang.OutOfMemoryError: Failed to create new thread
	at java.lang.Thread.start(Unknown Source)
	at javax.swing.BasicSwingTestCase.runBare(BasicSwingTestCase.java:133)

Test: testAddStringComponentClass: javax.swing.JTabbedPaneTestjava.lang.OutOfMemoryError: Failed to create new thread
	at java.lang.Thread.start(Unknown Source)
	at javax.swing.BasicSwingTestCase.runBare(BasicSwingTestCase.java:133)

Test: testAddRemoveChangeListenerClass: javax.swing.JTabbedPaneTestjava.lang.OutOfMemoryError: Failed to create new thread
	at java.lang.Thread.start(Unknown Source)
	at javax.swing.BasicSwingTestCase.runBare(BasicSwingTestCase.java:133)

Test: testAddTabStringComponentClass: javax.swing.JTabbedPaneTestjava.lang.OutOfMemoryError: Failed to create new thread
	at java.lang.Thread.start(Unknown Source)
	at javax.swing.BasicSwingTestCase.runBare(BasicSwingTestCase.java:133)

Test: testAddTabStringIconComponentClass: javax.swing.JTabbedPaneTestjava.lang.OutOfMemoryError: Failed to create new thread
	at java.lang.Thread.start(Unknown Source)
	at javax.swing.BasicSwingTestCase.runBare(BasicSwingTestCase.java:133)

Test: testAddTabStringIconComponentStringClass: javax.swing.JTabbedPaneTestjava.lang.OutOfMemoryError: Failed to create new thread
	at java.lang.Thread.start(Unknown Source)
	at javax.swing.BasicSwingTestCase.runBare(BasicSwingTestCase.java:133)

Test: testCreateChangeListenerClass: javax.swing.JTabbedPaneTestjava.lang.OutOfMemoryError: Failed to create new thread
	at java.lang.Thread.start(Unknown Source)
	at javax.swing.BasicSwingTestCase.runBare(BasicSwingTestCase.java:133)

Test: testGetAccessibleContextClass: javax.swing.JTabbedPaneTestjava.lang.OutOfMemoryError: Failed to create new thread
	at java.lang.Thread.start(Unknown Source)
	at javax.swing.BasicSwingTestCase.runBare(BasicSwingTestCase.java:133)

Test: testGetBoundsAtClass: javax.swing.JTabbedPaneTestjava.lang.OutOfMemoryError: Failed to create new thread
	at java.lang.Thread.start(Unknown Source)
	at javax.swing.BasicSwingTestCase.runBare(BasicSwingTestCase.java:133)

Test: testGetChangeListenersClass: javax.swing.JTabbedPaneTestjava.lang.OutOfMemoryError: Failed to create new thread
	at java.lang.Thread.start(Unknown Source)
	at javax.swing.BasicSwingTestCase.runBare(BasicSwingTestCase.java:133)

Test: testSetTitleAtClass: javax.swing.JTabbedPaneTestjava.lang.OutOfMemoryError: Failed to create new thread
	at java.lang.Thread.start(Unknown Source)
	at javax.swing.BasicSwingTestCase.runBare(BasicSwingTestCase.java:133)

Test: testGetTitleAtClass: javax.swing.JTabbedPaneTestjava.lang.OutOfMemoryError: Failed to create new thread
	at java.lang.Thread.start(Unknown Source)
	at javax.swing.BasicSwingTestCase.runBare(BasicSwingTestCase.java:133)

Test: testGetToolTipTextMouseEventClass: javax.swing.JTabbedPaneTestjava.lang.OutOfMemoryError: Failed to create new thread
	at java.lang.Thread.start(Unknown Source)
	at javax.swing.BasicSwingTestCase.runBare(BasicSwingTestCase.java:133)

Test: testGetUIClassIDClass: javax.swing.JTabbedPaneTestjava.lang.OutOfMemoryError: Failed to create new thread
	at java.lang.Thread.start(Unknown Source)
	at javax.swing.BasicSwingTestCase.runBare(BasicSwingTestCase.java:133)

Test: testIndexOfComponentClass: javax.swing.JTabbedPaneTestjava.lang.OutOfMemoryError: Failed to create new thread
	at java.lang.Thread.start(Unknown Source)
	at javax.swing.BasicSwingTestCase.runBare(BasicSwingTestCase.java:133)

Test: testIndexOfTabIconClass: javax.swing.JTabbedPaneTestjava.lang.OutOfMemoryError: Failed to create new thread
	at java.lang.Thread.start(Unknown Source)
	at javax.swing.BasicSwingTestCase.runBare(BasicSwingTestCase.java:133)

Test: testIndexOfTabStringClass: javax.swing.JTabbedPaneTestjava.lang.OutOfMemoryError: Failed to create new thread
	at java.lang.Thread.start(Unknown Source)
	at javax.swing.BasicSwingTestCase.runBare(BasicSwingTestCase.java:133)

Test: testInsertTabClass: javax.swing.JTabbedPaneTestjava.lang.OutOfMemoryError: Failed to create new thread
	at java.lang.Thread.start(Unknown Source)
	at javax.swing.BasicSwingTestCase.runBare(BasicSwingTestCase.java:133)

Test: testParamStringClass: javax.swing.JTabbedPaneTestjava.lang.OutOfMemoryError: Failed to create new thread
	at java.lang.Thread.start(Unknown Source)
	at javax.swing.BasicSwingTestCase.runBare(BasicSwingTestCase.java:133)

Test: testSetBackgroundAtClass: javax.swing.JTabbedPaneTestjava.lang.OutOfMemoryError: Failed to create new thread
	at java.lang.Thread.start(Unknown Source)
	at javax.swing.BasicSwingTestCase.runBare(BasicSwingTestCase.java:133)

Test: testGetBackgroundAtClass: javax.swing.JTabbedPaneTestjava.lang.OutOfMemoryError: Failed to create new thread
	at java.lang.Thread.start(Unknown Source)
	at javax.swing.BasicSwingTestCase.runBare(BasicSwingTestCase.java:133)

Test: testSetForegroundAtClass: javax.swing.JTabbedPaneTestjava.lang.OutOfMemoryError: Failed to create new thread
	at java.lang.Thread.start(Unknown Source)
	at javax.swing.BasicSwingTestCase.runBare(BasicSwingTestCase.java:133)

Test: testGetForegroundAtClass: javax.swing.JTabbedPaneTestjava.lang.OutOfMemoryError: Failed to create new thread
	at java.lang.Thread.start(Unknown Source)
	at javax.swing.BasicSwingTestCase.runBare(BasicSwingTestCase.java:133)

Test: testSetGetComponentAtClass: javax.swing.JTabbedPaneTestjava.lang.OutOfMemoryError: Failed to create new thread
	at java.lang.Thread.start(Unknown Source)
	at javax.swing.BasicSwingTestCase.runBare(BasicSwingTestCase.java:133)

Test: testSetGetDisabledIconAtClass: javax.swing.JTabbedPaneTestjava.lang.OutOfMemoryError: Failed to create new thread
	at java.lang.Thread.start(Unknown Source)
	at javax.swing.BasicSwingTestCase.runBare(BasicSwingTestCase.java:133)

Test: testSetGetIconAtClass: javax.swing.JTabbedPaneTestjava.lang.OutOfMemoryError: Failed to create new thread
	at java.lang.Thread.start(Unknown Source)
	at javax.swing.BasicSwingTestCase.runBare(BasicSwingTestCase.java:133)

Test: testSetGetModelClass: javax.swing.JTabbedPaneTestjava.lang.OutOfMemoryError: Failed to create new thread
	at java.lang.Thread.start(Unknown Source)
	at javax.swing.BasicSwingTestCase.runBare(BasicSwingTestCase.java:133)

Test: testSetGetSelectedComponentComponentClass: javax.swing.JTabbedPaneTestjava.lang.OutOfMemoryError: Failed to create new thread
	at java.lang.Thread.start(Unknown Source)
	at javax.swing.BasicSwingTestCase.runBare(BasicSwingTestCase.java:133)

Test: testSetGetToolTipTextAtClass: javax.swing.JTabbedPaneTestjava.lang.OutOfMemoryError: Failed to create new thread
	at java.lang.Thread.start(Unknown Source)
	at javax.swing.BasicSwingTestCase.runBare(BasicSwingTestCase.java:133)

Test: testSetGetUIClass: javax.swing.JTabbedPaneTestjava.lang.OutOfMemoryError: Failed to create new thread
	at java.lang.Thread.start(Unknown Source)
	at javax.swing.BasicSwingTestCase.runBare(BasicSwingTestCase.java:133)

Test: testSelectAllClearSelectionClass: javax.swing.JTableRTestjava.lang.OutOfMemoryError: Failed to create new thread
	at java.lang.Thread.start(Unknown Source)
	at javax.swing.BasicSwingTestCase.runBare(BasicSwingTestCase.java:133)

Test: testReplaceSelection_AtTheBeginningOfParagraphClass: javax.swing.JTextPaneRTestjava.lang.OutOfMemoryError: Failed to create new thread
	at java.lang.Thread.start(Unknown Source)
	at javax.swing.BasicSwingTestCase.runBare(BasicSwingTestCase.java:133)

Test: testReplaceSelection_WithSelectionClass: javax.swing.JTextPaneRTestjava.lang.OutOfMemoryError: Failed to create new thread
	at java.lang.Thread.start(Unknown Source)
	at javax.swing.BasicSwingTestCase.runBare(BasicSwingTestCase.java:133)

Test: testReplaceSelection_WithNoSelectionClass: javax.swing.JTextPaneRTestjava.lang.OutOfMemoryError: Failed to create new thread
	at java.lang.Thread.start(Unknown Source)
	at javax.swing.BasicSwingTestCase.runBare(BasicSwingTestCase.java:133)

Test: testJTextPaneClass: javax.swing.JTextPaneTestjava.lang.OutOfMemoryError: Failed to create new thread
	at java.lang.Thread.start(Unknown Source)
	at javax.swing.BasicSwingTestCase.runBare(BasicSwingTestCase.java:133)

Test: testGetUIClassIDClass: javax.swing.JTextPaneTestjava.lang.OutOfMemoryError: Failed to create new thread
	at java.lang.Thread.start(Unknown Source)
	at javax.swing.BasicSwingTestCase.runBare(BasicSwingTestCase.java:133)

Test: testSetDocumentClass: javax.swing.JTextPaneTestjava.lang.OutOfMemoryError: Failed to create new thread
	at java.lang.Thread.start(Unknown Source)
	at javax.swing.BasicSwingTestCase.runBare(BasicSwingTestCase.java:133)

Test: testSetStyledDocumentClass: javax.swing.JTextPaneTestjava.lang.OutOfMemoryError: Failed to create new thread
	at java.lang.Thread.start(Unknown Source)
	at javax.swing.BasicSwingTestCase.runBare(BasicSwingTestCase.java:133)

Test: testGetStyledEditorKitClass: javax.swing.JTextPaneTestjava.lang.OutOfMemoryError: Failed to create new thread
	at java.lang.Thread.start(Unknown Source)
	at javax.swing.BasicSwingTestCase.runBare(BasicSwingTestCase.java:133)

Test: testCreateDefaultEditorKitClass: javax.swing.JTextPaneTestjava.lang.OutOfMemoryError: Failed to create new thread
	at java.lang.Thread.start(Unknown Source)
	at javax.swing.BasicSwingTestCase.runBare(BasicSwingTestCase.java:133)

Test: testSetEditorKitClass: javax.swing.JTextPaneTestjava.lang.OutOfMemoryError: Failed to create new thread
	at java.lang.Thread.start(Unknown Source)
	at javax.swing.BasicSwingTestCase.runBare(BasicSwingTestCase.java:133)

Test: testGetStyleClass: javax.swing.JTextPaneTestjava.lang.OutOfMemoryError: Failed to create new thread
	at java.lang.Thread.start(Unknown Source)
	at javax.swing.BasicSwingTestCase.runBare(BasicSwingTestCase.java:133)

Test: testAddStyleClass: javax.swing.JTextPaneTestjava.lang.OutOfMemoryError: Failed to create new thread
	at java.lang.Thread.start(Unknown Source)
	at javax.swing.BasicSwingTestCase.runBare(BasicSwingTestCase.java:133)

Test: testRemoveStyleClass: javax.swing.JTextPaneTestjava.lang.OutOfMemoryError: Failed to create new thread
	at java.lang.Thread.start(Unknown Source)
	at javax.swing.BasicSwingTestCase.runBare(BasicSwingTestCase.java:133)

Test: testGetLogicalStyleClass: javax.swing.JTextPaneTestjava.lang.OutOfMemoryError: Failed to create new thread
	at java.lang.Thread.start(Unknown Source)
	at javax.swing.BasicSwingTestCase.runBare(BasicSwingTestCase.java:133)

Test: testSetLogicalStyleClass: javax.swing.JTextPaneTestjava.lang.OutOfMemoryError: Failed to create new thread
	at java.lang.Thread.start(Unknown Source)
	at javax.swing.BasicSwingTestCase.runBare(BasicSwingTestCase.java:133)

Test: testGetParagraphAttributesClass: javax.swing.JTextPaneTestjava.lang.OutOfMemoryError: Failed to create new thread
	at java.lang.Thread.start(Unknown Source)
	at javax.swing.BasicSwingTestCase.runBare(BasicSwingTestCase.java:133)

Test: testSetParagraphAttributesClass: javax.swing.JTextPaneTestjava.lang.OutOfMemoryError: Failed to create new thread
	at java.lang.Thread.start(Unknown Source)
	at javax.swing.BasicSwingTestCase.runBare(BasicSwingTestCase.java:133)

Test: testGetCharacterAttributesClass: javax.swing.JTextPaneTestjava.lang.OutOfMemoryError: Failed to create new thread
	at java.lang.Thread.start(Unknown Source)
	at javax.swing.BasicSwingTestCase.runBare(BasicSwingTestCase.java:133)

Test: testSetCharacterAttributesClass: javax.swing.JTextPaneTestjava.lang.OutOfMemoryError: Failed to create new thread
	at java.lang.Thread.start(Unknown Source)
	at javax.swing.BasicSwingTestCase.runBare(BasicSwingTestCase.java:133)

Test: testGetInputAttributesClass: javax.swing.JTextPaneTestjava.lang.OutOfMemoryError: Failed to create new thread
	at java.lang.Thread.start(Unknown Source)
	at javax.swing.BasicSwingTestCase.runBare(BasicSwingTestCase.java:133)

Test: testInsertComponentClass: javax.swing.JTextPaneTestjava.lang.OutOfMemoryError: Failed to create new thread
	at java.lang.Thread.start(Unknown Source)
	at javax.swing.BasicSwingTestCase.runBare(BasicSwingTestCase.java:133)

Test: testInsertIconClass: javax.swing.JTextPaneTestjava.lang.OutOfMemoryError: Failed to create new thread
	at java.lang.Thread.start(Unknown Source)
	at javax.swing.BasicSwingTestCase.runBare(BasicSwingTestCase.java:133)

Test: testReplaceSelectionClass: javax.swing.JTextPaneTestjava.lang.OutOfMemoryError: Failed to create new thread
	at java.lang.Thread.start(Unknown Source)
	at javax.swing.BasicSwingTestCase.runBare(BasicSwingTestCase.java:133)

Test: testParamStringClass: javax.swing.JTextPaneTestjava.lang.OutOfMemoryError: Failed to create new thread
	at java.lang.Thread.start(Unknown Source)
	at javax.swing.BasicSwingTestCase.runBare(BasicSwingTestCase.java:133)

Test: testSetPressedClass: javax.swing.JToggleButtonModelTestjava.lang.OutOfMemoryError: Failed to create new thread
	at java.lang.Thread.start(Unknown Source)
	at javax.swing.BasicSwingTestCase.runBare(BasicSwingTestCase.java:133)

Test: testToggleButtonModelClass: javax.swing.JToggleButtonModelTestjava.lang.OutOfMemoryError: Failed to create new thread
	at java.lang.Thread.start(Unknown Source)
	at javax.swing.BasicSwingTestCase.runBare(BasicSwingTestCase.java:133)

Test: testDefaultButtonModelClass: javax.swing.JToggleButtonModelTestjava.lang.OutOfMemoryError: Failed to create new thread
	at java.lang.Thread.start(Unknown Source)
	at javax.swing.BasicSwingTestCase.runBare(BasicSwingTestCase.java:133)

Test: testGetListenersClass: javax.swing.JToggleButtonModelTestjava.lang.OutOfMemoryError: Failed to create new thread
	at java.lang.Thread.start(Unknown Source)
	at javax.swing.BasicSwingTestCase.runBare(BasicSwingTestCase.java:133)

Test: testRemoveChangeListenerClass: javax.swing.JToggleButtonModelTestjava.lang.OutOfMemoryError: Failed to create new thread
	at java.lang.Thread.start(Unknown Source)
	at javax.swing.BasicSwingTestCase.runBare(BasicSwingTestCase.java:133)

Test: testAddChangeListenerClass: javax.swing.JToggleButtonModelTestjava.lang.OutOfMemoryError: Failed to create new thread
	at java.lang.Thread.start(Unknown Source)
	at javax.swing.BasicSwingTestCase.runBare(BasicSwingTestCase.java:133)

Test: testGetChangeListenersClass: javax.swing.JToggleButtonModelTestjava.lang.OutOfMemoryError: Failed to create new thread
	at java.lang.Thread.start(Unknown Source)
	at javax.swing.BasicSwingTestCase.runBare(BasicSwingTestCase.java:133)

Test: testSetGroupClass: javax.swing.JToggleButtonModelTestjava.lang.OutOfMemoryError: Failed to create new thread
	at java.lang.Thread.start(Unknown Source)
	at javax.swing.BasicSwingTestCase.runBare(BasicSwingTestCase.java:133)

Test: testGetGroupClass: javax.swing.JToggleButtonModelTestjava.lang.OutOfMemoryError: Failed to create new thread
	at java.lang.Thread.start(Unknown Source)
	at javax.swing.BasicSwingTestCase.runBare(BasicSwingTestCase.java:133)

Test: testSetActionCommandClass: javax.swing.JToggleButtonModelTestjava.lang.OutOfMemoryError: Failed to create new thread
	at java.lang.Thread.start(Unknown Source)
	at javax.swing.BasicSwingTestCase.runBare(BasicSwingTestCase.java:133)

Test: testGetActionCommandClass: javax.swing.JToggleButtonModelTestjava.lang.OutOfMemoryError: Failed to create new thread
	at java.lang.Thread.start(Unknown Source)
	at javax.swing.BasicSwingTestCase.runBare(BasicSwingTestCase.java:133)

Test: testGetSelectedObjectsClass: javax.swing.JToggleButtonModelTestjava.lang.OutOfMemoryError: Failed to create new thread
	at java.lang.Thread.start(Unknown Source)
	at javax.swing.BasicSwingTestCase.runBare(BasicSwingTestCase.java:133)

Test: testRemoveItemListenerClass: javax.swing.JToggleButtonModelTestjava.lang.OutOfMemoryError: Failed to create new thread
	at java.lang.Thread.start(Unknown Source)
	at javax.swing.BasicSwingTestCase.runBare(BasicSwingTestCase.java:133)

Test: testAddItemListenerClass: javax.swing.JToggleButtonModelTestjava.lang.OutOfMemoryError: Failed to create new thread
	at java.lang.Thread.start(Unknown Source)
	at javax.swing.BasicSwingTestCase.runBare(BasicSwingTestCase.java:133)

Test: testGetItemListenersClass: javax.swing.JToggleButtonModelTestjava.lang.OutOfMemoryError: Failed to create new thread
	at java.lang.Thread.start(Unknown Source)
	at javax.swing.BasicSwingTestCase.runBare(BasicSwingTestCase.java:133)

Test: testFireItemStateChangedClass: javax.swing.JToggleButtonModelTestjava.lang.OutOfMemoryError: Failed to create new thread
	at java.lang.Thread.start(Unknown Source)
	at javax.swing.BasicSwingTestCase.runBare(BasicSwingTestCase.java:133)

Test: testFireActionPerformed1Class: javax.swing.JToggleButtonModelTestjava.lang.OutOfMemoryError: Failed to create new thread
	at java.lang.Thread.start(Unknown Source)
	at javax.swing.BasicSwingTestCase.runBare(BasicSwingTestCase.java:133)

Test: testFireActionPerformed2Class: javax.swing.JToggleButtonModelTestjava.lang.OutOfMemoryError: Failed to create new thread
	at java.lang.Thread.start(Unknown Source)
	at javax.swing.BasicSwingTestCase.runBare(BasicSwingTestCase.java:133)

Test: testFireStateChangedClass: javax.swing.JToggleButtonModelTestjava.lang.OutOfMemoryError: Failed to create new thread
	at java.lang.Thread.start(Unknown Source)
	at javax.swing.BasicSwingTestCase.runBare(BasicSwingTestCase.java:133)

Test: testRemoveActionListenerClass: javax.swing.JToggleButtonModelTestjava.lang.OutOfMemoryError: Failed to create new thread
	at java.lang.Thread.start(Unknown Source)
	at javax.swing.BasicSwingTestCase.runBare(BasicSwingTestCase.java:133)

Test: testAddActionListenerClass: javax.swing.JToggleButtonModelTestjava.lang.OutOfMemoryError: Failed to create new thread
	at java.lang.Thread.start(Unknown Source)
	at javax.swing.BasicSwingTestCase.runBare(BasicSwingTestCase.java:133)

Test: testGetActionListenersClass: javax.swing.JToggleButtonModelTestjava.lang.OutOfMemoryError: Failed to create new thread
	at java.lang.Thread.start(Unknown Source)
	at javax.swing.BasicSwingTestCase.runBare(BasicSwingTestCase.java:133)

Test: testSetSelectedClass: javax.swing.JToggleButtonModelTestjava.lang.OutOfMemoryError: Failed to create new thread
	at java.lang.Thread.start(Unknown Source)
	at javax.swing.BasicSwingTestCase.runBare(BasicSwingTestCase.java:133)

Test: testSetRolloverClass: javax.swing.JToggleButtonModelTestjava.lang.OutOfMemoryError: Failed to create new thread
	at java.lang.Thread.start(Unknown Source)
	at javax.swing.BasicSwingTestCase.runBare(BasicSwingTestCase.java:133)

Test: testSetEnabled1Class: javax.swing.JToggleButtonModelTestjava.lang.OutOfMemoryError: Failed to create new thread
	at java.lang.Thread.start(Unknown Source)
	at javax.swing.BasicSwingTestCase.runBare(BasicSwingTestCase.java:133)

Test: testSetEnabled2Class: javax.swing.JToggleButtonModelTestjava.lang.OutOfMemoryError: Failed to create new thread
	at java.lang.Thread.start(Unknown Source)
	at javax.swing.BasicSwingTestCase.runBare(BasicSwingTestCase.java:133)

Test: testSetArmedClass: javax.swing.JToggleButtonModelTestjava.lang.OutOfMemoryError: Failed to create new thread
	at java.lang.Thread.start(Unknown Source)
	at javax.swing.BasicSwingTestCase.runBare(BasicSwingTestCase.java:133)

Test: testSetMnemonicClass: javax.swing.JToggleButtonModelTestjava.lang.OutOfMemoryError: Failed to create new thread
	at java.lang.Thread.start(Unknown Source)
	at javax.swing.BasicSwingTestCase.runBare(BasicSwingTestCase.java:133)

Test: testIsSelectedClass: javax.swing.JToggleButtonModelTestjava.lang.OutOfMemoryError: Failed to create new thread
	at java.lang.Thread.start(Unknown Source)
	at javax.swing.BasicSwingTestCase.runBare(BasicSwingTestCase.java:133)

Test: testIsRolloverClass: javax.swing.JToggleButtonModelTestjava.lang.OutOfMemoryError: Failed to create new thread
	at java.lang.Thread.start(Unknown Source)
	at javax.swing.BasicSwingTestCase.runBare(BasicSwingTestCase.java:133)

Test: testIsPressedClass: javax.swing.JToggleButtonModelTestjava.lang.OutOfMemoryError: Failed to create new thread
	at java.lang.Thread.start(Unknown Source)
	at javax.swing.BasicSwingTestCase.runBare(BasicSwingTestCase.java:133)

Test: testIsEnabledClass: javax.swing.JToggleButtonModelTestjava.lang.OutOfMemoryError: Failed to create new thread
	at java.lang.Thread.start(Unknown Source)
	at javax.swing.BasicSwingTestCase.runBare(BasicSwingTestCase.java:133)

Test: testIsArmedClass: javax.swing.JToggleButtonModelTestjava.lang.OutOfMemoryError: Failed to create new thread
	at java.lang.Thread.start(Unknown Source)
	at javax.swing.BasicSwingTestCase.runBare(BasicSwingTestCase.java:133)

Test: testGetMnemonicClass: javax.swing.JToggleButtonModelTestjava.lang.OutOfMemoryError: Failed to create new thread
	at java.lang.Thread.start(Unknown Source)
	at javax.swing.BasicSwingTestCase.runBare(BasicSwingTestCase.java:133)

Test: testWriteObjectClass: javax.swing.JToggleButtonModelTestjava.lang.OutOfMemoryError: Failed to create new thread
	at java.lang.Thread.start(Unknown Source)
	at javax.swing.BasicSwingTestCase.runBare(BasicSwingTestCase.java:133)

Test: testReadObjectClass: javax.swing.JToggleButtonModelTestjava.lang.OutOfMemoryError: Failed to create new thread
	at java.lang.Thread.start(Unknown Source)
	at javax.swing.BasicSwingTestCase.runBare(BasicSwingTestCase.java:133)

Test: testGetAccessibleContextClass: javax.swing.JToggleButtonTestjava.lang.OutOfMemoryError: Failed to create new thread
	at java.lang.Thread.start(Unknown Source)
	at javax.swing.BasicSwingTestCase.runBare(BasicSwingTestCase.java:133)

Test: testParamStringClass: javax.swing.JToggleButtonTestjava.lang.OutOfMemoryError: Failed to create new thread
	at java.lang.Thread.start(Unknown Source)
	at javax.swing.BasicSwingTestCase.runBare(BasicSwingTestCase.java:133)

Test: testGetUIClassIDClass: javax.swing.JToggleButtonTestjava.lang.OutOfMemoryError: Failed to create new thread
	at java.lang.Thread.start(Unknown Source)
	at javax.swing.BasicSwingTestCase.runBare(BasicSwingTestCase.java:133)

Test: testUpdateUIClass: javax.swing.JToggleButtonTestjava.lang.OutOfMemoryError: Failed to create new thread
	at java.lang.Thread.start(Unknown Source)
	at javax.swing.BasicSwingTestCase.runBare(BasicSwingTestCase.java:133)

Test: testJToggleButtonStringIconbooleanClass: javax.swing.JToggleButtonTestjava.lang.OutOfMemoryError: Failed to create new thread
	at java.lang.Thread.start(Unknown Source)
	at javax.swing.BasicSwingTestCase.runBare(BasicSwingTestCase.java:133)

Test: testJToggleButtonStringIconClass: javax.swing.JToggleButtonTestjava.lang.OutOfMemoryError: Failed to create new thread
	at java.lang.Thread.start(Unknown Source)
	at javax.swing.BasicSwingTestCase.runBare(BasicSwingTestCase.java:133)

Test: testJToggleButtonIconbooleanClass: javax.swing.JToggleButtonTestjava.lang.OutOfMemoryError: Failed to create new thread
	at java.lang.Thread.start(Unknown Source)
	at javax.swing.BasicSwingTestCase.runBare(BasicSwingTestCase.java:133)

Test: testJToggleButtonIconClass: javax.swing.JToggleButtonTestjava.lang.OutOfMemoryError: Failed to create new thread
	at java.lang.Thread.start(Unknown Source)
	at javax.swing.BasicSwingTestCase.runBare(BasicSwingTestCase.java:133)

Test: testJToggleButtonActionClass: javax.swing.JToggleButtonTestjava.lang.OutOfMemoryError: Failed to create new thread
	at java.lang.Thread.start(Unknown Source)
	at javax.swing.BasicSwingTestCase.runBare(BasicSwingTestCase.java:133)

Test: testJToggleButtonStringbooleanClass: javax.swing.JToggleButtonTestjava.lang.OutOfMemoryError: Failed to create new thread
	at java.lang.Thread.start(Unknown Source)
	at javax.swing.BasicSwingTestCase.runBare(BasicSwingTestCase.java:133)

Test: testJToggleButtonStringClass: javax.swing.JToggleButtonTestjava.lang.OutOfMemoryError: Failed to create new thread
	at java.lang.Thread.start(Unknown Source)
	at javax.swing.BasicSwingTestCase.runBare(BasicSwingTestCase.java:133)

Test: testJToggleButtonClass: javax.swing.JToggleButtonTestjava.lang.OutOfMemoryError: Failed to create new thread
	at java.lang.Thread.start(Unknown Source)
	at javax.swing.BasicSwingTestCase.runBare(BasicSwingTestCase.java:133)

Test: testSetAction1Class: javax.swing.JToggleButtonTestjava.lang.OutOfMemoryError: Failed to create new thread
	at java.lang.Thread.start(Unknown Source)
	at javax.swing.BasicSwingTestCase.runBare(BasicSwingTestCase.java:133)

Test: testGetAccessibleContextClass: javax.swing.JToolBarTestjava.lang.OutOfMemoryError: Failed to create new thread
	at java.lang.Thread.start(Unknown Source)
	at javax.swing.BasicSwingTestCase.runBare(BasicSwingTestCase.java:133)

Test: testAddImplClass: javax.swing.JToolBarTestjava.lang.OutOfMemoryError: Failed to create new thread
	at java.lang.Thread.start(Unknown Source)
	at javax.swing.BasicSwingTestCase.runBare(BasicSwingTestCase.java:133)

Test: testSetLayoutClass: javax.swing.JToolBarTestjava.lang.OutOfMemoryError: Failed to create new thread
	at java.lang.Thread.start(Unknown Source)
	at javax.swing.BasicSwingTestCase.runBare(BasicSwingTestCase.java:133)

Test: testGetUIClassIDClass: javax.swing.JToolBarTestjava.lang.OutOfMemoryError: Failed to create new thread
	at java.lang.Thread.start(Unknown Source)
	at javax.swing.BasicSwingTestCase.runBare(BasicSwingTestCase.java:133)

Test: testPaintBorderClass: javax.swing.JToolBarTestjava.lang.OutOfMemoryError: Failed to create new thread
	at java.lang.Thread.start(Unknown Source)
	at javax.swing.BasicSwingTestCase.runBare(BasicSwingTestCase.java:133)

Test: testUpdateUIClass: javax.swing.JToolBarTestjava.lang.OutOfMemoryError: Failed to create new thread
	at java.lang.Thread.start(Unknown Source)
	at javax.swing.BasicSwingTestCase.runBare(BasicSwingTestCase.java:133)

Test: testJToolBarClass: javax.swing.JToolBarTestjava.lang.OutOfMemoryError: Failed to create new thread
	at java.lang.Thread.start(Unknown Source)
	at javax.swing.BasicSwingTestCase.runBare(BasicSwingTestCase.java:133)

Test: testJToolBarintClass: javax.swing.JToolBarTestjava.lang.OutOfMemoryError: Failed to create new thread
	at java.lang.Thread.start(Unknown Source)
	at javax.swing.BasicSwingTestCase.runBare(BasicSwingTestCase.java:133)

Test: testJToolBarStringClass: javax.swing.JToolBarTestjava.lang.OutOfMemoryError: Failed to create new thread
	at java.lang.Thread.start(Unknown Source)
	at javax.swing.BasicSwingTestCase.runBare(BasicSwingTestCase.java:133)

Test: testJToolBarStringintClass: javax.swing.JToolBarTestjava.lang.OutOfMemoryError: Failed to create new thread
	at java.lang.Thread.start(Unknown Source)
	at javax.swing.BasicSwingTestCase.runBare(BasicSwingTestCase.java:133)

Test: testSetGetUIClass: javax.swing.JToolBarTestjava.lang.OutOfMemoryError: Failed to create new thread
	at java.lang.Thread.start(Unknown Source)
	at javax.swing.BasicSwingTestCase.runBare(BasicSwingTestCase.java:133)

Test: testGetComponentIndexClass: javax.swing.JToolBarTestjava.lang.OutOfMemoryError: Failed to create new thread
	at java.lang.Thread.start(Unknown Source)
	at javax.swing.BasicSwingTestCase.runBare(BasicSwingTestCase.java:133)

Test: testGetComponentAtIndexClass: javax.swing.JToolBarTestjava.lang.OutOfMemoryError: Failed to create new thread
	at java.lang.Thread.start(Unknown Source)
	at javax.swing.BasicSwingTestCase.runBare(BasicSwingTestCase.java:133)

Test: testSetGetMarginClass: javax.swing.JToolBarTestjava.lang.OutOfMemoryError: Failed to create new thread
	at java.lang.Thread.start(Unknown Source)
	at javax.swing.BasicSwingTestCase.runBare(BasicSwingTestCase.java:133)

Test: testSetIsBorderPaintedClass: javax.swing.JToolBarTestjava.lang.OutOfMemoryError: Failed to create new thread
	at java.lang.Thread.start(Unknown Source)
	at javax.swing.BasicSwingTestCase.runBare(BasicSwingTestCase.java:133)

Test: testSetIsFloatableClass: javax.swing.JToolBarTestjava.lang.OutOfMemoryError: Failed to create new thread
	at java.lang.Thread.start(Unknown Source)
	at javax.swing.BasicSwingTestCase.runBare(BasicSwingTestCase.java:133)

Test: testSetGetOrientationClass: javax.swing.JToolBarTestjava.lang.OutOfMemoryError: Failed to create new thread
	at java.lang.Thread.start(Unknown Source)
	at javax.swing.BasicSwingTestCase.runBare(BasicSwingTestCase.java:133)

Test: testSetIsRolloverClass: javax.swing.JToolBarTestjava.lang.OutOfMemoryError: Failed to create new thread
	at java.lang.Thread.start(Unknown Source)
	at javax.swing.BasicSwingTestCase.runBare(BasicSwingTestCase.java:133)

Test: testAddSeparatorClass: javax.swing.JToolBarTestjava.lang.OutOfMemoryError: Failed to create new thread
	at java.lang.Thread.start(Unknown Source)
	at javax.swing.BasicSwingTestCase.runBare(BasicSwingTestCase.java:133)

Test: testAddSeparatorDimensionClass: javax.swing.JToolBarTestjava.lang.OutOfMemoryError: Failed to create new thread
	at java.lang.Thread.start(Unknown Source)
	at javax.swing.BasicSwingTestCase.runBare(BasicSwingTestCase.java:133)

Test: testAddActionClass: javax.swing.JToolBarTestjava.lang.OutOfMemoryError: Failed to create new thread
	at java.lang.Thread.start(Unknown Source)
	at javax.swing.BasicSwingTestCase.runBare(BasicSwingTestCase.java:133)

Test: testCreateActionComponentClass: javax.swing.JToolBarTestjava.lang.OutOfMemoryError: Failed to create new thread
	at java.lang.Thread.start(Unknown Source)
	at javax.swing.BasicSwingTestCase.runBare(BasicSwingTestCase.java:133)

Test: testCreateActionChangeListenerClass: javax.swing.JToolBarTestjava.lang.OutOfMemoryError: Failed to create new thread
	at java.lang.Thread.start(Unknown Source)
	at javax.swing.BasicSwingTestCase.runBare(BasicSwingTestCase.java:133)

Test: testFocusableClass: javax.swing.JToolBar_SeparatorRTestjava.lang.OutOfMemoryError: Failed to create new thread
	at java.lang.Thread.start(Unknown Source)
	at javax.swing.BasicSwingTestCase.runBare(BasicSwingTestCase.java:133)

Test: testGetMaximumSizeClass: javax.swing.JToolBar_SeparatorTestjava.lang.OutOfMemoryError: Failed to create new thread
	at java.lang.Thread.start(Unknown Source)
	at javax.swing.BasicSwingTestCase.runBare(BasicSwingTestCase.java:133)

Test: testGetMinimumSizeClass: javax.swing.JToolBar_SeparatorTestjava.lang.OutOfMemoryError: Failed to create new thread
	at java.lang.Thread.start(Unknown Source)
	at javax.swing.BasicSwingTestCase.runBare(BasicSwingTestCase.java:133)

Test: testGetPreferredSizeClass: javax.swing.JToolBar_SeparatorTestjava.lang.OutOfMemoryError: Failed to create new thread
	at java.lang.Thread.start(Unknown Source)
	at javax.swing.BasicSwingTestCase.runBare(BasicSwingTestCase.java:133)

Test: testGetUIClassIDClass: javax.swing.JToolBar_SeparatorTestjava.lang.OutOfMemoryError: Failed to create new thread
	at java.lang.Thread.start(Unknown Source)
	at javax.swing.BasicSwingTestCase.runBare(BasicSwingTestCase.java:133)

Test: testSeparatorClass: javax.swing.JToolBar_SeparatorTestjava.lang.OutOfMemoryError: Failed to create new thread
	at java.lang.Thread.start(Unknown Source)
	at javax.swing.BasicSwingTestCase.runBare(BasicSwingTestCase.java:133)

Test: testSeparatorDimensionClass: javax.swing.JToolBar_SeparatorTestjava.lang.OutOfMemoryError: Failed to create new thread
	at java.lang.Thread.start(Unknown Source)
	at javax.swing.BasicSwingTestCase.runBare(BasicSwingTestCase.java:133)

Test: testSetGetSeparatorSizeClass: javax.swing.JToolBar_SeparatorTestjava.lang.OutOfMemoryError: Failed to create new thread
	at java.lang.Thread.start(Unknown Source)
	at javax.swing.BasicSwingTestCase.runBare(BasicSwingTestCase.java:133)

Test: testGetUIClassIDClass: javax.swing.JToolTipTestjava.lang.OutOfMemoryError: Failed to create new thread
	at java.lang.Thread.start(Unknown Source)
	at javax.swing.BasicSwingTestCase.runBare(BasicSwingTestCase.java:133)

Test: testGetUIClass: javax.swing.JToolTipTestjava.lang.OutOfMemoryError: Failed to create new thread
	at java.lang.Thread.start(Unknown Source)
	at javax.swing.BasicSwingTestCase.runBare(BasicSwingTestCase.java:133)

Test: testSetGetTipTextClass: javax.swing.JToolTipTestjava.lang.OutOfMemoryError: Failed to create new thread
	at java.lang.Thread.start(Unknown Source)
	at javax.swing.BasicSwingTestCase.runBare(BasicSwingTestCase.java:133)

Test: testSetGetComponentClass: javax.swing.JToolTipTestjava.lang.OutOfMemoryError: Failed to create new thread
	at java.lang.Thread.start(Unknown Source)
	at javax.swing.BasicSwingTestCase.runBare(BasicSwingTestCase.java:133)

Test: testTreeSelectionRedirectorClass: javax.swing.JTreeTestjava.lang.OutOfMemoryError: Failed to create new thread
	at java.lang.Thread.start(Unknown Source)
	at javax.swing.BasicSwingTestCase.runBare(BasicSwingTestCase.java:133)

Test: testJTreeClass: javax.swing.JTreeTestjava.lang.OutOfMemoryError: Failed to create new thread
	at java.lang.Thread.start(Unknown Source)
	at javax.swing.BasicSwingTestCase.runBare(BasicSwingTestCase.java:133)

Test: testJTreeTreeModelClass: javax.swing.JTreeTestjava.lang.OutOfMemoryError: Failed to create new thread
	at java.lang.Thread.start(Unknown Source)
	at javax.swing.BasicSwingTestCase.runBare(BasicSwingTestCase.java:133)

Test: testJTreeTreeNodeBooleanClass: javax.swing.JTreeTestjava.lang.OutOfMemoryError: Failed to create new thread
	at java.lang.Thread.start(Unknown Source)
	at javax.swing.BasicSwingTestCase.runBare(BasicSwingTestCase.java:133)

Test: testJTreeTreeNodeClass: javax.swing.JTreeTestjava.lang.OutOfMemoryError: Failed to create new thread
	at java.lang.Thread.start(Unknown Source)
	at javax.swing.BasicSwingTestCase.runBare(BasicSwingTestCase.java:133)

Test: testJTreeObjectArrayClass: javax.swing.JTreeTestjava.lang.OutOfMemoryError: Failed to create new thread
	at java.lang.Thread.start(Unknown Source)
	at javax.swing.BasicSwingTestCase.runBare(BasicSwingTestCase.java:133)

Test: testJTreeVectorClass: javax.swing.JTreeTestjava.lang.OutOfMemoryError: Failed to create new thread
	at java.lang.Thread.start(Unknown Source)
	at javax.swing.BasicSwingTestCase.runBare(BasicSwingTestCase.java:133)

Test: testJTreeHashtableClass: javax.swing.JTreeTestjava.lang.OutOfMemoryError: Failed to create new thread
	at java.lang.Thread.start(Unknown Source)
	at javax.swing.BasicSwingTestCase.runBare(BasicSwingTestCase.java:133)

Test: testGetAccessibleContextClass: javax.swing.JTreeTestjava.lang.OutOfMemoryError: Failed to create new thread
	at java.lang.Thread.start(Unknown Source)
	at javax.swing.BasicSwingTestCase.runBare(BasicSwingTestCase.java:133)

Test: testGetToolTipTextMouseEventClass: javax.swing.JTreeTestjava.lang.OutOfMemoryError: Failed to create new thread
	at java.lang.Thread.start(Unknown Source)
	at javax.swing.BasicSwingTestCase.runBare(BasicSwingTestCase.java:133)

Test: testGetUIClassIDClass: javax.swing.JTreeTestjava.lang.OutOfMemoryError: Failed to create new thread
	at java.lang.Thread.start(Unknown Source)
	at javax.swing.BasicSwingTestCase.runBare(BasicSwingTestCase.java:133)

Test: testSetAddRemoveSelectionIntervalClass: javax.swing.JTreeTestjava.lang.OutOfMemoryError: Failed to create new thread
	at java.lang.Thread.start(Unknown Source)
	at javax.swing.BasicSwingTestCase.runBare(BasicSwingTestCase.java:133)

Test: testAddRemoveSelectionPathPathsRowRowsClass: javax.swing.JTreeTestjava.lang.OutOfMemoryError: Failed to create new thread
	at java.lang.Thread.start(Unknown Source)
	at javax.swing.BasicSwingTestCase.runBare(BasicSwingTestCase.java:133)

Test: testAddGetRemoveTreeExpansionListenerClass: javax.swing.JTreeTestjava.lang.OutOfMemoryError: Failed to create new thread
	at java.lang.Thread.start(Unknown Source)
	at javax.swing.BasicSwingTestCase.runBare(BasicSwingTestCase.java:133)

Test: testAddGetRemoveTreeSelectionListenerClass: javax.swing.JTreeTestjava.lang.OutOfMemoryError: Failed to create new thread
	at java.lang.Thread.start(Unknown Source)
	at javax.swing.BasicSwingTestCase.runBare(BasicSwingTestCase.java:133)

Test: testAddGetRemoveTreeWillExpandListenerClass: javax.swing.JTreeTestjava.lang.OutOfMemoryError: Failed to create new thread
	at java.lang.Thread.start(Unknown Source)
	at javax.swing.BasicSwingTestCase.runBare(BasicSwingTestCase.java:133)

Test: testClearSelectionClass: javax.swing.JTreeTestjava.lang.OutOfMemoryError: Failed to create new thread
	at java.lang.Thread.start(Unknown Source)
	at javax.swing.BasicSwingTestCase.runBare(BasicSwingTestCase.java:133)

Test: testClearToggledPathsClass: javax.swing.JTreeTestjava.lang.OutOfMemoryError: Failed to create new thread
	at java.lang.Thread.start(Unknown Source)
	at javax.swing.BasicSwingTestCase.runBare(BasicSwingTestCase.java:133)

Test: testConvertValueToTextClass: javax.swing.JTreeTestjava.lang.OutOfMemoryError: Failed to create new thread
	at java.lang.Thread.start(Unknown Source)
	at javax.swing.BasicSwingTestCase.runBare(BasicSwingTestCase.java:133)

Test: testCreateTreeModelClass: javax.swing.JTreeTestjava.lang.OutOfMemoryError: Failed to create new thread
	at java.lang.Thread.start(Unknown Source)
	at javax.swing.BasicSwingTestCase.runBare(BasicSwingTestCase.java:133)

Test: testCreateTreeModelListenerClass: javax.swing.JTreeTestjava.lang.OutOfMemoryError: Failed to create new thread
	at java.lang.Thread.start(Unknown Source)
	at javax.swing.BasicSwingTestCase.runBare(BasicSwingTestCase.java:133)

Test: testTreeModelHandlerClass: javax.swing.JTreeTestjava.lang.OutOfMemoryError: Failed to create new thread
	at java.lang.Thread.start(Unknown Source)
	at javax.swing.BasicSwingTestCase.runBare(BasicSwingTestCase.java:133)

Test: testExpandCollapsePathRowClass: javax.swing.JTreeTestjava.lang.OutOfMemoryError: Failed to create new thread
	at java.lang.Thread.start(Unknown Source)
	at javax.swing.BasicSwingTestCase.runBare(BasicSwingTestCase.java:133)

Test: testHasBeenExpandedClass: javax.swing.JTreeTestjava.lang.OutOfMemoryError: Failed to create new thread
	at java.lang.Thread.start(Unknown Source)
	at javax.swing.BasicSwingTestCase.runBare(BasicSwingTestCase.java:133)

Test: testFireTreeExpandedCollapsedWillExpandCollapseClass: javax.swing.JTreeTestjava.lang.OutOfMemoryError: Failed to create new thread
	at java.lang.Thread.start(Unknown Source)
	at javax.swing.BasicSwingTestCase.runBare(BasicSwingTestCase.java:133)

Test: testFireValueChangedClass: javax.swing.JTreeTestjava.lang.OutOfMemoryError: Failed to create new thread
	at java.lang.Thread.start(Unknown Source)
	at javax.swing.BasicSwingTestCase.runBare(BasicSwingTestCase.java:133)

Test: testGetSetAnchorSelectionPathClass: javax.swing.JTreeTestjava.lang.OutOfMemoryError: Failed to create new thread
	at java.lang.Thread.start(Unknown Source)
	at javax.swing.BasicSwingTestCase.runBare(BasicSwingTestCase.java:133)

Test: testGetClosestPathForLocationClass: javax.swing.JTreeTestjava.lang.OutOfMemoryError: Failed to create new thread
	at java.lang.Thread.start(Unknown Source)
	at javax.swing.BasicSwingTestCase.runBare(BasicSwingTestCase.java:133)

Test: testGetClosestRowForLocationClass: javax.swing.JTreeTestjava.lang.OutOfMemoryError: Failed to create new thread
	at java.lang.Thread.start(Unknown Source)
	at javax.swing.BasicSwingTestCase.runBare(BasicSwingTestCase.java:133)

Test: testGetDefaultTreeModelClass: javax.swing.JTreeTestjava.lang.OutOfMemoryError: Failed to create new thread
	at java.lang.Thread.start(Unknown Source)
	at javax.swing.BasicSwingTestCase.runBare(BasicSwingTestCase.java:133)

Test: testGetDescendantToggledPathsClass: javax.swing.JTreeTestjava.lang.OutOfMemoryError: Failed to create new thread
	at java.lang.Thread.start(Unknown Source)
	at javax.swing.BasicSwingTestCase.runBare(BasicSwingTestCase.java:133)

Test: testGetDragEnabledClass: javax.swing.JTreeTestjava.lang.OutOfMemoryError: Failed to create new thread
	at java.lang.Thread.start(Unknown Source)
	at javax.swing.BasicSwingTestCase.runBare(BasicSwingTestCase.java:133)

Test: testGetExpandedDescendantsClass: javax.swing.JTreeTestjava.lang.OutOfMemoryError: Failed to create new thread
	at java.lang.Thread.start(Unknown Source)
	at javax.swing.BasicSwingTestCase.runBare(BasicSwingTestCase.java:133)

Test: testGetSetExpandsSelectedPathsClass: javax.swing.JTreeTestjava.lang.OutOfMemoryError: Failed to create new thread
	at java.lang.Thread.start(Unknown Source)
	at javax.swing.BasicSwingTestCase.runBare(BasicSwingTestCase.java:133)

Test: testGetSetInvokesStopCellEditingClass: javax.swing.JTreeTestjava.lang.OutOfMemoryError: Failed to create new thread
	at java.lang.Thread.start(Unknown Source)
	at javax.swing.BasicSwingTestCase.runBare(BasicSwingTestCase.java:133)

Test: testGetLastSelectedPathComponentClass: javax.swing.JTreeTestjava.lang.OutOfMemoryError: Failed to create new thread
	at java.lang.Thread.start(Unknown Source)
	at javax.swing.BasicSwingTestCase.runBare(BasicSwingTestCase.java:133)

Test: testGetLeadSelectionRowClass: javax.swing.JTreeTestjava.lang.OutOfMemoryError: Failed to create new thread
	at java.lang.Thread.start(Unknown Source)
	at javax.swing.BasicSwingTestCase.runBare(BasicSwingTestCase.java:133)

Test: testGetMinMaxSelectionRowClass: javax.swing.JTreeTestjava.lang.OutOfMemoryError: Failed to create new thread
	at java.lang.Thread.start(Unknown Source)
	at javax.swing.BasicSwingTestCase.runBare(BasicSwingTestCase.java:133)

Test: testGetNextMatchClass: javax.swing.JTreeTestjava.lang.OutOfMemoryError: Failed to create new thread
	at java.lang.Thread.start(Unknown Source)
	at javax.swing.BasicSwingTestCase.runBare(BasicSwingTestCase.java:133)

Test: testGetPathBetweenRowsClass: javax.swing.JTreeTestjava.lang.OutOfMemoryError: Failed to create new thread
	at java.lang.Thread.start(Unknown Source)
	at javax.swing.BasicSwingTestCase.runBare(BasicSwingTestCase.java:133)

Test: testGetPathBoundsClass: javax.swing.JTreeTestjava.lang.OutOfMemoryError: Failed to create new thread
	at java.lang.Thread.start(Unknown Source)
	at javax.swing.BasicSwingTestCase.runBare(BasicSwingTestCase.java:133)

Test: testGetRowBoundsClass: javax.swing.JTreeTestjava.lang.OutOfMemoryError: Failed to create new thread
	at java.lang.Thread.start(Unknown Source)
	at javax.swing.BasicSwingTestCase.runBare(BasicSwingTestCase.java:133)

Test: testGetPathForLocationClass: javax.swing.JTreeTestjava.lang.OutOfMemoryError: Failed to create new thread
	at java.lang.Thread.start(Unknown Source)
	at javax.swing.BasicSwingTestCase.runBare(BasicSwingTestCase.java:133)

Test: testGetRowForLocationClass: javax.swing.JTreeTestjava.lang.OutOfMemoryError: Failed to create new thread
	at java.lang.Thread.start(Unknown Source)
	at javax.swing.BasicSwingTestCase.runBare(BasicSwingTestCase.java:133)

Test: testGetRowForPathClass: javax.swing.JTreeTestjava.lang.OutOfMemoryError: Failed to create new thread
	at java.lang.Thread.start(Unknown Source)
	at javax.swing.BasicSwingTestCase.runBare(BasicSwingTestCase.java:133)

Test: testGetPathForRowClass: javax.swing.JTreeTestjava.lang.OutOfMemoryError: Failed to create new thread
	at java.lang.Thread.start(Unknown Source)
	at javax.swing.BasicSwingTestCase.runBare(BasicSwingTestCase.java:133)

Test: testGetRowCountClass: javax.swing.JTreeTestjava.lang.OutOfMemoryError: Failed to create new thread
	at java.lang.Thread.start(Unknown Source)
	at javax.swing.BasicSwingTestCase.runBare(BasicSwingTestCase.java:133)

Test: testGetSetRowHeightClass: javax.swing.JTreeTestjava.lang.OutOfMemoryError: Failed to create new thread
	at java.lang.Thread.start(Unknown Source)
	at javax.swing.BasicSwingTestCase.runBare(BasicSwingTestCase.java:133)

Test: testGetSetScrollsOnExpandClass: javax.swing.JTreeTestjava.lang.OutOfMemoryError: Failed to create new thread
	at java.lang.Thread.start(Unknown Source)
	at javax.swing.BasicSwingTestCase.runBare(BasicSwingTestCase.java:133)

Test: testGetSelectionCountClass: javax.swing.JTreeTestjava.lang.OutOfMemoryError: Failed to create new thread
	at java.lang.Thread.start(Unknown Source)
	at javax.swing.BasicSwingTestCase.runBare(BasicSwingTestCase.java:133)

Test: testGetSelectionModelClass: javax.swing.JTreeTestjava.lang.OutOfMemoryError: Failed to create new thread
	at java.lang.Thread.start(Unknown Source)
	at javax.swing.BasicSwingTestCase.runBare(BasicSwingTestCase.java:133)

Test: testGetSetSelectionPathsClass: javax.swing.JTreeTestjava.lang.OutOfMemoryError: Failed to create new thread
	at java.lang.Thread.start(Unknown Source)
	at javax.swing.BasicSwingTestCase.runBare(BasicSwingTestCase.java:133)

Test: testGetSetShowsRootHandlesClass: javax.swing.JTreeTestjava.lang.OutOfMemoryError: Failed to create new thread
	at java.lang.Thread.start(Unknown Source)
	at javax.swing.BasicSwingTestCase.runBare(BasicSwingTestCase.java:133)

Test: testGetToggleClickCountClass: javax.swing.JTreeTestjava.lang.OutOfMemoryError: Failed to create new thread
	at java.lang.Thread.start(Unknown Source)
	at javax.swing.BasicSwingTestCase.runBare(BasicSwingTestCase.java:133)

Test: testGetUIClass: javax.swing.JTreeTestjava.lang.OutOfMemoryError: Failed to create new thread
	at java.lang.Thread.start(Unknown Source)
	at javax.swing.BasicSwingTestCase.runBare(BasicSwingTestCase.java:133)

Test: testIsSetEditableClass: javax.swing.JTreeTestjava.lang.OutOfMemoryError: Failed to create new thread
	at java.lang.Thread.start(Unknown Source)
	at javax.swing.BasicSwingTestCase.runBare(BasicSwingTestCase.java:133)

Test: testIsExpandedClass: javax.swing.JTreeTestjava.lang.OutOfMemoryError: Failed to create new thread
	at java.lang.Thread.start(Unknown Source)
	at javax.swing.BasicSwingTestCase.runBare(BasicSwingTestCase.java:133)

Test: testIsFixedRowHeightClass: javax.swing.JTreeTestjava.lang.OutOfMemoryError: Failed to create new thread
	at java.lang.Thread.start(Unknown Source)
	at javax.swing.BasicSwingTestCase.runBare(BasicSwingTestCase.java:133)

Test: testIsLargeModelClass: javax.swing.JTreeTestjava.lang.OutOfMemoryError: Failed to create new thread
	at java.lang.Thread.start(Unknown Source)
	at javax.swing.BasicSwingTestCase.runBare(BasicSwingTestCase.java:133)

Test: testIsPathEditableClass: javax.swing.JTreeTestjava.lang.OutOfMemoryError: Failed to create new thread
	at java.lang.Thread.start(Unknown Source)
	at javax.swing.BasicSwingTestCase.runBare(BasicSwingTestCase.java:133)

Test: testSetIsRootVisibleClass: javax.swing.JTreeTestjava.lang.OutOfMemoryError: Failed to create new thread
	at java.lang.Thread.start(Unknown Source)
	at javax.swing.BasicSwingTestCase.runBare(BasicSwingTestCase.java:133)

Test: testIsPathSelectedClass: javax.swing.JTreeTestjava.lang.OutOfMemoryError: Failed to create new thread
	at java.lang.Thread.start(Unknown Source)
	at javax.swing.BasicSwingTestCase.runBare(BasicSwingTestCase.java:133)

Test: testIsRowSelectedClass: javax.swing.JTreeTestjava.lang.OutOfMemoryError: Failed to create new thread
	at java.lang.Thread.start(Unknown Source)
	at javax.swing.BasicSwingTestCase.runBare(BasicSwingTestCase.java:133)

Test: testIsSelectionEmptyClass: javax.swing.JTreeTestjava.lang.OutOfMemoryError: Failed to create new thread
	at java.lang.Thread.start(Unknown Source)
	at javax.swing.BasicSwingTestCase.runBare(BasicSwingTestCase.java:133)

Test: testIsVisibleClass: javax.swing.JTreeTestjava.lang.OutOfMemoryError: Failed to create new thread
	at java.lang.Thread.start(Unknown Source)
	at javax.swing.BasicSwingTestCase.runBare(BasicSwingTestCase.java:133)

Test: testMakeVisibleClass: javax.swing.JTreeTestjava.lang.OutOfMemoryError: Failed to create new thread
	at java.lang.Thread.start(Unknown Source)
	at javax.swing.BasicSwingTestCase.runBare(BasicSwingTestCase.java:133)

Test: testRemoveDescendantSelectedPathsClass: javax.swing.JTreeTestjava.lang.OutOfMemoryError: Failed to create new thread
	at java.lang.Thread.start(Unknown Source)
	at javax.swing.BasicSwingTestCase.runBare(BasicSwingTestCase.java:133)

Test: testRemoveDescendantToggledPathsClass: javax.swing.JTreeTestjava.lang.OutOfMemoryError: Failed to create new thread
	at java.lang.Thread.start(Unknown Source)
	at javax.swing.BasicSwingTestCase.runBare(BasicSwingTestCase.java:133)

Test: testSetCellEditorClass: javax.swing.JTreeTestjava.lang.OutOfMemoryError: Failed to create new thread
	at java.lang.Thread.start(Unknown Source)
	at javax.swing.BasicSwingTestCase.runBare(BasicSwingTestCase.java:133)

Test: testGetCellEditorClass: javax.swing.JTreeTestjava.lang.OutOfMemoryError: Failed to create new thread
	at java.lang.Thread.start(Unknown Source)
	at javax.swing.BasicSwingTestCase.runBare(BasicSwingTestCase.java:133)

Test: testSetCellRendererClass: javax.swing.JTreeTestjava.lang.OutOfMemoryError: Failed to create new thread
	at java.lang.Thread.start(Unknown Source)
	at javax.swing.BasicSwingTestCase.runBare(BasicSwingTestCase.java:133)

Test: testGetCellRendererClass: javax.swing.JTreeTestjava.lang.OutOfMemoryError: Failed to create new thread
	at java.lang.Thread.start(Unknown Source)
	at javax.swing.BasicSwingTestCase.runBare(BasicSwingTestCase.java:133)

Test: testSetExpandedStateClass: javax.swing.JTreeTestjava.lang.OutOfMemoryError: Failed to create new thread
	at java.lang.Thread.start(Unknown Source)
	at javax.swing.BasicSwingTestCase.runBare(BasicSwingTestCase.java:133)

Test: testGetSetLeadSelectionPathClass: javax.swing.JTreeTestjava.lang.OutOfMemoryError: Failed to create new thread
	at java.lang.Thread.start(Unknown Source)
	at javax.swing.BasicSwingTestCase.runBare(BasicSwingTestCase.java:133)

Test: testGetSetModelClass: javax.swing.JTreeTestjava.lang.OutOfMemoryError: Failed to create new thread
	at java.lang.Thread.start(Unknown Source)
	at javax.swing.BasicSwingTestCase.runBare(BasicSwingTestCase.java:133)

Test: testSetSelectionModelClass: javax.swing.JTreeTestjava.lang.OutOfMemoryError: Failed to create new thread
	at java.lang.Thread.start(Unknown Source)
	at javax.swing.BasicSwingTestCase.runBare(BasicSwingTestCase.java:133)

Test: testGetSetSelectionPathClass: javax.swing.JTreeTestjava.lang.OutOfMemoryError: Failed to create new thread
	at java.lang.Thread.start(Unknown Source)
	at javax.swing.BasicSwingTestCase.runBare(BasicSwingTestCase.java:133)

Test: testGetSetSelectionRowClass: javax.swing.JTreeTestjava.lang.OutOfMemoryError: Failed to create new thread
	at java.lang.Thread.start(Unknown Source)
	at javax.swing.BasicSwingTestCase.runBare(BasicSwingTestCase.java:133)

Test: testGetSetSelectionRowsClass: javax.swing.JTreeTestjava.lang.OutOfMemoryError: Failed to create new thread
	at java.lang.Thread.start(Unknown Source)
	at javax.swing.BasicSwingTestCase.runBare(BasicSwingTestCase.java:133)

Test: testSetUITreeUIClass: javax.swing.JTreeTestjava.lang.OutOfMemoryError: Failed to create new thread
	at java.lang.Thread.start(Unknown Source)
	at javax.swing.BasicSwingTestCase.runBare(BasicSwingTestCase.java:133)

Test: testGetSetVisibleRowCountClass: javax.swing.JTreeTestjava.lang.OutOfMemoryError: Failed to create new thread
	at java.lang.Thread.start(Unknown Source)
	at javax.swing.BasicSwingTestCase.runBare(BasicSwingTestCase.java:133)

Test: testIsEditingStartEditingAtPathGetEditingPathClass: javax.swing.JTreeTestjava.lang.OutOfMemoryError: Failed to create new thread
	at java.lang.Thread.start(Unknown Source)
	at javax.swing.BasicSwingTestCase.runBare(BasicSwingTestCase.java:133)

Test: testGetPreferredScrollableViewportSizeClass: javax.swing.JTreeTestjava.lang.OutOfMemoryError: Failed to create new thread
	at java.lang.Thread.start(Unknown Source)
	at javax.swing.BasicSwingTestCase.runBare(BasicSwingTestCase.java:133)

Test: testGetScrollableBlockIncrementClass: javax.swing.JTreeTestjava.lang.OutOfMemoryError: Failed to create new thread
	at java.lang.Thread.start(Unknown Source)
	at javax.swing.BasicSwingTestCase.runBare(BasicSwingTestCase.java:133)

Test: testGetScrollableUnitIncrementClass: javax.swing.JTreeTestjunit.framework.AssertionFailedError: Test interrupted due timeout
	at javax.swing.BasicSwingTestCase.runBare(BasicSwingTestCase.java:147)

Test: testGetScrollableTracksViewportHeightClass: javax.swing.JTreeTestjunit.framework.AssertionFailedError: Test interrupted due timeout
	at javax.swing.BasicSwingTestCase.runBare(BasicSwingTestCase.java:147)

Test: testGetScrollableTracksViewportWidthClass: javax.swing.JTreeTestjunit.framework.AssertionFailedError: Test interrupted due timeout
	at javax.swing.BasicSwingTestCase.runBare(BasicSwingTestCase.java:147)

Test: testScrollRowPathToVisibleClass: javax.swing.JTreeTestjunit.framework.AssertionFailedError: Test interrupted due timeout
	at javax.swing.BasicSwingTestCase.runBare(BasicSwingTestCase.java:147)

Test: testEmptySelectionModelClass: javax.swing.JTree_EmptySelectionModelTestjunit.framework.AssertionFailedError: Test interrupted due timeout
	at javax.swing.BasicSwingTestCase.runBare(BasicSwingTestCase.java:147)

Test: testSharedInstanceClass: javax.swing.JTree_EmptySelectionModelTestjunit.framework.AssertionFailedError: Test interrupted due timeout
	at javax.swing.BasicSwingTestCase.runBare(BasicSwingTestCase.java:147)

Test: testSetAddRemoveSelectionPathsClass: javax.swing.JTree_EmptySelectionModelTestjunit.framework.AssertionFailedError: Test interrupted due timeout
	at javax.swing.BasicSwingTestCase.runBare(BasicSwingTestCase.java:147)

Test: testGetKeyStrokeStringClass: javax.swing.KeyStrokeTestjunit.framework.AssertionFailedError: Test interrupted due timeout
	at javax.swing.BasicSwingTestCase.runBare(BasicSwingTestCase.java:147)

Test: testGetKeyStrokeCharacterintClass: javax.swing.KeyStrokeTestjunit.framework.AssertionFailedError: Test interrupted due timeout
	at javax.swing.BasicSwingTestCase.runBare(BasicSwingTestCase.java:147)

Test: testGetKeyStrokeForEventClass: javax.swing.KeyStrokeTestjunit.framework.AssertionFailedError: Test interrupted due timeout
	at javax.swing.BasicSwingTestCase.runBare(BasicSwingTestCase.java:147)

Test: testGetKeyStrokeintintbooleanClass: javax.swing.KeyStrokeTestjunit.framework.AssertionFailedError: Test interrupted due timeout
	at javax.swing.BasicSwingTestCase.runBare(BasicSwingTestCase.java:147)

Test: testGetKeyStrokeintintClass: javax.swing.KeyStrokeTestjunit.framework.AssertionFailedError: Test interrupted due timeout
	at javax.swing.BasicSwingTestCase.runBare(BasicSwingTestCase.java:147)

Test: testGetKeyStrokecharbooleanClass: javax.swing.KeyStrokeTestjunit.framework.AssertionFailedError: Test interrupted due timeout
	at javax.swing.BasicSwingTestCase.runBare(BasicSwingTestCase.java:147)

Test: testGetKeyStrokecharClass: javax.swing.KeyStrokeTestjunit.framework.AssertionFailedError: Test interrupted due timeout
	at javax.swing.BasicSwingTestCase.runBare(BasicSwingTestCase.java:147)

Test: testToStringClass: javax.swing.LookAndFeelTestjunit.framework.AssertionFailedError: Test interrupted due timeout
	at javax.swing.BasicSwingTestCase.runBare(BasicSwingTestCase.java:147)

Test: testMakeComponentInputMapClass: javax.swing.LookAndFeelTestjunit.framework.AssertionFailedError: Test interrupted due timeout
	at javax.swing.BasicSwingTestCase.runBare(BasicSwingTestCase.java:147)

Test: testMakeIconClass: javax.swing.LookAndFeelTestjunit.framework.AssertionFailedError: Test interrupted due timeout
	at javax.swing.BasicSwingTestCase.runBare(BasicSwingTestCase.java:147)

Test: testMakeInputMapClass: javax.swing.LookAndFeelTestjunit.framework.AssertionFailedError: Test interrupted due timeout
	at javax.swing.BasicSwingTestCase.runBare(BasicSwingTestCase.java:147)

Test: testMakeKeyBindingsClass: javax.swing.LookAndFeelTestjunit.framework.AssertionFailedError: Test interrupted due timeout
	at javax.swing.BasicSwingTestCase.runBare(BasicSwingTestCase.java:147)

Test: testMakeKeyBindingsFromErrorArrayClass: javax.swing.LookAndFeelTestjunit.framework.AssertionFailedError: Test interrupted due timeout
	at javax.swing.BasicSwingTestCase.runBare(BasicSwingTestCase.java:147)

Test: testGetDefaultsClass: javax.swing.LookAndFeelTestjunit.framework.AssertionFailedError: Test interrupted due timeout
	at javax.swing.BasicSwingTestCase.runBare(BasicSwingTestCase.java:147)

Test: testInstallColorsClass: javax.swing.LookAndFeelTestjunit.framework.AssertionFailedError: Test interrupted due timeout
	at javax.swing.BasicSwingTestCase.runBare(BasicSwingTestCase.java:147)

Test: testInstallErrorColorsClass: javax.swing.LookAndFeelTestjunit.framework.AssertionFailedError: Test interrupted due timeout
	at javax.swing.BasicSwingTestCase.runBare(BasicSwingTestCase.java:147)

Test: testInstallColorAndFontsClass: javax.swing.LookAndFeelTestjunit.framework.AssertionFailedError: Test interrupted due timeout
	at javax.swing.BasicSwingTestCase.runBare(BasicSwingTestCase.java:147)

Test: testInstallUninstallBorderClass: javax.swing.LookAndFeelTestjunit.framework.AssertionFailedError: Test interrupted due timeout
	at javax.swing.BasicSwingTestCase.runBare(BasicSwingTestCase.java:147)

Test: testLoadKeyBindingsClass: javax.swing.LookAndFeelTestjunit.framework.AssertionFailedError: Test interrupted due timeout
	at javax.swing.BasicSwingTestCase.runBare(BasicSwingTestCase.java:147)

Test: testGetDesktopPropertyValueClass: javax.swing.LookAndFeelTestjunit.framework.AssertionFailedError: Test interrupted due timeout
	at javax.swing.BasicSwingTestCase.runBare(BasicSwingTestCase.java:147)

Test: testGetSupportsWindowsDecorationsClass: javax.swing.LookAndFeelTestjunit.framework.AssertionFailedError: Test interrupted due timeout
	at javax.swing.BasicSwingTestCase.runBare(BasicSwingTestCase.java:147)

Test: testInstallPropertyClass: javax.swing.LookAndFeelTestjunit.framework.AssertionFailedError: Test interrupted due timeout
	at javax.swing.BasicSwingTestCase.runBare(BasicSwingTestCase.java:147)

Test: testIsComponentPartOfCurrentMenuClass: javax.swing.MenuSelectionManagerRTestjunit.framework.AssertionFailedError: Test interrupted due timeout
	at javax.swing.BasicSwingTestCase.runBare(BasicSwingTestCase.java:147)

Test: testMenuSelectionManagerClass: javax.swing.MenuSelectionManagerTestjunit.framework.AssertionFailedError: Test interrupted due timeout
	at javax.swing.BasicSwingTestCase.runBare(BasicSwingTestCase.java:147)

Test: testAddGetRemoveChangeListenerClass: javax.swing.MenuSelectionManagerTestjunit.framework.AssertionFailedError: Test interrupted due timeout
	at javax.swing.BasicSwingTestCase.runBare(BasicSwingTestCase.java:147)

Test: testComponentForPointClass: javax.swing.MenuSelectionManagerTestjunit.framework.AssertionFailedError: Test interrupted due timeout
	at javax.swing.BasicSwingTestCase.runBare(BasicSwingTestCase.java:147)

Test: testDefaultManagerClass: javax.swing.MenuSelectionManagerTestjunit.framework.AssertionFailedError: Test interrupted due timeout
	at javax.swing.BasicSwingTestCase.runBare(BasicSwingTestCase.java:147)

Test: testFireStateChangedClass: javax.swing.MenuSelectionManagerTestjunit.framework.AssertionFailedError: Test interrupted due timeout
	at javax.swing.BasicSwingTestCase.runBare(BasicSwingTestCase.java:147)

Test: testIsComponentPartOfCurrentMenuClass: javax.swing.MenuSelectionManagerTestjunit.framework.AssertionFailedError: Test interrupted due timeout
	at javax.swing.BasicSwingTestCase.runBare(BasicSwingTestCase.java:147)

Test: testProcessKeyEventClass: javax.swing.MenuSelectionManagerTestjunit.framework.AssertionFailedError: Test interrupted due timeout
	at javax.swing.BasicSwingTestCase.runBare(BasicSwingTestCase.java:147)

Test: testProcessMouseEventClass: javax.swing.MenuSelectionManagerTestjunit.framework.AssertionFailedError: Test interrupted due timeout
	at javax.swing.BasicSwingTestCase.runBare(BasicSwingTestCase.java:147)

Test: testSetGetClearSelectedPathClass: javax.swing.MenuSelectionManagerTestjunit.framework.AssertionFailedError: Test interrupted due timeout
	at javax.swing.BasicSwingTestCase.runBare(BasicSwingTestCase.java:147)

Test: testSetSelectedPathClass: javax.swing.MenuSelectionManagerTestjunit.framework.AssertionFailedError: Test interrupted due timeout
	at javax.swing.BasicSwingTestCase.runBare(BasicSwingTestCase.java:147)

Test: testGetPreferredLayoutSizeClass: javax.swing.ScrollPaneLayoutTestjunit.framework.AssertionFailedError: Test interrupted due timeout
	at javax.swing.BasicSwingTestCase.runBare(BasicSwingTestCase.java:147)

Test: testDefaultLayoutClass: javax.swing.ScrollPaneLayoutTestjunit.framework.AssertionFailedError: Test interrupted due timeout
	at javax.swing.BasicSwingTestCase.runBare(BasicSwingTestCase.java:147)

Test: testSetHorizontalPolicyClass: javax.swing.ScrollPaneLayoutTestjunit.framework.AssertionFailedError: Test interrupted due timeout
	at javax.swing.BasicSwingTestCase.runBare(BasicSwingTestCase.java:147)

Test: testSetVerticalPolicyClass: javax.swing.ScrollPaneLayoutTestjunit.framework.AssertionFailedError: Test interrupted due timeout
	at javax.swing.BasicSwingTestCase.runBare(BasicSwingTestCase.java:147)

Test: testGetViewportClass: javax.swing.ScrollPaneLayoutTestjunit.framework.AssertionFailedError: Test interrupted due timeout
	at javax.swing.BasicSwingTestCase.runBare(BasicSwingTestCase.java:147)

Test: testGetHorizontalScrollbarClass: javax.swing.ScrollPaneLayoutTestjunit.framework.AssertionFailedError: Test interrupted due timeout
	at javax.swing.BasicSwingTestCase.runBare(BasicSwingTestCase.java:147)

Test: testGetVerticalScrollbarClass: javax.swing.ScrollPaneLayoutTestjunit.framework.AssertionFailedError: Test interrupted due timeout
	at javax.swing.BasicSwingTestCase.runBare(BasicSwingTestCase.java:147)

Test: testGetCornerClass: javax.swing.ScrollPaneLayoutTestjunit.framework.AssertionFailedError: Test interrupted due timeout
	at javax.swing.BasicSwingTestCase.runBare(BasicSwingTestCase.java:147)

Test: testGetRowHeaderClass: javax.swing.ScrollPaneLayoutTestjunit.framework.AssertionFailedError: Test interrupted due timeout
	at javax.swing.BasicSwingTestCase.runBare(BasicSwingTestCase.java:147)

Test: testGetColumnHeaderClass: javax.swing.ScrollPaneLayoutTestjunit.framework.AssertionFailedError: Test interrupted due timeout
	at javax.swing.BasicSwingTestCase.runBare(BasicSwingTestCase.java:147)

Test: testSyncWithScrollPaneClass: javax.swing.ScrollPaneLayoutTestjunit.framework.AssertionFailedError: Test interrupted due timeout
	at javax.swing.BasicSwingTestCase.runBare(BasicSwingTestCase.java:147)

Test: testGetViewportBorderBoundsClass: javax.swing.ScrollPaneLayoutTestjunit.framework.AssertionFailedError: Test interrupted due timeout
	at javax.swing.BasicSwingTestCase.runBare(BasicSwingTestCase.java:147)

Test: testRemoveLayoutComponentClass: javax.swing.ScrollPaneLayoutTestjunit.framework.AssertionFailedError: Test interrupted due timeout
	at javax.swing.BasicSwingTestCase.runBare(BasicSwingTestCase.java:147)

Test: testAddSingletonLayoutComponentClass: javax.swing.ScrollPaneLayoutTestjunit.framework.AssertionFailedError: Test interrupted due timeout
	at javax.swing.BasicSwingTestCase.runBare(BasicSwingTestCase.java:147)

Test: testMinimumLayoutSizeClass: javax.swing.ScrollPaneLayoutTestjunit.framework.AssertionFailedError: Test interrupted due timeout
	at javax.swing.BasicSwingTestCase.runBare(BasicSwingTestCase.java:147)

Test: testSizeRequirementsintintintfloatClass: javax.swing.SizeRequirementsTestjunit.framework.AssertionFailedError: Test interrupted due timeout
	at javax.swing.BasicSwingTestCase.runBare(BasicSwingTestCase.java:147)

Test: testSizeRequirementsfloatClass: javax.swing.SizeRequirementsTestjunit.framework.AssertionFailedError: Test interrupted due timeout
	at javax.swing.BasicSwingTestCase.runBare(BasicSwingTestCase.java:147)

Test: testSizeRequirementsClass: javax.swing.SizeRequirementsTestjunit.framework.AssertionFailedError: Test interrupted due timeout
	at javax.swing.BasicSwingTestCase.runBare(BasicSwingTestCase.java:147)

Test: testToStringClass: javax.swing.SizeRequirementsTestjunit.framework.AssertionFailedError: Test interrupted due timeout
	at javax.swing.BasicSwingTestCase.runBare(BasicSwingTestCase.java:147)

Test: testGetTiledSizeRequirementsClass: javax.swing.SizeRequirementsTestjunit.framework.AssertionFailedError: Test interrupted due timeout
	at javax.swing.BasicSwingTestCase.runBare(BasicSwingTestCase.java:147)

Test: testGetAlignedSizeRequirementsClass: javax.swing.SizeRequirementsTestjunit.framework.AssertionFailedError: Test interrupted due timeout
	at javax.swing.BasicSwingTestCase.runBare(BasicSwingTestCase.java:147)

Test: testCalculateTiledPositionsintSizeRequirementsSizeRequirementsArrayintArrayintArraybooleanClass: javax.swing.SizeRequirementsTestjunit.framework.AssertionFailedError: Test interrupted due timeout
	at javax.swing.BasicSwingTestCase.runBare(BasicSwingTestCase.java:147)

Test: testCalculateTiledPositionsintSizeRequirementsSizeRequirementsArrayintArrayintArrayClass: javax.swing.SizeRequirementsTestjunit.framework.AssertionFailedError: Test interrupted due timeout
	at javax.swing.BasicSwingTestCase.runBare(BasicSwingTestCase.java:147)

Test: testCalculateAlignedPositionsintSizeRequirementsSizeRequirementsArrayintArrayintArraybooleanClass: javax.swing.SizeRequirementsTestjunit.framework.AssertionFailedError: Test interrupted due timeout
	at javax.swing.BasicSwingTestCase.runBare(BasicSwingTestCase.java:147)

Test: testCalculateAlignedPositionsintSizeRequirementsSizeRequirementsArrayintArrayintArrayClass: javax.swing.SizeRequirementsTestjunit.framework.AssertionFailedError: Test interrupted due timeout
	at javax.swing.BasicSwingTestCase.runBare(BasicSwingTestCase.java:147)

Test: testAdjustSizesClass: javax.swing.SizeRequirementsTestjunit.framework.AssertionFailedError: Test interrupted due timeout
	at javax.swing.BasicSwingTestCase.runBare(BasicSwingTestCase.java:147)

Test: testWriteObjectClass: javax.swing.SizeRequirementsTestjunit.framework.AssertionFailedError: Test interrupted due timeout
	at javax.swing.BasicSwingTestCase.runBare(BasicSwingTestCase.java:147)

Test: testReadObjectClass: javax.swing.SizeRequirementsTestjunit.framework.AssertionFailedError: Test interrupted due timeout
	at javax.swing.BasicSwingTestCase.runBare(BasicSwingTestCase.java:147)

Test: testSizeSequenceClass: javax.swing.SizeSequenceTestjunit.framework.AssertionFailedError: Test interrupted due timeout
	at javax.swing.BasicSwingTestCase.runBare(BasicSwingTestCase.java:147)

Test: testGetIndexClass: javax.swing.SizeSequenceTestjunit.framework.AssertionFailedError: Test interrupted due timeout
	at javax.swing.BasicSwingTestCase.runBare(BasicSwingTestCase.java:147)

Test: testGetPositionClass: javax.swing.SizeSequenceTestjunit.framework.AssertionFailedError: Test interrupted due timeout
	at javax.swing.BasicSwingTestCase.runBare(BasicSwingTestCase.java:147)

Test: testGetSetSizeClass: javax.swing.SizeSequenceTestjunit.framework.AssertionFailedError: Test interrupted due timeout
	at javax.swing.BasicSwingTestCase.runBare(BasicSwingTestCase.java:147)

Test: testGetSetSizesClass: javax.swing.SizeSequenceTestjunit.framework.AssertionFailedError: Test interrupted due timeout
	at javax.swing.BasicSwingTestCase.runBare(BasicSwingTestCase.java:147)

Test: testInsertRemoveEntriesClass: javax.swing.SizeSequenceTestjunit.framework.AssertionFailedError: Test interrupted due timeout
	at javax.swing.BasicSwingTestCase.runBare(BasicSwingTestCase.java:147)

Test: testGetLocalNameClass: org.apache.harmony.logging.tests.java.util.logging.LevelTestjunit.framework.ComparisonFailure: expected:<Name> but was:<Level_error>
	at org.apache.harmony.logging.tests.java.util.logging.LevelTest.testGetLocalName(LevelTest.java:344)
	at java.lang.reflect.VMReflection.invokeMethod(Native Method)

Test: test_isCompatibleWithLjava_lang_StringClass: org.apache.harmony.luni.tests.java.lang.PackageTestjunit.framework.AssertionFailedError: '1.2.' version is illegal
	at org.apache.harmony.luni.tests.java.lang.PackageTest.test_isCompatibleWithLjava_lang_String(PackageTest.java:248)
	at java.lang.reflect.VMReflection.invokeMethod(Native Method)


***********************************************************
Modifications since last successful build:	(13)
            
modified gshimansky  /harmony/enhanced/drlvm/trunk/vm/vmcore/src/init/parse_arguments.cpp 01/31/2007 08:41:10 Applied HARMONY-2905 [drlvm][jvmti] java.lang.VerifyError is thrown for instrumented classTests passed on Ubuntu6 x86, Windows 2003 server x86 and SuSE9 x86_64
modified gshimansky  /harmony/enhanced/drlvm/trunk/vm/vmcore/src/verifier/Verifier.cpp 01/31/2007 08:41:10 Applied HARMONY-2905 [drlvm][jvmti] java.lang.VerifyError is thrown for instrumented classTests passed on Ubuntu6 x86, Windows 2003 server x86 and SuSE9 x86_64
modified gshimansky  /harmony/enhanced/drlvm/trunk/vm/vmcore/src/verifier/ver_utils.cpp 01/31/2007 08:41:10 Applied HARMONY-2905 [drlvm][jvmti] java.lang.VerifyError is thrown for instrumented classTests passed on Ubuntu6 x86, Windows 2003 server x86 and SuSE9 x86_64
modified gshimansky  /harmony/enhanced/drlvm/trunk/vm/vmcore/src/verifier/ver_dataflow.cpp 01/31/2007 08:41:10 Applied HARMONY-2905 [drlvm][jvmti] java.lang.VerifyError is thrown for instrumented classTests passed on Ubuntu6 x86, Windows 2003 server x86 and SuSE9 x86_64
modified varlax  /harmony/enhanced/drlvm/trunk/build/make/excludes/exclude.drlvm_smoke.linux.ia64.interpreter 01/31/2007 08:29:48 Applied HARMONY-3100 [drlvm][ipf][smoke tests] Cleanup of the smoke tests' excluded listDid not test
modified varlax  /harmony/enhanced/drlvm/trunk/vm/jitrino/src/codegenerator/ia32/Ia32IRManager.cpp 01/31/2007 07:54:34 Applied HARMONY-3063 [drlvm][jit] ArrayCopyRepMove does not work on EM64TTested on SUSE9@x64
modified varlax  /harmony/enhanced/drlvm/trunk/vm/jitrino/src/translator/java/JavaByteCodeTranslator.cpp 01/31/2007 07:54:34 Applied HARMONY-3063 [drlvm][jit] ArrayCopyRepMove does not work on EM64TTested on SUSE9@x64
modified varlax  /harmony/enhanced/drlvm/trunk/vm/jitrino/src/codegenerator/ia32/Ia32InstCodeSelector.cpp 01/31/2007 07:54:34 Applied HARMONY-3063 [drlvm][jit] ArrayCopyRepMove does not work on EM64TTested on SUSE9@x64
modified ayza  /harmony/enhanced/classlib/trunk/modules/logging/src/main/java/org/apache/harmony/logging/internal/nls/messages.properties 01/31/2007 07:48:05 Implementation of LogManager.getLoggingMXBean() was added - HARMONY-3075 ([classlib][logging] implementation of getLoggingMXBean)
modified ayza  /harmony/enhanced/classlib/trunk/modules/logging/src/main/java/java/util/logging/LogManager.java 01/31/2007 07:48:05 Implementation of LogManager.getLoggingMXBean() was added - HARMONY-3075 ([classlib][logging] implementation of getLoggingMXBean)
add cc-classlib log20070131073754Lbuild.32 01/31/2007 07:37:54classlib
add cc-drlvm log20070131072652Lbuild.47 01/31/2007 07:26:52drlvm
modified tellison  /harmony/enhanced/classlib/trunk/modules/jndi/src/test/java/org/apache/harmony/jndi/tests/javax/naming/spi/NamingManagerTest.java 01/31/2007 07:09:15 Fix JNDI test so it doesn't leave resource behind.


Mime
View raw message