harmony-alerts mailing list archives

Site index · List index
Message view « Date » · « Thread »
Top « Date » · « Thread »
From ge...@apache.org
Subject [build-test alert] BUILD FAILED lnx gcc debug: classlib over drlvm
Date Mon, 29 Jan 2007 18:26:42 GMT
BUILD FAILED:
	Ant Error Message:
/home/geir/dev/apache/harmony/enhanced/buildtest/trunk/cc/projects/classlib/trunk/build.xml:167:
The following error occurred while executing this line: /home/geir/dev/apache/harmony/enhanced/buildtest/trunk/cc/projects/classlib/trunk/make/build-test.xml:289:
Could not create task or type of type: replaceregexp.  Ant could not find the task or a class
this task relies upon.  This is common and has a number of causes; the usual  solutions are
to read the manual pages then download and install needed JAR files, or fix the build file:
  - You have misspelt 'replaceregexp'.    Fix: check your spelling.  - The task needs an external
JAR file to execute      and this is not found at the right place in the classpath.    Fix:
check the documentation for dependencies.    Fix: declare the task.  - The task is an Ant
optional task and the JAR file and/or libraries      implementing the functionality were not
found at the time you      yourself built your installation of Ant from the Ant
 sources.    Fix: Look in the ANT_HOME/lib for the 'ant-' JAR corresponding to the      task
and make sure it contains more than merely a META-INF/MANIFEST.MF.      If all it contains
is the manifest, then rebuild Ant with the needed      libraries present in /home/geir/dev/apache/harmony/enhanced/buildtest/trunk/cc/lib/optional/
, or alternatively,      download a pre-built release version from apache.org  - The build
file was written for a later version of Ant    Fix: upgrade to at least the latest release
version of Ant  - The task is not an Ant core or optional task       and needs to be declared
using <taskdef>.  - You are attempting to use a task defined using      <presetdef>
or <macrodef> but have spelt wrong or not     defined it at the point of use  Remember
that for JAR files to be visible to Ant tasks implemented in ANT_HOME/lib, the files must
be in the same directory or on the classpath  Please neither file bug reports on this problem,
nor email the Ant mailing 
 lists,
 until all of these causes have been explored, as this is not an Ant bug.

Date of build:	01/29/2007 13:01:15
Time to build:	25 minutes 4 seconds
Last changed:	01/29/2007 12:08:37
Last log entry:	Applying patch from HARMONY-2498 ([classlib][awt] java.awt.Tollkit.getImage(null)
throws NPE while RI doesn't)

***********************************************************
Errors/Warnings:	(201)
            
Tests FAILED

***********************************************************
Unit Tests: (18886)
        
error: test_set org.apache.harmony.awt.tests.nativebridge.PointerPointerTest
error: test_setAddress org.apache.harmony.awt.tests.nativebridge.PointerPointerTest
Unit Test Error Details:	(2)
                
Test: test_setClass: org.apache.harmony.awt.tests.nativebridge.PointerPointerTestjava.lang.IndexOutOfBoundsException:
Wrong number of elements to copy: 16
	at org.apache.harmony.awt.nativebridge.ByteBase.checkArraysBounds(ByteBase.java:1123)
	at org.apache.harmony.awt.nativebridge.ByteBase.get(ByteBase.java:172)
	at org.apache.harmony.awt.tests.nativebridge.PointerPointerTest.test_set(PointerPointerTest.java:55)
	at java.lang.reflect.VMReflection.invokeMethod(Native Method)

Test: test_setAddressClass: org.apache.harmony.awt.tests.nativebridge.PointerPointerTestjava.lang.IndexOutOfBoundsException:
Wrong number of elements to copy: 16
	at org.apache.harmony.awt.nativebridge.ByteBase.checkArraysBounds(ByteBase.java:1123)
	at org.apache.harmony.awt.nativebridge.ByteBase.get(ByteBase.java:172)
	at org.apache.harmony.awt.tests.nativebridge.PointerPointerTest.test_setAddress(PointerPointerTest.java:66)
	at java.lang.reflect.VMReflection.invokeMethod(Native Method)


***********************************************************
Modifications since last successful build:	(9)
            
modified ayza  /harmony/enhanced/classlib/trunk/modules/awt/src/main/java/common/java/awt/ToolkitImpl.java
01/29/2007 12:08:37 Applying patch from HARMONY-2498 ([classlib][awt] java.awt.Tollkit.getImage(null)
throws NPE while RI doesn't)
added ayza  /harmony/enhanced/classlib/trunk/modules/awt/src/test/api/java/common/java/awt/ToolkitTest.java
01/29/2007 12:08:37 Applying patch from HARMONY-2498 ([classlib][awt] java.awt.Tollkit.getImage(null)
throws NPE while RI doesn't)
add cc-drlvm log20070129115920Lbuild.24 01/29/2007 11:59:20drlvm
add cc-classlib log20070129114639Lbuild.17 01/29/2007 11:46:39classlib
modified tellison  /harmony/enhanced/classlib/trunk/modules/luni/src/main/java/java/net/JarURLConnection.java
01/29/2007 11:42:23 Apply patch HARMONY-3053 ([classlib][luni]JarURLConnection.getEntryName()
returns incorrect value)
modified tellison  /harmony/enhanced/classlib/trunk/modules/luni/src/test/java/tests/api/java/net/JarURLConnectionTest.java
01/29/2007 11:42:23 Apply patch HARMONY-3053 ([classlib][luni]JarURLConnection.getEntryName()
returns incorrect value)
modified tellison  /harmony/enhanced/classlib/trunk/modules/logging/src/main/java/java/util/logging/SimpleFormatter.java
01/29/2007 11:33:25 Apply patch HARMONY-2414 ([classlib][logging]Compatibility: message format
of java.util.logging.Logger.log() on Harmony diffes from RI message)
modified tellison  /harmony/enhanced/classlib/trunk/modules/instrument/src/main/native/instrument/shared/instrument.c
01/29/2007 11:30:02 Apply patch HARMONY-3008 ([classlib][instrument]Releases byte array too
early in the native code of redefine classes)
modified tellison  /harmony/enhanced/classlib/trunk/modules/luni/src/test/java/tests/api/java/util/TimerTaskTest.java
01/29/2007 11:25:37 Apply patch HARMONY-3036 ([classlib][luni]tests.api.java.util.TimerTaskTest
has unstable tests in test_cancel() and test_run())


Mime
View raw message