harmony-alerts mailing list archives

Site index · List index
Message view « Date » · « Thread »
Top « Date » · « Thread »
From ge...@apache.org
Subject [build-test alert] BUILD FAILED lnx gcc debug: classlib over drlvm
Date Mon, 29 Jan 2007 13:08:30 GMT
BUILD FAILED:
	Ant Error Message:
/home/geir/dev/apache/harmony/enhanced/buildtest/trunk/cc/projects/classlib/trunk/build.xml:167:
The following error occurred while executing this line: /home/geir/dev/apache/harmony/enhanced/buildtest/trunk/cc/projects/classlib/trunk/make/build-test.xml:139:
There were test failures.

Date of build:	01/29/2007 07:26:20
Time to build:	40 minutes 55 seconds
Last changed:	01/29/2007 06:56:35
Last log entry:	Applied HARMONY-3071 [drlvm][classloader] Elimination of warning message during
compilation

The compilation warning is gone now.



***********************************************************
Errors/Warnings:	(206)
            
Tests FAILED

***********************************************************
Unit Tests: (18951)
        
failure: testStop javax.swing.Timer_MultithreadedTest
failure: testCorrectVersionOfSegment org.apache.harmony.pack200.tests.ClassVersionTest
Unit Test Error Details:	(2)
                
Test: testStopClass: javax.swing.Timer_MultithreadedTestjunit.framework.AssertionFailedError:
ActionListener's ActionPerformed didn't invoke 
	at javax.swing.Timer_MultithreadedTest.testStop(Timer_MultithreadedTest.java:307)
	at java.lang.reflect.VMReflection.invokeMethod(Native Method)

Test: testCorrectVersionOfSegmentClass: org.apache.harmony.pack200.tests.ClassVersionTestjunit.framework.AssertionFailedError:
Class file has been compiled with Java 1.5 compatibility instead of 1.4 or lower
	at org.apache.harmony.pack200.tests.ClassVersionTest.testCorrectVersionOfSegment(ClassVersionTest.java:36)
	at java.lang.reflect.VMReflection.invokeMethod(Native Method)


***********************************************************
Modifications since last successful build:	(3)
            
modified gshimansky  /harmony/enhanced/drlvm/trunk/vm/vmcore/src/class_support/Class_File_Loader.cpp
01/29/2007 06:56:35 Applied HARMONY-3071 [drlvm][classloader] Elimination of warning message
during compilationThe compilation warning is gone now.
add cc-drlvm log20070129062441Lbuild.21 01/29/2007 06:24:41drlvm
add cc-classlib log20070129061159Lbuild.15 01/29/2007 06:11:59classlib


Mime
View raw message