harmony-alerts mailing list archives: December 2006

Site index · List index
Message listThread · Author · Date
Geir Magnusson Jr test Wed, 20 Dec, 16:16
nom...@hursley.ibm.com [continuum] BUILD ERROR: Classlib/linux.ia32 Build/Test Thu, 21 Dec, 00:00
nom...@intel.com [build-test alert] BUILD FAILED Linux SUSE 9 64bit gcc debug: classlib over drlvm Thu, 21 Dec, 07:25
nom...@hursley.ibm.com [continuum] BUILD FAILURE: Classlib/linux.ia32 Build/Test Thu, 21 Dec, 08:16
nom...@hursley.ibm.com [continuum] BUILD SUCCESSFUL: Classlib/linux.ia32 Build/Test Thu, 21 Dec, 10:30
nom...@intel.com [build-test alert] BUILD FAILED Windows XP msvc debug: classlib EHWA Thu, 21 Dec, 11:02
nom...@hursley.ibm.com [continuum] BUILD FAILURE: Classlib/linux.ia32 Build/Test Thu, 21 Dec, 12:15
nom...@intel.com [build-test alert] BUILD SUCCEEDED Linux SUSE 9 64bit gcc debug: classlib over drlvm Thu, 21 Dec, 12:27
nom...@intel.com [build-test alert] BUILD FAILED Linux SUSE 9 gcc debug: classlib over ibmvm Thu, 21 Dec, 13:23
nom...@hursley.ibm.com [continuum] BUILD FAILURE: Classlib/linux.ia32 Build/Test Thu, 21 Dec, 14:21
nom...@hursley.ibm.com [continuum] BUILD FAILURE: Classlib/linux.ia32 Build/Test Thu, 21 Dec, 16:14
Tim Ellison Re: [continuum] BUILD FAILURE: Classlib/linux.ia32 Build/Test Thu, 21 Dec, 21:41
nom...@hursley.ibm.com [continuum] BUILD FAILURE: Classlib/linux.ia32 Build/Test Thu, 21 Dec, 23:15
nom...@hursley.ibm.com [continuum] BUILD ERROR: Classlib/linux.ia32 Build/Test Fri, 22 Dec, 00:00
Alexey Petrenko Re: [continuum] BUILD FAILURE: Classlib/linux.ia32 Build/Test Fri, 22 Dec, 05:08
Ivanov, Vladimir A RE: [continuum] BUILD FAILURE: Classlib/linux.ia32 Build/Test Fri, 22 Dec, 05:29
nom...@hursley.ibm.com [continuum] BUILD SUCCESSFUL: Classlib/linux.ia32 Build/Test Fri, 22 Dec, 10:14
nom...@intel.com [build-test alert] BUILD FAILED Linux SUSE 9 gcc debug: drlvm Fri, 22 Dec, 12:21
nom...@intel.com [build-test alert] BUILD FAILED Windows XP SP2 msvc debug: drlvm tests Fri, 22 Dec, 12:24
Ivanov, Vladimir A RE: [build-test alert] BUILD FAILED Windows XP SP2 msvc debug: drlvm tests Fri, 22 Dec, 12:34
nom...@hursley.ibm.com [continuum] BUILD FAILURE: Classlib/linux.ia32 Build/Test Fri, 22 Dec, 17:02
nom...@intel.com [build-test alert] BUILD FAILED Linux SUSE 9 64bit gcc debug: classlib Fri, 22 Dec, 19:12
nom...@intel.com [build-test alert] BUILD FAILED Linux SUSE 9 64bit gcc debug: drlvm tests Fri, 22 Dec, 19:31
nom...@intel.com [build-test alert] BUILD FAILED Linux SUSE 9 64bit gcc debug: drlvm Fri, 22 Dec, 19:34
nom...@intel.com [build-test alert] BUILD FAILED Linux SUSE 9 64bit gcc debug: classlib over drlvm Fri, 22 Dec, 19:34
nom...@intel.com [build-test alert] BUILD SUCCEEDED Linux SUSE 9 64bit gcc debug: classlib Fri, 22 Dec, 19:42
nom...@intel.com [build-test alert] BUILD SUCCEEDED Linux SUSE 9 64bit gcc debug: drlvm Fri, 22 Dec, 19:51
nom...@intel.com [build-test alert] BUILD FAILED Windows XP SP2 msvc debug: classlib Fri, 22 Dec, 20:21
nom...@intel.com [build-test alert] BUILD FAILED Windows XP SP2 msvc debug: drlvm Fri, 22 Dec, 20:23
nom...@intel.com [build-test alert] BUILD FAILED Windows XP SP2 msvc debug: classlib over drlvm Fri, 22 Dec, 20:24
nom...@intel.com [build-test alert] BUILD SUCCEEDED Windows XP SP2 msvc debug: classlib Fri, 22 Dec, 20:41
nom...@intel.com [build-test alert] BUILD SUCCEEDED Windows XP SP2 msvc debug: drlvm Fri, 22 Dec, 20:51
nom...@intel.com [build-test alert] BUILD FAILED Linux SUSE 9 gcc debug: drlvm Fri, 22 Dec, 21:39
nom...@intel.com [build-test alert] BUILD FAILED Linux SUSE 9 gcc debug: classlib over drlvm Fri, 22 Dec, 21:40
nom...@intel.com [build-test alert] BUILD SUCCEEDED Windows XP SP2 msvc debug: drlvm tests Fri, 22 Dec, 21:46
nom...@intel.com [build-test alert] BUILD SUCCEEDED Linux SUSE 9 64bit gcc debug: drlvm tests Fri, 22 Dec, 21:54
nom...@intel.com [build-test alert] BUILD SUCCEEDED Windows XP SP2 msvc debug: classlib over drlvm Fri, 22 Dec, 22:21
nom...@intel.com [build-test alert] BUILD SUCCEEDED Linux SUSE 9 gcc debug: classlib over ibmvm Fri, 22 Dec, 22:30
nom...@intel.com [build-test alert] BUILD SUCCEEDED Linux SUSE 9 gcc debug: drlvm Fri, 22 Dec, 22:42
nom...@intel.com [build-test alert] BUILD SUCCEEDED Linux SUSE 9 64bit gcc debug: classlib over drlvm Fri, 22 Dec, 23:31
nom...@hursley.ibm.com [continuum] BUILD FAILURE: Classlib/linux.ia32 Build/Test Sat, 23 Dec, 00:07
nom...@intel.com [build-test alert] BUILD FAILED win XP IA32 msvc debug: classlib tests iterative Sat, 23 Dec, 04:14
nom...@hursley.ibm.com [continuum] BUILD FAILURE: Classlib/linux.ia32 Build/Test Sat, 23 Dec, 16:11
nom...@intel.com [build-test alert] BUILD FAILED Linux SUSE 9 64bit gcc debug: classlib over drlvm Sat, 23 Dec, 21:59
nom...@hursley.ibm.com [continuum] BUILD FAILURE: Classlib/linux.ia32 Build/Test Sat, 23 Dec, 22:09
nom...@intel.com [build-test alert] BUILD SUCCEEDED Linux SUSE 9 64bit gcc debug: classlib over drlvm Sun, 24 Dec, 00:06
nom...@hursley.ibm.com [continuum] BUILD FAILURE: Classlib/linux.ia32 Build/Test Sun, 24 Dec, 00:10
nom...@intel.com [build-test alert] BUILD FAILED win XP IA32 msvc debug: classlib tests iterative Sun, 24 Dec, 00:22
nom...@intel.com [build-test alert] BUILD FAILED Windows XP SP2 msvc debug: classlib over drlvm Sun, 24 Dec, 01:03
nom...@hursley.ibm.com [continuum] BUILD SUCCESSFUL: Classlib/linux.ia32 Build/Test Sun, 24 Dec, 02:09
nom...@intel.com [build-test alert] BUILD SUCCEEDED Windows XP SP2 msvc debug: classlib over drlvm Sun, 24 Dec, 03:02
nom...@hursley.ibm.com [continuum] BUILD FAILURE: Classlib/linux.ia32 Build/Test Sun, 24 Dec, 07:09
nom...@intel.com [build-test alert] BUILD FAILED Linux SUSE 9 64bit gcc debug: classlib over drlvm Sun, 24 Dec, 07:17
nom...@hursley.ibm.com [continuum] BUILD SUCCESSFUL: Classlib/linux.ia32 Build/Test Sun, 24 Dec, 09:03
nom...@intel.com [build-test alert] BUILD SUCCEEDED Linux SUSE 9 64bit gcc debug: classlib over drlvm Sun, 24 Dec, 09:42
nom...@intel.com [build-test alert] BUILD FAILED win XP IA32 msvc debug: classlib tests iterative Sun, 24 Dec, 20:45
Doubtsova, Tatyana V RE: [build-test alert] BUILD HANGED Linux SUSE 9 gcc debug: drlvm Mon, 25 Dec, 08:52
nom...@hursley.ibm.com [continuum] BUILD FAILURE: Classlib/linux.ia32 Build/Test Mon, 25 Dec, 09:10
nom...@intel.com [build-test alert] BUILD SUCCEEDED Linux SUSE 9 gcc debug: drlvm Mon, 25 Dec, 09:47
nom...@intel.com [build-test alert] BUILD SUCCEEDED Linux SUSE 9 gcc debug: classlib over drlvm Mon, 25 Dec, 10:24
nom...@intel.com [build-test alert] BUILD FIXED SUSEL9 IA32 gcc debug: classlib tests iterative Mon, 25 Dec, 14:58
nom...@intel.com [build-test alert] BUILD FAILED win XP IA32 msvc debug: classlib tests iterative Mon, 25 Dec, 17:16
nom...@hursley.ibm.com [continuum] BUILD ERROR: Classlib/linux.ia32 Build/Test Tue, 26 Dec, 00:00
nom...@intel.com [build-test alert] BUILD FAILED win XP IA32 msvc debug: classlib tests iterative Tue, 26 Dec, 13:58
nom...@hursley.ibm.com [continuum] BUILD SUCCESSFUL: Classlib/linux.ia32 Build/Test Tue, 26 Dec, 15:11
nom...@intel.com [build-test alert] BUILD FIXED SUSEL9 IA32 gcc debug: classlib tests iterative Tue, 26 Dec, 15:31
nom...@intel.com [build-test alert] BUILD SUCCEEDED Windows XP msvc debug: classlib EHWA Tue, 26 Dec, 16:23
nom...@hursley.ibm.com [continuum] BUILD ERROR: Classlib/linux.ia32 Build/Test Wed, 27 Dec, 00:00
Geir Magnusson Jr. test - please ignore Wed, 27 Dec, 01:12
nom...@hursley.ibm.com [continuum] BUILD SUCCESSFUL: Classlib/linux.ia32 Build/Test Wed, 27 Dec, 08:10
nom...@intel.com [build-test alert] BUILD FAILED win XP IA32 msvc debug: classlib tests iterative Wed, 27 Dec, 11:10
nom...@intel.com [build-test alert] BUILD FAILED Linux SUSE 9 64bit gcc debug: classlib over drlvm Wed, 27 Dec, 16:02
nom...@intel.com [build-test alert] BUILD FAILED SUSEL9 IA32 gcc debug: classlib tests iterative Wed, 27 Dec, 16:11
nom...@intel.com [build-test alert] BUILD SUCCEEDED Linux SUSE 9 64bit gcc debug: classlib over drlvm Wed, 27 Dec, 18:20
nom...@hursley.ibm.com [continuum] BUILD ERROR: Classlib/linux.ia32 Build/Test Thu, 28 Dec, 00:00
nom...@intel.com [build-test alert] BUILD FIXED win XP IA32 msvc debug: classlib tests iterative Thu, 28 Dec, 08:12
nom...@hursley.ibm.com [continuum] BUILD SUCCESSFUL: Classlib/linux.ia32 Build/Test Thu, 28 Dec, 15:10
nom...@intel.com [build-test alert] BUILD FAILED Linux SUSE 9 gcc debug: classlib over drlvm Thu, 28 Dec, 16:36
nom...@intel.com [build-test alert] BUILD FAILED SUSEL9 IA32 gcc debug: classlib tests iterative Thu, 28 Dec, 16:56
nom...@intel.com [build-test alert] BUILD FAILED Linux SUSE 9 64bit gcc debug: classlib over drlvm Thu, 28 Dec, 19:47
nom...@intel.com [build-test alert] BUILD SUCCEEDED Linux SUSE 9 64bit gcc debug: classlib over drlvm Thu, 28 Dec, 22:01
nom...@hursley.ibm.com [continuum] BUILD ERROR: Classlib/linux.ia32 Build/Test Fri, 29 Dec, 00:00
nom...@intel.com [build-test alert] BUILD FAILED Linux SUSE 9 64bit gcc debug: classlib over drlvm Fri, 29 Dec, 00:11
nom...@intel.com [build-test alert] BUILD SUCCEEDED Linux SUSE 9 64bit gcc debug: classlib over drlvm Fri, 29 Dec, 02:21
Doubtsova, Tatyana V RE: [build-test alert] BUILD FAILED Linux SUSE 9 64bit gcc debug: classlib over drlvm Fri, 29 Dec, 05:07
nom...@intel.com [build-test alert] BUILD FAILED win XP IA32 msvc debug: classlib tests iterative Fri, 29 Dec, 05:25
nom...@hursley.ibm.com [continuum] BUILD SUCCESSFUL: Classlib/linux.ia32 Build/Test Fri, 29 Dec, 12:10
nom...@intel.com [build-test alert] BUILD FAILED win XP IA32 msvc debug: classlib tests iterative Sat, 30 Dec, 02:42
nom...@hursley.ibm.com [continuum] BUILD ERROR: Classlib/linux.ia32 Build/Test Sun, 31 Dec, 00:00
nom...@intel.com [build-test alert] BUILD FAILED win XP IA32 msvc debug: classlib tests iterative Sun, 31 Dec, 00:10
nom...@intel.com [build-test alert] BUILD FAILED win XP IA32 msvc debug: classlib tests iterative Sun, 31 Dec, 20:51
nom...@hursley.ibm.com [continuum] BUILD ERROR: Classlib/linux.ia32 Build/Test Mon, 01 Jan, 00:00
Message listThread · Author · Date
Box list
Jul 20113
Dec 201029
Nov 20106
Oct 201046
Sep 201035
Aug 201017
Jul 201029
Jun 201041
May 201020
Apr 201040
Mar 2010102
Feb 201043
Jan 201014
Dec 200911
Nov 20099
Oct 200912
Sep 20093
Aug 200915
Jul 200959
Jun 200916
May 200930
Apr 200960
Mar 200919
Feb 200945
Jan 200957
Dec 200827
Nov 200815
Oct 200824
Sep 200854
Aug 200834
Jul 200841
Jun 200899
May 200862
Apr 2008113
Mar 2008133
Feb 2008164
Jan 2008291
Dec 2007335
Nov 2007454
Oct 2007405
Sep 2007259
Aug 2007368
Jul 2007618
Jun 2007607
May 2007672
Apr 2007455
Mar 20071104
Feb 2007389
Jan 2007418
Dec 200692