harmony-alerts mailing list archives

Site index · List index
Message view « Date » · « Thread »
Top « Date » · « Thread »
From "Ivanov, Vladimir A" <vladimir.a.iva...@intel.com>
Subject RE: [build-test alert] BUILD FAILED Windows XP SP2 msvc debug: drlvm tests
Date Fri, 22 Dec 2006 12:34:58 GMT
DRLVM build is failed to build report for kernel tests run:
--------------------------------------

     [exec]     [junit] Tests run: 6, Failures: 0, Errors: 0, Time
elapsed: 12.315 sec
     [exec]     [junit] Tests run: 8, Failures: 0, Errors: 0, Time
elapsed: 159.502 sec
     [exec]     [junit] Tests run: 6, Failures: 0, Errors: 0, Time
elapsed: 4.366 sec
     [exec]     [junit] Tests run: 1, Failures: 0, Errors: 0, Time
elapsed: 2.424 sec

     [exec] report-kernel-test:
     [exec]       [for] jet: The following error occurred while
executing this line:
     [exec]       [for]
/export/viv/trunk/cc/projects/drlvm/trunk/build/lnx_ia32_gcc_debug/semis
/build/targets/kernel.test.xml:31:
/export/viv/trunk/cc/projects/drlvm/trunk/build/lnx_ia32_gcc_debug/semis
/kernel.tests/reports/jet.mode not found.
     [exec]       [for] opt: The following error occurred while
executing this line:
     [exec]       [for]
/export/viv/trunk/cc/projects/drlvm/trunk/build/lnx_ia32_gcc_debug/semis
/build/targets/kernel.test.xml:31:
/export/viv/trunk/cc/projects/drlvm/trunk/build/lnx_ia32_gcc_debug/semis
/kernel.tests/reports/opt.mode not found.
     [exec]       [for] int: The following error occurred while
executing this line:
     [exec]       [for]
/export/viv/trunk/cc/projects/drlvm/trunk/build/lnx_ia32_gcc_debug/semis
/build/targets/kernel.test.xml:31:
/export/viv/trunk/cc/projects/drlvm/trunk/build/lnx_ia32_gcc_debug/semis
/kernel.tests/reports/int.mode not found.

     [exec] BUILD FAILED
     [exec]
/export/viv/trunk/cc/projects/drlvm/trunk/build/make/build.xml:379: The
following error occurred while executing this line:
     [exec]
/export/viv/trunk/cc/projects/drlvm/trunk/build/make/build_component.xml
:72: The following error occurred while executing this line:
     [exec]
/export/viv/trunk/cc/projects/drlvm/trunk/build/lnx_ia32_gcc_debug/semis
/build/targets/kernel.test.xml:29: Keepgoing execution: 3 of 3
iterations failed.

     [exec] Total time: 62 minutes 8 seconds

 Thanks,
  Vladimir Ivanov


-----Original Message-----
From: nomail@intel.com [mailto:nomail@intel.com] 
Sent: Friday, December 22, 2006 6:24 PM
To: alerts@harmony.apache.org
Subject: [build-test alert] BUILD FAILED Windows XP SP2 msvc debug:
drlvm tests

BUILD FAILED:
	Ant Error Message:
error string found

Date of build:	12/22/2006 17:26:43
Time to build:	57 minute(s) 15 second(s)
Last changed:	12/22/2006 16:19:45
Last log entry:	drlvm

***********************************************************
Errors/Warnings:(1)
            

***********************************************************
Unit Tests: (0)
        
No Tests Run: This project doesn't have any tests

***********************************************************
Modifications since last successful build:	(4)
            
add cc-drlvm log20061222161945Lbuild.19 12/22/2006 16:19:45drlvm
modified smishura
/harmony/enhanced/drlvm/trunk/build/make/targets/smoke.test.xml
12/22/2006 16:02:06 Apply modified patch for
HARMONY-2694[drlvm][testing] the html report for the smoke.test was
added
modified mloenko
/harmony/enhanced/drlvm/trunk/vm/vmcore/src/util/em64t/base/ini_em64t.cp
p 12/22/2006 15:26:42 applied patch for HARMONY-2834[drlvm] ZipEntryTest
failes due to incorrect args transition
modified mloenko
/harmony/enhanced/classlib/trunk/modules/archive/make/exclude.linux.x86_
64.drl 12/22/2006 15:26:42 applied patch for HARMONY-2834[drlvm]
ZipEntryTest failes due to incorrect args transition

Mime
View raw message