hama-dev mailing list archives

Site index · List index
Message view « Date » · « Thread »
Top « Date » · « Thread »
From Apache Jenkins Server <jenk...@builds.apache.org>
Subject Build failed in Jenkins: Hama-Nightly-for-Hadoop-1.x #1736
Date Sun, 25 Feb 2018 00:22:48 GMT
See <https://builds.apache.org/job/Hama-Nightly-for-Hadoop-1.x/1736/display/redirect>

------------------------------------------
[...truncated 4.93 MB...]

18/02/25 00:22:19 INFO server.ZooKeeperServer: shutting down

18/02/25 00:22:19 INFO ipc.Server: IPC Server handler 1 on 44640: exiting

18/02/25 00:22:19 INFO server.SessionTrackerImpl: Shutting down

18/02/25 00:22:19 INFO server.PrepRequestProcessor: Shutting down

18/02/25 00:22:19 INFO server.SyncRequestProcessor: Shutting down

18/02/25 00:22:19 INFO server.PrepRequestProcessor: PrepRequestProcessor exited loop!

18/02/25 00:22:19 INFO server.SyncRequestProcessor: SyncRequestProcessor exited!

18/02/25 00:22:19 INFO server.FinalRequestProcessor: shutdown of request processor complete

Tests run: 1, Failures: 0, Errors: 0, Skipped: 0, Time elapsed: 0.017 sec
Forking command line: /bin/sh -c cd <https://builds.apache.org/job/Hama-Nightly-for-Hadoop-1.x/ws/core>
&& /usr/local/asfpackages/java/jdk1.8.0_152/jre/bin/java -jar /tmp/surefirebooter8230904803785110066.jar
/tmp/surefire8767636533912130912tmp /tmp/surefire9157337785176442601tmp
Running org.apache.hama.bsp.TestCheckpoint
18/02/25 00:22:20 INFO bsp.TestCheckpoint: Got port = 12502

18/02/25 00:22:21 INFO bsp.TestCheckpoint: Created bsp peer and other parameters

18/02/25 00:22:21 INFO bsp.TestCheckpoint: SyncClient Storing value step = 1 count = 0 for
key job_checkpttest_0001/checkpoint/1/

18/02/25 00:22:21 INFO ft.AsyncRcvdMsgCheckpointImpl: Enabled = true checkPointInterval =
1 lastCheckPointStep = 1 getSuperstepCount() = 1

18/02/25 00:22:21 INFO ft.AsyncRcvdMsgCheckpointImpl: checkpointNext = true checkpointMessageCount
= 0

18/02/25 00:22:21 INFO bsp.TestCheckpoint: After barrier 1

18/02/25 00:22:21 INFO bsp.TestCheckpoint: Completed first sync.

18/02/25 00:22:21 INFO bsp.TestCheckpoint: Getting value for key job_checkpttest_0001/checkpoint/1/

18/02/25 00:22:21 INFO ft.AsyncRcvdMsgCheckpointImpl: Creating path checkpoint/job_checkpttest_0001/2/1

18/02/25 00:22:21 WARN util.NativeCodeLoader: Unable to load native-hadoop library for your
platform... using builtin-java classes where applicable

18/02/25 00:22:21 INFO bsp.TestCheckpoint: SyncClient Storing value step = 2 count = 1 for
key job_checkpttest_0001/checkpoint/1/

18/02/25 00:22:21 INFO ft.AsyncRcvdMsgCheckpointImpl: Enabled = true checkPointInterval =
1 lastCheckPointStep = 2 getSuperstepCount() = 2

18/02/25 00:22:21 INFO ft.AsyncRcvdMsgCheckpointImpl: checkpointNext = true checkpointMessageCount
= 0

18/02/25 00:22:21 INFO bsp.TestCheckpoint: After barrier 2

18/02/25 00:22:21 INFO bsp.TestCheckpoint: Completed second sync.

18/02/25 00:22:21 INFO bsp.TestCheckpoint: Getting value for key job_checkpttest_0001/checkpoint/1/

18/02/25 00:22:21 INFO bsp.TestCheckpoint: Got port = 12502

18/02/25 00:22:21 INFO bsp.TestCheckpoint: SyncClient Storing value step = 3 count = 5 for
key job_checkpttest_0001/checkpoint/1/

18/02/25 00:22:21 INFO bsp.TestCheckpoint: Getting value for key job_checkpttest_0001/checkpoint/1/

18/02/25 00:22:21 INFO bsp.TestCheckpoint: Created bsp peer and other parameters

18/02/25 00:22:21 INFO bsp.TestCheckpoint: Got port = 12502

18/02/25 00:22:21 INFO bsp.TestCheckpoint: Getting value for key job_checkpttest_0001/checkpoint/1/

18/02/25 00:22:21 INFO bsp.TestCheckpoint: SyncClient Storing value step = 1 count = 0 for
key job_checkpttest_0001/checkpoint/1/

18/02/25 00:22:21 INFO ft.AsyncRcvdMsgCheckpointImpl: Enabled = true checkPointInterval =
2 lastCheckPointStep = 1 getSuperstepCount() = 1

18/02/25 00:22:21 INFO ft.AsyncRcvdMsgCheckpointImpl: checkpointNext = false checkpointMessageCount
= 0

18/02/25 00:22:21 INFO bsp.TestCheckpoint: After barrier 1

18/02/25 00:22:21 INFO bsp.TestCheckpoint: Getting value for key job_checkpttest_0001/checkpoint/1/

18/02/25 00:22:21 INFO ft.AsyncRcvdMsgCheckpointImpl: Enabled = true checkPointInterval =
2 lastCheckPointStep = 1 getSuperstepCount() = 2

18/02/25 00:22:21 INFO ft.AsyncRcvdMsgCheckpointImpl: checkpointNext = true checkpointMessageCount
= 0

18/02/25 00:22:21 INFO bsp.TestCheckpoint: After barrier 2

18/02/25 00:22:21 INFO bsp.TestCheckpoint: Getting value for key job_checkpttest_0001/checkpoint/1/

18/02/25 00:22:21 INFO ft.AsyncRcvdMsgCheckpointImpl: Creating path checkpoint/job_checkpttest_0001/3/1

18/02/25 00:22:21 INFO bsp.TestCheckpoint: SyncClient Storing value step = 3 count = 1 for
key job_checkpttest_0001/checkpoint/1/

18/02/25 00:22:21 INFO ft.AsyncRcvdMsgCheckpointImpl: Enabled = true checkPointInterval =
2 lastCheckPointStep = 3 getSuperstepCount() = 3

18/02/25 00:22:21 INFO ft.AsyncRcvdMsgCheckpointImpl: checkpointNext = false checkpointMessageCount
= 0

18/02/25 00:22:21 INFO bsp.TestCheckpoint: After barrier 3

18/02/25 00:22:21 INFO bsp.TestCheckpoint: Getting value for key job_checkpttest_0001/checkpoint/1/

18/02/25 00:22:21 INFO ft.AsyncRcvdMsgCheckpointImpl: Enabled = true checkPointInterval =
2 lastCheckPointStep = 3 getSuperstepCount() = 4

18/02/25 00:22:21 INFO ft.AsyncRcvdMsgCheckpointImpl: checkpointNext = true checkpointMessageCount
= 0

18/02/25 00:22:21 INFO bsp.TestCheckpoint: After barrier 4

18/02/25 00:22:21 INFO bsp.TestCheckpoint: Getting value for key job_checkpttest_0001/checkpoint/1/

18/02/25 00:22:21 INFO ft.AsyncRcvdMsgCheckpointImpl: Creating path checkpoint/job_checkpttest_0001/5/1

18/02/25 00:22:21 INFO bsp.TestCheckpoint: SyncClient Storing value step = 5 count = 2 for
key job_checkpttest_0001/checkpoint/1/

18/02/25 00:22:21 INFO ft.AsyncRcvdMsgCheckpointImpl: Enabled = true checkPointInterval =
2 lastCheckPointStep = 5 getSuperstepCount() = 5

18/02/25 00:22:21 INFO ft.AsyncRcvdMsgCheckpointImpl: checkpointNext = false checkpointMessageCount
= 0

18/02/25 00:22:21 INFO bsp.TestCheckpoint: After barrier 5

18/02/25 00:22:21 INFO bsp.TestCheckpoint: Getting value for key job_checkpttest_0001/checkpoint/1/

18/02/25 00:22:21 INFO ft.AsyncRcvdMsgCheckpointImpl: Enabled = true checkPointInterval =
2 lastCheckPointStep = 5 getSuperstepCount() = 6

18/02/25 00:22:21 INFO ft.AsyncRcvdMsgCheckpointImpl: checkpointNext = true checkpointMessageCount
= 0

18/02/25 00:22:21 INFO bsp.TestCheckpoint: After barrier 6

18/02/25 00:22:21 INFO bsp.TestCheckpoint: Getting value for key job_checkpttest_0001/checkpoint/1/

Tests run: 3, Failures: 0, Errors: 0, Skipped: 0, Time elapsed: 0.019 sec
Forking command line: /bin/sh -c cd <https://builds.apache.org/job/Hama-Nightly-for-Hadoop-1.x/ws/core>
&& /usr/local/asfpackages/java/jdk1.8.0_152/jre/bin/java -jar /tmp/surefirebooter4884487743231497964.jar
/tmp/surefire8817537895519593998tmp /tmp/surefire2600870540965981778tmp
Running org.apache.hama.bsp.TestLocalRunner
18/02/25 00:22:22 WARN util.NativeCodeLoader: Unable to load native-hadoop library for your
platform... using builtin-java classes where applicable

18/02/25 00:22:22 WARN bsp.BSPJobClient: No job jar file set.  User classes may not be found.
See BSPJob#setJar(String) or check Your jar file.

18/02/25 00:22:23 INFO bsp.BSPJobClient: Running job: job_localrunner_0001

18/02/25 00:22:23 INFO bsp.LocalBSPRunner: Setting up a new barrier for 3 tasks!

18/02/25 00:22:26 INFO bsp.BSPJobClient: Current supersteps number: 14

18/02/25 00:22:26 INFO bsp.BSPJobClient: The total number of supersteps: 14

18/02/25 00:22:26 INFO bsp.BSPJobClient: Counters: 7

18/02/25 00:22:26 INFO bsp.BSPJobClient:   org.apache.hama.bsp.BSPPeerImpl$PeerCounter

18/02/25 00:22:26 INFO bsp.BSPJobClient:     TIME_IN_SYNC_MS=27

18/02/25 00:22:26 INFO bsp.BSPJobClient:     TASK_OUTPUT_RECORDS=135

18/02/25 00:22:26 INFO bsp.BSPJobClient:     SUPERSTEP_SUM=45

18/02/25 00:22:26 INFO bsp.BSPJobClient:     TOTAL_MESSAGES_SENT=135

18/02/25 00:22:26 INFO bsp.BSPJobClient:     TOTAL_MESSAGES_RECEIVED=135

18/02/25 00:22:26 INFO bsp.BSPJobClient:   org.apache.hama.bsp.JobInProgress$JobCounter

18/02/25 00:22:26 INFO bsp.BSPJobClient:     LAUNCHED_TASKS=3

18/02/25 00:22:26 INFO bsp.BSPJobClient:     SUPERSTEPS=14

Tests run: 1, Failures: 0, Errors: 0, Skipped: 0, Time elapsed: 0.013 sec

Results :

Failed tests: 

Tests run: 58, Failures: 1, Errors: 0, Skipped: 0

[INFO] ------------------------------------------------------------------------
[INFO] Reactor Summary:
[INFO] 
[INFO] Apache Hama parent POM ............................. SUCCESS [  4.541 s]
[INFO] pipes .............................................. SUCCESS [ 19.376 s]
[INFO] commons ............................................ SUCCESS [ 10.936 s]
[INFO] core ............................................... FAILURE [03:43 min]
[INFO] graph .............................................. SKIPPED
[INFO] machine learning ................................... SKIPPED
[INFO] examples ........................................... SKIPPED
[INFO] mesos .............................................. SKIPPED
[INFO] hama-dist .......................................... SKIPPED
[INFO] ------------------------------------------------------------------------
[INFO] BUILD FAILURE
[INFO] ------------------------------------------------------------------------
[INFO] Total time: 04:18 min
[INFO] Finished at: 2018-02-25T00:22:26Z
[INFO] Final Memory: 88M/2107M
[INFO] ------------------------------------------------------------------------
[ERROR] Failed to execute goal org.apache.maven.plugins:maven-surefire-plugin:2.6:test (default-test)
on project hama-core: There are test failures.
[ERROR] 
[ERROR] Please refer to <https://builds.apache.org/job/Hama-Nightly-for-Hadoop-1.x/ws/core/target/surefire-reports>
for the individual test results.
[ERROR] -> [Help 1]
org.apache.maven.lifecycle.LifecycleExecutionException: Failed to execute goal org.apache.maven.plugins:maven-surefire-plugin:2.6:test
(default-test) on project hama-core: There are test failures.

Please refer to <https://builds.apache.org/job/Hama-Nightly-for-Hadoop-1.x/ws/core/target/surefire-reports>
for the individual test results.
    at org.apache.maven.lifecycle.internal.MojoExecutor.execute (MojoExecutor.java:213)
    at org.apache.maven.lifecycle.internal.MojoExecutor.execute (MojoExecutor.java:154)
    at org.apache.maven.lifecycle.internal.MojoExecutor.execute (MojoExecutor.java:146)
    at org.apache.maven.lifecycle.internal.LifecycleModuleBuilder.buildProject (LifecycleModuleBuilder.java:117)
    at org.apache.maven.lifecycle.internal.LifecycleModuleBuilder.buildProject (LifecycleModuleBuilder.java:81)
    at org.apache.maven.lifecycle.internal.builder.singlethreaded.SingleThreadedBuilder.build
(SingleThreadedBuilder.java:51)
    at org.apache.maven.lifecycle.internal.LifecycleStarter.execute (LifecycleStarter.java:128)
    at org.apache.maven.DefaultMaven.doExecute (DefaultMaven.java:309)
    at org.apache.maven.DefaultMaven.doExecute (DefaultMaven.java:194)
    at org.apache.maven.DefaultMaven.execute (DefaultMaven.java:107)
    at org.apache.maven.cli.MavenCli.execute (MavenCli.java:955)
    at org.apache.maven.cli.MavenCli.doMain (MavenCli.java:290)
    at org.apache.maven.cli.MavenCli.main (MavenCli.java:194)
    at sun.reflect.NativeMethodAccessorImpl.invoke0 (Native Method)
    at sun.reflect.NativeMethodAccessorImpl.invoke (NativeMethodAccessorImpl.java:62)
    at sun.reflect.DelegatingMethodAccessorImpl.invoke (DelegatingMethodAccessorImpl.java:43)
    at java.lang.reflect.Method.invoke (Method.java:498)
    at org.codehaus.plexus.classworlds.launcher.Launcher.launchEnhanced (Launcher.java:289)
    at org.codehaus.plexus.classworlds.launcher.Launcher.launch (Launcher.java:229)
    at org.codehaus.plexus.classworlds.launcher.Launcher.mainWithExitCode (Launcher.java:415)
    at org.codehaus.plexus.classworlds.launcher.Launcher.main (Launcher.java:356)
Caused by: org.apache.maven.plugin.MojoFailureException: There are test failures.

Please refer to <https://builds.apache.org/job/Hama-Nightly-for-Hadoop-1.x/ws/core/target/surefire-reports>
for the individual test results.
    at org.apache.maven.plugin.surefire.SurefireHelper.reportExecution (SurefireHelper.java:55)
    at org.apache.maven.plugin.surefire.SurefirePlugin.execute (SurefirePlugin.java:592)
    at org.apache.maven.plugin.DefaultBuildPluginManager.executeMojo (DefaultBuildPluginManager.java:134)
    at org.apache.maven.lifecycle.internal.MojoExecutor.execute (MojoExecutor.java:208)
    at org.apache.maven.lifecycle.internal.MojoExecutor.execute (MojoExecutor.java:154)
    at org.apache.maven.lifecycle.internal.MojoExecutor.execute (MojoExecutor.java:146)
    at org.apache.maven.lifecycle.internal.LifecycleModuleBuilder.buildProject (LifecycleModuleBuilder.java:117)
    at org.apache.maven.lifecycle.internal.LifecycleModuleBuilder.buildProject (LifecycleModuleBuilder.java:81)
    at org.apache.maven.lifecycle.internal.builder.singlethreaded.SingleThreadedBuilder.build
(SingleThreadedBuilder.java:51)
    at org.apache.maven.lifecycle.internal.LifecycleStarter.execute (LifecycleStarter.java:128)
    at org.apache.maven.DefaultMaven.doExecute (DefaultMaven.java:309)
    at org.apache.maven.DefaultMaven.doExecute (DefaultMaven.java:194)
    at org.apache.maven.DefaultMaven.execute (DefaultMaven.java:107)
    at org.apache.maven.cli.MavenCli.execute (MavenCli.java:955)
    at org.apache.maven.cli.MavenCli.doMain (MavenCli.java:290)
    at org.apache.maven.cli.MavenCli.main (MavenCli.java:194)
    at sun.reflect.NativeMethodAccessorImpl.invoke0 (Native Method)
    at sun.reflect.NativeMethodAccessorImpl.invoke (NativeMethodAccessorImpl.java:62)
    at sun.reflect.DelegatingMethodAccessorImpl.invoke (DelegatingMethodAccessorImpl.java:43)
    at java.lang.reflect.Method.invoke (Method.java:498)
    at org.codehaus.plexus.classworlds.launcher.Launcher.launchEnhanced (Launcher.java:289)
    at org.codehaus.plexus.classworlds.launcher.Launcher.launch (Launcher.java:229)
    at org.codehaus.plexus.classworlds.launcher.Launcher.mainWithExitCode (Launcher.java:415)
    at org.codehaus.plexus.classworlds.launcher.Launcher.main (Launcher.java:356)
[ERROR] 
[ERROR] 
[ERROR] For more information about the errors and possible solutions, please read the following
articles:
[ERROR] [Help 1] http://cwiki.apache.org/confluence/display/MAVEN/MojoFailureException
[ERROR] 
[ERROR] After correcting the problems, you can resume the build with the command
[ERROR]   mvn <goals> -rf :hama-core
Build step 'Invoke top-level Maven targets' marked build as failure
Archiving artifacts
Recording test results

Mime
View raw message