hama-dev mailing list archives

Site index · List index
Message view « Date » · « Thread »
Top « Date » · « Thread »
From Apache Jenkins Server <jenk...@builds.apache.org>
Subject Build failed in Jenkins: Hama-trunk #486
Date Sat, 24 Feb 2018 13:45:44 GMT
See <https://builds.apache.org/job/Hama-trunk/486/display/redirect?page=changes>

Changes:

[me] HAMA-1003: Java 8 and Scala Support

------------------------------------------
[...truncated 1.42 MB...]
Progress (1): 1.6 kB                    Downloaded from central: https://repo.maven.apache.org/maven2/org/apache/maven/doxia/doxia-module-xhtml/1.0-alpha-10/doxia-module-xhtml-1.0-alpha-10.pom (1.6 kB at 111 kB/s)
Downloading from central: https://repo.maven.apache.org/maven2/org/codehaus/groovy/maven/runtime/gmaven-runtime-api/1.0/gmaven-runtime-api-1.0.jar
Downloading from central: https://repo.maven.apache.org/maven2/org/codehaus/groovy/maven/feature/gmaven-feature-api/1.0/gmaven-feature-api-1.0.jar
Downloading from central: https://repo.maven.apache.org/maven2/org/codehaus/groovy/maven/runtime/gmaven-runtime-loader/1.0/gmaven-runtime-loader-1.0.jar
Downloading from central: https://repo.maven.apache.org/maven2/org/codehaus/groovy/maven/feature/gmaven-feature-support/1.0/gmaven-feature-support-1.0.jar
Downloading from central: https://repo.maven.apache.org/maven2/org/codehaus/plexus/plexus-classworlds/1.2-alpha-13/plexus-classworlds-1.2-alpha-13.jar
Progress (1): 2.1/23 kBProgress (1): 4.9/23 kBProgress (1): 7.7/23 kBProgress (1): 10/23 kB Progress (1): 13/23 kBProgress (1): 16/23 kBProgress (1): 19/23 kBProgress (1): 21/23 kBProgress (1): 23 kB   Progress (2): 23 kB | 2.1/17 kBProgress (2): 23 kB | 4.9/17 kBProgress (2): 23 kB | 7.7/17 kBProgress (2): 23 kB | 10/17 kB Progress (2): 23 kB | 13/17 kBProgress (2): 23 kB | 16/17 kBProgress (2): 23 kB | 17 kB   Progress (3): 23 kB | 17 kB | 2.1/25 kBProgress (3): 23 kB | 17 kB | 4.9/25 kBProgress (3): 23 kB | 17 kB | 7.7/25 kBProgress (3): 23 kB | 17 kB | 10/25 kB Progress (3): 23 kB | 17 kB | 13/25 kBProgress (3): 23 kB | 17 kB | 16/25 kBProgress (3): 23 kB | 17 kB | 19/25 kBProgress (3): 23 kB | 17 kB | 21/25 kBProgress (3): 23 kB | 17 kB | 24/25 kBProgress (3): 23 kB | 17 kB | 25 kB   Progress (4): 23 kB | 17 kB | 25 kB | 2.1/43 kB                                               Downloaded from central: https://repo.maven.apache.org/maven2/org/codehaus/groovy/maven/runtime/gmaven-runtime-api/1.0/gmaven-runtime-api-1.0.jar (23 kB at 1.3 MB/s)
Downloading from central: https://repo.maven.apache.org/maven2/junit/junit/3.8.2/junit-3.8.2.jar
Progress (3): 17 kB | 25 kB | 4.9/43 kBProgress (3): 17 kB | 25 kB | 7.7/43 kBProgress (3): 17 kB | 25 kB | 10/43 kB Progress (3): 17 kB | 25 kB | 13/43 kBProgress (3): 17 kB | 25 kB | 16/43 kBProgress (3): 17 kB | 25 kB | 19/43 kBProgress (3): 17 kB | 25 kB | 21/43 kBProgress (3): 17 kB | 25 kB | 24/43 kBProgress (3): 17 kB | 25 kB | 27/43 kB                                      Downloaded from central: https://repo.maven.apache.org/maven2/org/codehaus/groovy/maven/feature/gmaven-feature-api/1.0/gmaven-feature-api-1.0.jar (17 kB at 918 kB/s)
Progress (2): 25 kB | 30/43 kB                              Downloading from central: https://repo.maven.apache.org/maven2/org/codehaus/groovy/maven/runtime/gmaven-runtime-support/1.0/gmaven-runtime-support-1.0.jar
Progress (2): 25 kB | 32/43 kBProgress (2): 25 kB | 36/43 kBProgress (2): 25 kB | 40/43 kBProgress (3): 25 kB | 40/43 kB | 2.1/14 kBProgress (3): 25 kB | 43 kB | 2.1/14 kB   Progress (3): 25 kB | 43 kB | 4.9/14 kBProgress (3): 25 kB | 43 kB | 7.7/14 kBProgress (3): 25 kB | 43 kB | 10/14 kB Progress (3): 25 kB | 43 kB | 13/14 kBProgress (3): 25 kB | 43 kB | 14 kB                                      Downloaded from central: https://repo.maven.apache.org/maven2/org/codehaus/groovy/maven/runtime/gmaven-runtime-loader/1.0/gmaven-runtime-loader-1.0.jar (25 kB at 1.1 MB/s)
Downloading from central: https://repo.maven.apache.org/maven2/org/codehaus/plexus/plexus-utils/1.5.5/plexus-utils-1.5.5.jar
Progress (3): 43 kB | 14 kB | 4.1/121 kBProgress (3): 43 kB | 14 kB | 7.6/121 kBProgress (3): 43 kB | 14 kB | 12/121 kB Progress (3): 43 kB | 14 kB | 16/121 kBProgress (3): 43 kB | 14 kB | 20/121 kBProgress (3): 43 kB | 14 kB | 24/121 kBProgress (3): 43 kB | 14 kB | 28/121 kBProgress (3): 43 kB | 14 kB | 32/121 kBProgress (3): 43 kB | 14 kB | 36/121 kBProgress (3): 43 kB | 14 kB | 40/121 kBProgress (4): 43 kB | 14 kB | 40/121 kB | 2.1/80 kBProgress (4): 43 kB | 14 kB | 44/121 kB | 2.1/80 kBProgress (4): 43 kB | 14 kB | 49/121 kB | 2.1/80 kBProgress (4): 43 kB | 14 kB | 49/121 kB | 4.9/80 kBProgress (4): 43 kB | 14 kB | 49/121 kB | 7.7/80 kBProgress (4): 43 kB | 14 kB | 49/121 kB | 10/80 kB Progress (4): 43 kB | 14 kB | 53/121 kB | 10/80 kBProgress (4): 43 kB | 14 kB | 57/121 kB | 10/80 kBProgress (4): 43 kB | 14 kB | 57/121 kB | 13/80 kBProgress (4): 43 kB | 14 kB | 61/121 kB | 13/80 kBProgress (4): 43 kB | 14 kB | 65/121 kB | 13/80 kBProgress (4): 43 kB | 14 kB | 65/121 kB | 16/80 kB                                                  Downloaded from central: https://repo.maven.apache.org/maven2/org/codehaus/plexus/plexus-classworlds/1.2-alpha-13/plexus-classworlds-1.2-alpha-13.jar (43 kB at 1.6 MB/s)
Progress (3): 14 kB | 65/121 kB | 19/80 kB                                          Downloading from central: https://repo.maven.apache.org/maven2/com/thoughtworks/qdox/qdox/1.8/qdox-1.8.jar
Progress (3): 14 kB | 69/121 kB | 19/80 kBProgress (3): 14 kB | 69/121 kB | 21/80 kBProgress (3): 14 kB | 73/121 kB | 21/80 kBProgress (3): 14 kB | 73/121 kB | 24/80 kBProgress (3): 14 kB | 77/121 kB | 24/80 kBProgress (3): 14 kB | 77/121 kB | 27/80 kB                                          Downloaded from central: https://repo.maven.apache.org/maven2/org/codehaus/groovy/maven/feature/gmaven-feature-support/1.0/gmaven-feature-support-1.0.jar (14 kB at 512 kB/s)
Progress (2): 81/121 kB | 27/80 kBProgress (2): 81/121 kB | 30/80 kB                                  Downloading from central: https://repo.maven.apache.org/maven2/org/codehaus/groovy/maven/gmaven-common/1.0/gmaven-common-1.0.jar
Progress (2): 81/121 kB | 32/80 kBProgress (2): 85/121 kB | 32/80 kBProgress (2): 89/121 kB | 32/80 kBProgress (2): 89/121 kB | 36/80 kBProgress (2): 94/121 kB | 36/80 kBProgress (2): 94/121 kB | 40/80 kBProgress (2): 98/121 kB | 40/80 kBProgress (2): 98/121 kB | 44/80 kBProgress (2): 98/121 kB | 49/80 kBProgress (2): 102/121 kB | 49/80 kBProgress (2): 106/121 kB | 49/80 kBProgress (2): 106/121 kB | 53/80 kBProgress (2): 110/121 kB | 53/80 kBProgress (2): 110/121 kB | 57/80 kBProgress (2): 114/121 kB | 57/80 kBProgress (2): 114/121 kB | 61/80 kBProgress (2): 114/121 kB | 65/80 kBProgress (2): 118/121 kB | 65/80 kBProgress (2): 121 kB | 65/80 kB    Progress (2): 121 kB | 69/80 kBProgress (2): 121 kB | 73/80 kBProgress (2): 121 kB | 77/80 kBProgress (2): 121 kB | 80 kB   Progress (3): 121 kB | 80 kB | 2.1/251 kBProgress (3): 121 kB | 80 kB | 4.9/251 kBProgress (3): 121 kB | 80 kB | 7.7/251 kBProgress (3): 121 kB | 80 kB | 10/251 kB Progress (3): 121 kB | 80 kB | 13/251 kBProgress (3): 121 kB | 80 kB | 16/251 kBProgress (3): 121 kB | 80 kB | 19/251 kBProgress (3): 121 kB | 80 kB | 21/251 kBProgress (3): 121 kB | 80 kB | 24/251 kBProgress (3): 121 kB | 80 kB | 27/251 kBProgress (3): 121 kB | 80 kB | 30/251 kBProgress (3): 121 kB | 80 kB | 32/251 kBProgress (4): 121 kB | 80 kB | 32/251 kB | 2.1/159 kBProgress (4): 121 kB | 80 kB | 32/251 kB | 4.9/159 kBProgress (4): 121 kB | 80 kB | 36/251 kB | 4.9/159 kBProgress (5): 121 kB | 80 kB | 36/251 kB | 4.9/159 kB | 4.1/15 kBProgress (5): 121 kB | 80 kB | 36/251 kB | 7.6/159 kB | 4.1/15 kBProgress (5): 121 kB | 80 kB | 36/251 kB | 7.6/159 kB | 7.6/15 kBProgress (5): 121 kB | 80 kB | 40/251 kB | 7.6/159 kB | 7.6/15 kBProgress (5): 121 kB | 80 kB | 40/251 kB | 10/159 kB | 7.6/15 kB                                                                 Downloaded from central: https://repo.maven.apache.org/maven2/junit/junit/3.8.2/junit-3.8.2.jar (121 kB at 3.4 MB/s)
Progress (4): 80 kB | 40/251 kB | 10/159 kB | 12/15 kBProgress (4): 80 kB | 40/251 kB | 13/159 kB | 12/15 kBProgress (4): 80 kB | 40/251 kB | 13/159 kB | 15 kB                                                      Downloading from central: https://repo.maven.apache.org/maven2/org/apache/maven/shared/file-management/1.2.1/file-management-1.2.1.jar
Progress (4): 80 kB | 40/251 kB | 16/159 kB | 15 kBProgress (4): 80 kB | 44/251 kB | 16/159 kB | 15 kBProgress (4): 80 kB | 44/251 kB | 19/159 kB | 15 kBProgress (4): 80 kB | 49/251 kB | 19/159 kB | 15 kB                                                   Downloaded from central: https://repo.maven.apache.org/maven2/org/codehaus/groovy/maven/runtime/gmaven-runtime-support/1.0/gmaven-runtime-support-1.0.jar (80 kB at 2.3 MB/s)
Progress (3): 49/251 kB | 21/159 kB | 15 kB                                           Downloading from central: https://repo.maven.apache.org/maven2/org/apache/maven/maven-plugin-api/2.0.9/maven-plugin-api-2.0.9.jar
Progress (3): 49/251 kB | 24/159 kB | 15 kBProgress (3): 53/251 kB | 24/159 kB | 15 kBProgress (3): 53/251 kB | 27/159 kB | 15 kBProgress (3): 57/251 kB | 27/159 kB | 15 kBProgress (3): 61/251 kB | 27/159 kB | 15 kBProgress (3): 61/251 kB | 30/159 kB | 15 kBProgress (3): 65/251 kB | 30/159 kB | 15 kBProgress (3): 65/251 kB | 32/159 kB | 15 kBProgress (3): 69/251 kB | 32/159 kB | 15 kBProgress (3): 69/251 kB | 36/159 kB | 15 kBProgress (3): 73/251 kB | 36/159 kB | 15 kBProgress (3): 73/251 kB | 40/159 kB | 15 kBProgress (3): 77/251 kB | 40/159 kB | 15 kBProgress (3): 77/251 kB | 44/159 kB | 15 kBProgress (3): 81/251 kB | 44/159 kB | 15 kBProgress (3): 81/251 kB | 49/159 kB | 15 kBProgress (3): 85/251 kB | 49/159 kB | 15 kBProgress (3): 85/251 kB | 53/159 kB | 15 kBProgress (3): 89/251 kB | 53/159 kB | 15 kBProgress (3): 89/251 kB | 57/159 kB | 15 kBProgress (3): 94/251 kB | 57/159 kB | 15 kBProgress (3): 94/251 kB | 61/159 kB | 15 kBProgress (3): 98/251 kB | 61/159 kB | 15 kBProgress (3): 98/251 kB | 65/159 kB | 15 kBProgress (3): 102/251 kB | 65/159 kB | 15 kBProgress (3): 102/251 kB | 69/159 kB | 15 kBProgress (3): 106/251 kB | 69/159 kB | 15 kBProgress (3): 106/251 kB | 73/159 kB | 15 kBProgress (3): 110/251 kB | 73/159 kB | 15 kBProgress (3): 110/251 kB | 77/159 kB | 15 kBProgress (3): 114/251 kB | 77/159 kB | 15 kBProgress (3): 114/251 kB | 81/159 kB | 15 kBProgress (3): 118/251 kB | 81/159 kB | 15 kBProgress (3): 118/251 kB | 85/159 kB | 15 kBProgress (3): 122/251 kB | 85/159 kB | 15 kBProgress (3): 122/251 kB | 89/159 kB | 15 kBProgress (3): 126/251 kB | 89/159 kB | 15 kBProgress (3): 126/251 kB | 94/159 kB | 15 kBProgress (3): 130/251 kB | 94/159 kB | 15 kBProgress (3): 130/251 kB | 98/159 kB | 15 kBProgress (3): 135/251 kB | 98/159 kB | 15 kBProgress (3): 135/251 kB | 102/159 kB | 15 kBProgress (3): 139/251 kB | 102/159 kB | 15 kBProgress (3): 139/251 kB | 106/159 kB | 15 kBProgress (3): 143/251 kB | 106/159 kB | 15 kBProgress (3): 143/251 kB | 110/159 kB | 15 kBProgress (3): 147/251 kB | 110/159 kB | 15 kBProgress (3): 147/251 kB | 114/159 kB | 15 kBProgress (3): 151/251 kB | 114/159 kB | 15 kBProgress (3): 151/251 kB | 118/159 kB | 15 kBProgress (3): 155/251 kB | 118/159 kB | 15 kBProgress (3): 155/251 kB | 122/159 kB | 15 kBProgress (3): 159/251 kB | 122/159 kB | 15 kBProgress (3): 159/251 kB | 126/159 kB | 15 kBProgress (3): 163/251 kB | 126/159 kB | 15 kBProgress (3): 163/251 kB | 130/159 kB | 15 kBProgress (3): 167/251 kB | 130/159 kB | 15 kBProgress (3): 167/251 kB | 135/159 kB | 15 kBProgress (3): 171/251 kB | 135/159 kB | 15 kBProgress (3): 171/251 kB | 139/159 kB | 15 kBProgress (3): 176/251 kB | 139/159 kB | 15 kBProgress (3): 176/251 kB | 143/159 kB | 15 kBProgress (3): 180/251 kB | 143/159 kB | 15 kBProgress (3): 180/251 kB | 147/159 kB | 15 kBProgress (4): 180/251 kB | 147/159 kB | 15 kB | 4.1/38 kBProgress (4): 180/251 kB | 147/159 kB | 15 kB | 7.6/38 kB                                                         Downloaded from central: https://repo.maven.apache.org/maven2/org/codehaus/groovy/maven/gmaven-common/1.0/gmaven-common-1.0.jar (15 kB at 379 kB/s)
Progress (3): 180/251 kB | 147/159 kB | 12/38 kBProgress (3): 184/251 kB | 147/159 kB | 12/38 kBProgress (3): 184/251 kB | 151/159 kB | 12/38 kBProgress (3): 188/251 kB | 151/159 kB | 12/38 kBProgress (3): 188/251 kB | 151/159 kB | 16/38 kBProgress (3): 192/251 kB | 151/159 kB | 16/38 kB                                                Downloading from central: https://repo.maven.apache.org/maven2/org/apache/maven/shared/maven-shared-io/1.1/maven-shared-io-1.1.jar
Progress (3): 196/251 kB | 151/159 kB | 16/38 kBProgress (3): 196/251 kB | 155/159 kB | 16/38 kBProgress (3): 196/251 kB | 159/159 kB | 16/38 kBProgress (3): 196/251 kB | 159 kB | 16/38 kB    Progress (3): 196/251 kB | 159 kB | 20/38 kBProgress (3): 200/251 kB | 159 kB | 20/38 kBProgress (3): 200/251 kB | 159 kB | 24/38 kBProgress (3): 204/251 kB | 159 kB | 24/38 kBProgress (3): 204/251 kB | 159 kB | 28/38 kBProgress (3): 208/251 kB | 159 kB | 28/38 kBProgress (3): 208/251 kB | 159 kB | 32/38 kBProgress (3): 212/251 kB | 159 kB | 32/38 kBProgress (4): 212/251 kB | 159 kB | 32/38 kB | 4.1/13 kBProgress (4): 212/251 kB | 159 kB | 32/38 kB | 7.6/13 kBProgress (4): 212/251 kB | 159 kB | 36/38 kB | 7.6/13 kBProgress (4): 212/251 kB | 159 kB | 36/38 kB | 12/13 kB Progress (4): 216/251 kB | 159 kB | 36/38 kB | 12/13 kBProgress (4): 216/251 kB | 159 kB | 38 kB | 12/13 kB   Progress (4): 221/251 kB | 159 kB | 38 kB | 12/13 kBProgress (4): 221/251 kB | 159 kB | 38 kB | 13 kB   Progress (4): 225/251 kB | 159 kB | 38 kB | 13 kBProgress (4): 229/251 kB | 159 kB | 38 kB | 13 kBProgress (4): 233/251 kB | 159 kB | 38 kB | 13 kBProgress (4): 237/251 kB | 159 kB | 38 kB | 13 kBProgress (4): 241/251 kB | 159 kB | 38 kB | 13 kBProgress (4): 245/251 kB | 159 kB | 38 kB | 13 kBProgress (4): 249/251 kB | 159 kB | 38 kB | 13 kBProgress (4): 251 kB | 159 kB | 38 kB | 13 kB    Progress (5): 251 kB | 159 kB | 38 kB | 13 kB | 4.1/39 kBProgress (5): 251 kB | 159 kB | 38 kB | 13 kB | 7.6/39 kBProgress (5): 251 kB | 159 kB | 38 kB | 13 kB | 12/39 kB Progress (5): 251 kB | 159 kB | 38 kB | 13 kB | 16/39 kB                                                        Downloaded from central: https://repo.maven.apache.org/maven2/com/thoughtworks/qdox/qdox/1.8/qdox-1.8.jar (159 kB at 3.3 MB/s)
Downloading from central: https://repo.maven.apache.org/maven2/org/apache/maven/maven-artifact-manager/2.0.2/maven-artifact-manager-2.0.2.jar
Progress (4): 251 kB | 38 kB | 13 kB | 20/39 kBProgress (4): 251 kB | 38 kB | 13 kB | 24/39 kBProgress (4): 251 kB | 38 kB | 13 kB | 28/39 kBProgress (4): 251 kB | 38 kB | 13 kB | 32/39 kBProgress (4): 251 kB | 38 kB | 13 kB | 36/39 kB                                               Downloaded from central: https://repo.maven.apache.org/maven2/org/apache/maven/maven-plugin-api/2.0.9/maven-plugin-api-2.0.9.jar (13 kB at 269 kB/s)
Progress (3): 251 kB | 38 kB | 39 kB                                    Downloaded from central: https://repo.maven.apache.org/maven2/org/apache/maven/shared/file-management/1.2.1/file-management-1.2.1.jar (38 kB at 783 kB/s)
Downloading from central: https://repo.maven.apache.org/maven2/org/apache/maven/wagon/wagon-provider-api/1.0-alpha-6/wagon-provider-api-1.0-alpha-6.jar
Downloading from central: https://repo.maven.apache.org/maven2/org/apache/maven/maven-repository-metadata/2.0.2/maven-repository-metadata-2.0.2.jar
Downloaded from central: https://repo.maven.apache.org/maven2/org/codehaus/plexus/plexus-utils/1.5.5/plexus-utils-1.5.5.jar (251 kB at 5.0 MB/s)
Downloading from central: https://repo.maven.apache.org/maven2/org/apache/maven/maven-artifact/2.0.9/maven-artifact-2.0.9.jar
Progress (2): 39 kB | 2.1/49 kBProgress (2): 39 kB | 4.9/49 kBProgress (2): 39 kB | 7.7/49 kBProgress (2): 39 kB | 10/49 kB Progress (2): 39 kB | 13/49 kBProgress (2): 39 kB | 16/49 kBProgress (3): 39 kB | 16/49 kB | 2.8/43 kBProgress (3): 39 kB | 19/49 kB | 2.8/43 kBProgress (3): 39 kB | 21/49 kB | 2.8/43 kBProgress (3): 39 kB | 21/49 kB | 5.5/43 kB                                          Downloaded from central: https://repo.maven.apache.org/maven2/org/apache/maven/shared/maven-shared-io/1.1/maven-shared-io-1.1.jar (39 kB at 731 kB/s)
Progress (2): 24/49 kB | 5.5/43 kBProgress (3): 24/49 kB | 5.5/43 kB | 4.1/20 kB                                              Downloading from central: https://repo.maven.apache.org/maven2/org/apache/maven/maven-plugin-descriptor/2.0.9/maven-plugin-descriptor-2.0.9.jar
Progress (3): 24/49 kB | 8.3/43 kB | 4.1/20 kBProgress (3): 24/49 kB | 8.3/43 kB | 7.6/20 kBProgress (3): 27/49 kB | 8.3/43 kB | 7.6/20 kBProgress (3): 27/49 kB | 8.3/43 kB | 12/20 kB Progress (3): 27/49 kB | 11/43 kB | 12/20 kB Progress (3): 27/49 kB | 11/43 kB | 16/20 kBProgress (3): 30/49 kB | 11/43 kB | 16/20 kBProgress (3): 30/49 kB | 14/43 kB | 16/20 kBProgress (3): 30/49 kB | 14/43 kB | 20 kB   Progress (3): 32/49 kB | 14/43 kB | 20 kBProgress (3): 32/49 kB | 16/43 kB | 20 kBProgress (4): 32/49 kB | 16/43 kB | 20 kB | 4.1/89 kBProgress (4): 32/49 kB | 19/43 kB | 20 kB | 4.1/89 kBProgress (4): 32/49 kB | 19/43 kB | 20 kB | 7.6/89 kBProgress (4): 36/49 kB | 19/43 kB | 20 kB | 7.6/89 kBProgress (4): 36/49 kB | 22/43 kB | 20 kB | 7.6/89 kBProgress (4): 36/49 kB | 22/43 kB | 20 kB | 12/89 kB Progress (4): 40/49 kB | 22/43 kB | 20 kB | 12/89 kBProgress (4): 40/49 kB | 25/43 kB | 20 kB | 12/89 kBProgress (4): 40/49 kB | 25/43 kB | 20 kB | 16/89 kBProgress (4): 44/49 kB | 25/43 kB | 20 kB | 16/89 kBProgress (4): 44/49 kB | 27/43 kB | 20 kB | 16/89 kBProgress (4): 49/49 kB | 27/43 kB | 20 kB | 16/89 kBProgress (4): 49/49 kB | 30/43 kB | 20 kB | 16/89 kBProgress (4): 49 kB | 30/43 kB | 20 kB | 16/89 kB   Progress (4): 49 kB | 30/43 kB | 20 kB | 20/89 kBProgress (4): 49 kB | 33/43 kB | 20 kB | 20/89 kBProgress (4): 49 kB | 33/43 kB | 20 kB | 24/89 kBProgress (4): 49 kB | 33/43 kB | 20 kB | 28/89 kBProgress (4): 49 kB | 33/43 kB | 20 kB | 32/89 kBProgress (4): 49 kB | 37/43 kB | 20 kB | 32/89 kBProgress (4): 49 kB | 41/43 kB | 20 kB | 32/89 kBProgress (4): 49 kB | 43 kB | 20 kB | 32/89 kB   Progress (4): 49 kB | 43 kB | 20 kB | 36/89 kBProgress (4): 49 kB | 43 kB | 20 kB | 40/89 kBProgress (4): 49 kB | 43 kB | 20 kB | 44/89 kBProgress (4): 49 kB | 43 kB | 20 kB | 49/89 kBProgress (4): 49 kB | 43 kB | 20 kB | 53/89 kBProgress (4): 49 kB | 43 kB | 20 kB | 57/89 kBProgress (4): 49 kB | 43 kB | 20 kB | 61/89 kBProgress (4): 49 kB | 43 kB | 20 kB | 65/89 kBProgress (4): 49 kB | 43 kB | 20 kB | 69/89 kBProgress (4): 49 kB | 43 kB | 20 kB | 73/89 kBProgress (4): 49 kB | 43 kB | 20 kB | 77/89 kBProgress (4): 49 kB | 43 kB | 20 kB | 81/89 kBProgress (4): 49 kB | 43 kB | 20 kB | 85/89 kBProgress (4): 49 kB | 43 kB | 20 kB | 89 kB   Progress (5): 49 kB | 43 kB | 20 kB | 89 kB | 4.1/37 kBProgress (5): 49 kB | 43 kB | 20 kB | 89 kB | 7.6/37 kBProgress (5): 49 kB | 43 kB | 20 kB | 89 kB | 12/37 kB                                                       Downloaded from central: https://repo.maven.apache.org/maven2/org/apache/maven/maven-repository-metadata/2.0.2/maven-repository-metadata-2.0.2.jar (20 kB at 323 kB/s)
Progress (4): 49 kB | 43 kB | 89 kB | 16/37 kB                                              Downloading from central: https://repo.maven.apache.org/maven2/org/apache/maven/reporting/maven-reporting-impl/2.0.4.1/maven-reporting-impl-2.0.4.1.jar
Progress (4): 49 kB | 43 kB | 89 kB | 20/37 kBProgress (4): 49 kB | 43 kB | 89 kB | 24/37 kBProgress (4): 49 kB | 43 kB | 89 kB | 28/37 kBProgress (4): 49 kB | 43 kB | 89 kB | 32/37 kB                                              Downloaded from central: https://repo.maven.apache.org/maven2/org/apache/maven/maven-artifact-manager/2.0.2/maven-artifact-manager-2.0.2.jar (49 kB at 793 kB/s)
Progress (3): 43 kB | 89 kB | 36/37 kB                                      Downloading from central: https://repo.maven.apache.org/maven2/org/apache/maven/maven-project/2.0.9/maven-project-2.0.9.jar
Progress (3): 43 kB | 89 kB | 37 kB                                   Downloaded from central: https://repo.maven.apache.org/maven2/org/apache/maven/wagon/wagon-provider-api/1.0-alpha-6/wagon-provider-api-1.0-alpha-6.jar (43 kB at 689 kB/s)
Downloading from central: https://repo.maven.apache.org/maven2/org/apache/maven/maven-settings/2.0.9/maven-settings-2.0.9.jar
Downloaded from central: https://repo.maven.apache.org/maven2/org/apache/maven/maven-artifact/2.0.9/maven-artifact-2.0.9.jar (89 kB at 1.4 MB/s)
Downloading from central: https://repo.maven.apache.org/maven2/org/apache/maven/maven-profile/2.0.9/maven-profile-2.0.9.jar
Progress (2): 37 kB | 4.1/19 kBProgress (3): 37 kB | 4.1/19 kB | 2.8/122 kBProgress (3): 37 kB | 7.6/19 kB | 2.8/122 kBProgress (3): 37 kB | 12/19 kB | 2.8/122 kB Progress (3): 37 kB | 12/19 kB | 5.5/122 kBProgress (3): 37 kB | 16/19 kB | 5.5/122 kBProgress (3): 37 kB | 16/19 kB | 8.3/122 kBProgress (3): 37 kB | 19 kB | 8.3/122 kB   Progress (3): 37 kB | 19 kB | 11/122 kB Progress (3): 37 kB | 19 kB | 14/122 kBProgress (3): 37 kB | 19 kB | 16/122 kBProgress (3): 37 kB | 19 kB | 19/122 kBProgress (4): 37 kB | 19 kB | 19/122 kB | 4.1/49 kBProgress (4): 37 kB | 19 kB | 22/122 kB | 4.1/49 kBProgress (4): 37 kB | 19 kB | 22/122 kB | 7.6/49 kBProgress (4): 37 kB | 19 kB | 22/122 kB | 12/49 kB Progress (4): 37 kB | 19 kB | 25/122 kB | 12/49 kBProgress (4): 37 kB | 19 kB | 25/122 kB | 16/49 kBProgress (4): 37 kB | 19 kB | 27/122 kB | 16/49 kB                                                  Downloaded from central: https://repo.maven.apache.org/maven2/org/apache/maven/maven-plugin-descriptor/2.0.9/maven-plugin-descriptor-2.0.9.jar (37 kB at 545 kB/s)
Progress (3): 19 kB | 30/122 kB | 16/49 kB                                          Downloading from central: https://repo.maven.apache.org/maven2/org/apache/maven/maven-model/2.0.9/maven-model-2.0.9.jar
Progress (3): 19 kB | 30/122 kB | 20/49 kBProgress (3): 19 kB | 33/122 kB | 20/49 kBProgress (3): 19 kB | 33/122 kB | 24/49 kBProgress (3): 19 kB | 33/122 kB | 28/49 kBProgress (3): 19 kB | 33/122 kB | 32/49 kBProgress (3): 19 kB | 37/122 kB | 32/49 kBProgress (3): 19 kB | 41/122 kB | 32/49 kBProgress (3): 19 kB | 45/122 kB | 32/49 kBProgress (3): 19 kB | 45/122 kB | 36/49 kBProgress (3): 19 kB | 49/122 kB | 36/49 kBProgress (3): 19 kB | 49/122 kB | 40/49 kBProgress (3): 19 kB | 49/122 kB | 44/49 kBProgress (3): 19 kB | 49/122 kB | 49/49 kBProgress (3): 19 kB | 49/122 kB | 49 kB   Progress (3): 19 kB | 53/122 kB | 49 kBProgress (3): 19 kB | 57/122 kB | 49 kBProgress (3): 19 kB | 61/122 kB | 49 kBProgress (3): 19 kB | 66/122 kB | 49 kBProgress (4): 19 kB | 66/122 kB | 49 kB | 4.1/35 kBProgress (4): 19 kB | 66/122 kB | 49 kB | 7.6/35 kBProgress (4): 19 kB | 70/122 kB | 49 kB | 7.6/35 kBProgress (4): 19 kB | 70/122 kB | 49 kB | 12/35 kB Progress (4): 19 kB | 74/122 kB | 49 kB | 12/35 kBProgress (4): 19 kB | 74/122 kB | 49 kB | 16/35 kBProgress (4): 19 kB | 78/122 kB | 49 kB | 16/35 kBProgress (4): 19 kB | 82/122 kB | 49 kB | 16/35 kBProgress (4): 19 kB | 82/122 kB | 49 kB | 20/35 kBProgress (4): 19 kB | 82/122 kB | 49 kB | 24/35 kBProgress (4): 19 kB | 86/122 kB | 49 kB | 24/35 kBProgress (4): 19 kB | 86/122 kB | 49 kB | 28/35 kBProgress (4): 19 kB | 90/122 kB | 49 kB | 28/35 kBProgress (4): 19 kB | 90/122 kB | 49 kB | 32/35 kBProgress (4): 19 kB | 94/122 kB | 49 kB | 32/35 kBProgress (4): 19 kB | 98/122 kB | 49 kB | 32/35 kBProgress (4): 19 kB | 98/122 kB | 49 kB | 35 kB   Progress (4): 19 kB | 102/122 kB | 49 kB | 35 kBProgress (4): 19 kB | 106/122 kB | 49 kB | 35 kBProgress (4): 19 kB | 111/122 kB | 49 kB | 35 kBProgress (4): 19 kB | 115/122 kB | 49 kB | 35 kBProgress (4): 19 kB | 119/122 kB | 49 kB | 35 kBProgress (4): 19 kB | 122 kB | 49 kB | 35 kB                                                Downloaded from central: https://repo.maven.apache.org/maven2/org/apache/maven/reporting/maven-reporting-impl/2.0.4.1/maven-reporting-impl-2.0.4.1.jar (19 kB at 255 kB/s)
Downloading from central: https://repo.maven.apache.org/maven2/org/apache/maven/maven-plugin-registry/2.0.9/maven-plugin-registry-2.0.9.jar
Progress (4): 122 kB | 49 kB | 35 kB | 4.1/87 kBProgress (4): 122 kB | 49 kB | 35 kB | 7.6/87 kBProgress (4): 122 kB | 49 kB | 35 kB | 12/87 kB Progress (4): 122 kB | 49 kB | 35 kB | 16/87 kBProgress (4): 122 kB | 49 kB | 35 kB | 20/87 kB                                               Downloaded from central: https://repo.maven.apache.org/maven2/org/apache/maven/maven-settings/2.0.9/maven-settings-2.0.9.jar (49 kB at 664 kB/s)
Progress (3): 122 kB | 35 kB | 24/87 kB                                       Downloading from central: https://repo.maven.apache.org/maven2/commons-validator/commons-validator/1.2.0/commons-validator-1.2.0.jar
Progress (3): 122 kB | 35 kB | 28/87 kBProgress (3): 122 kB | 35 kB | 32/87 kBProgress (3): 122 kB | 35 kB | 36/87 kBProgress (3): 122 kB | 35 kB | 40/87 kBProgress (3): 122 kB | 35 kB | 44/87 kBProgress (3): 122 kB | 35 kB | 49/87 kBProgress (3): 122 kB | 35 kB | 53/87 kBProgress (3): 122 kB | 35 kB | 57/87 kBProgress (3): 122 kB | 35 kB | 61/87 kB                                       Downloaded from central: https://repo.maven.apache.org/maven2/org/apache/maven/maven-profile/2.0.9/maven-profile-2.0.9.jar (35 kB at 465 kB/s)
Progress (2): 122 kB | 65/87 kB                               Downloading from central: https://repo.maven.apache.org/maven2/commons-digester/commons-digester/1.6/commons-digester-1.6.jar
Progress (2): 122 kB | 69/87 kBProgress (2): 122 kB | 73/87 kBProgress (2): 122 kB | 77/87 kBProgress (2): 122 kB | 81/87 kB                               Downloaded from central: https://repo.maven.apache.org/maven2/org/apache/maven/maven-project/2.0.9/maven-project-2.0.9.jar (122 kB at 1.6 MB/s)
Progress (1): 85/87 kB                      Downloading from central: https://repo.maven.apache.org/maven2/commons-logging/commons-logging/1.0.4/commons-logging-1.0.4.jar
Progress (1): 87 kBProgress (2): 87 kB | 2.8/29 kBProgress (2): 87 kB | 5.5/29 kBProgress (2): 87 kB | 8.3/29 kBProgress (2): 87 kB | 11/29 kB Progress (2): 87 kB | 14/29 kBProgress (2): 87 kB | 16/29 kBProgress (2): 87 kB | 19/29 kBProgress (2): 87 kB | 22/29 kBProgress (2): 87 kB | 25/29 kBProgress (2): 87 kB | 27/29 kBProgress (2): 87 kB | 29 kB   Progress (3): 87 kB | 29 kB | 4.1/91 kBProgress (3): 87 kB | 29 kB | 7.6/91 kBProgress (3): 87 kB | 29 kB | 12/91 kB Progress (3): 87 kB | 29 kB | 16/91 kBProgress (3): 87 kB | 29 kB | 20/91 kBProgress (3): 87 kB | 29 kB | 24/91 kBProgress (3): 87 kB | 29 kB | 28/91 kBProgress (3): 87 kB | 29 kB | 32/91 kBProgress (3): 87 kB | 29 kB | 36/91 kBProgress (3): 87 kB | 29 kB | 40/91 kBProgress (3): 87 kB | 29 kB | 44/91 kBProgress (3): 87 kB | 29 kB | 49/91 kBProgress (3): 87 kB | 29 kB | 53/91 kBProgress (3): 87 kB | 29 kB | 57/91 kBProgress (3): 87 kB | 29 kB | 61/91 kBProgress (3): 87 kB | 29 kB | 65/91 kBProgress (4): 87 kB | 29 kB | 65/91 kB | 4.1/168 kBProgress (4): 87 kB | 29 kB | 65/91 kB | 7.6/168 kBProgress (5): 87 kB | 29 kB | 65/91 kB | 7.6/168 kB | 4.1/38 kBProgress (5): 87 kB | 29 kB | 69/91 kB | 7.6/168 kB | 4.1/38 kBProgress (5): 87 kB | 29 kB | 69/91 kB | 12/168 kB | 4.1/38 kB Progress (5): 87 kB | 29 kB | 73/91 kB | 12/168 kB | 4.1/38 kBProgress (5): 87 kB | 29 kB | 73/91 kB | 12/168 kB | 7.6/38 kBProgress (5): 87 kB | 29 kB | 77/91 kB | 12/168 kB | 7.6/38 kBProgress (5): 87 kB | 29 kB | 77/91 kB | 16/168 kB | 7.6/38 kBProgress (5): 87 kB | 29 kB | 81/91 kB | 16/168 kB | 7.6/38 kBProgress (5): 87 kB | 29 kB | 81/91 kB | 16/168 kB | 12/38 kB                                                              Downloaded from central: https://repo.maven.apache.org/maven2/org/apache/maven/maven-model/2.0.9/maven-model-2.0.9.jar (87 kB at 1.1 MB/s)
Progress (4): 29 kB | 81/91 kB | 16/168 kB | 16/38 kBProgress (4): 29 kB | 85/91 kB | 16/168 kB | 16/38 kB                                                     Downloading from central: https://repo.maven.apache.org/maven2/xml-apis/xml-apis/1.0.b2/xml-apis-1.0.b2.jar
Progress (4): 29 kB | 85/91 kB | 20/168 kB | 16/38 kBProgress (4): 29 kB | 89/91 kB | 20/168 kB | 16/38 kBProgress (4): 29 kB | 89/91 kB | 24/168 kB | 16/38 kBProgress (4): 29 kB | 91 kB | 24/168 kB | 16/38 kB   Progress (4): 29 kB | 91 kB | 28/168 kB | 16/38 kBProgress (4): 29 kB | 91 kB | 28/168 kB | 20/38 kBProgress (4): 29 kB | 91 kB | 32/168 kB | 20/38 kBProgress (4): 29 kB | 91 kB | 32/168 kB | 24/38 kBProgress (4): 29 kB | 91 kB | 32/168 kB | 28/38 kBProgress (4): 29 kB | 91 kB | 32/168 kB | 32/38 kBProgress (4): 29 kB | 91 kB | 36/168 kB | 32/38 kBProgress (4): 29 kB | 91 kB | 36/168 kB | 36/38 kBProgress (4): 29 kB | 91 kB | 40/168 kB | 36/38 kBProgress (4): 29 kB | 91 kB | 40/168 kB | 38 kB   Progress (4): 29 kB | 91 kB | 44/168 kB | 38 kBProgress (4): 29 kB | 91 kB | 49/168 kB | 38 kBProgress (4): 29 kB | 91 kB | 53/168 kB | 38 kBProgress (4): 29 kB | 91 kB | 57/168 kB | 38 kBProgress (4): 29 kB | 91 kB | 61/168 kB | 38 kBProgress (4): 29 kB | 91 kB | 65/168 kB | 38 kB                                               Downloaded from central: https://repo.maven.apache.org/maven2/org/apache/maven/maven-plugin-registry/2.0.9/maven-plugin-registry-2.0.9.jar (29 kB at 346 kB/s)
Downloading from central: https://repo.maven.apache.org/maven2/org/apache/maven/doxia/doxia-core/1.0-alpha-10/doxia-core-1.0-alpha-10.jar
Progress (3): 91 kB | 69/168 kB | 38 kBProgress (3): 91 kB | 73/168 kB | 38 kBProgress (3): 91 kB | 77/168 kB | 38 kBProgress (3): 91 kB | 81/168 kB | 38 kBProgress (3): 91 kB | 85/168 kB | 38 kBProgress (3): 91 kB | 89/168 kB | 38 kBProgress (3): 91 kB | 94/168 kB | 38 kBProgress (3): 91 kB | 98/168 kB | 38 kBProgress (3): 91 kB | 102/168 kB | 38 kBProgress (3): 91 kB | 106/168 kB | 38 kBProgress (3): 91 kB | 110/168 kB | 38 kBProgress (3): 91 kB | 114/168 kB | 38 kBProgress (3): 91 kB | 118/168 kB | 38 kBProgress (3): 91 kB | 122/168 kB | 38 kBProgress (3): 91 kB | 126/168 kB | 38 kBProgress (3): 91 kB | 130/168 kB | 38 kBProgress (3): 91 kB | 135/168 kB | 38 kBProgress (3): 91 kB | 139/168 kB | 38 kBProgress (3): 91 kB | 143/168 kB | 38 kBProgress (3): 91 kB | 147/168 kB | 38 kBProgress (3): 91 kB | 151/168 kB | 38 kBProgress (3): 91 kB | 155/168 kB | 38 kBProgress (3): 91 kB | 159/168 kB | 38 kBProgress (3): 91 kB | 163/168 kB | 38 kBProgress (3): 91 kB | 167/168 kB | 38 kBProgress (3): 91 kB | 168 kB | 38 kB                                        Downloaded from central: https://repo.maven.apache.org/maven2/commons-validator/commons-validator/1.2.0/commons-validator-1.2.0.jar (91 kB at 1.0 MB/s)
Progress (3): 168 kB | 38 kB | 4.1/109 kB                                         Downloading from central: https://repo.maven.apache.org/maven2/org/apache/maven/doxia/doxia-sink-api/1.0-alpha-10/doxia-sink-api-1.0-alpha-10.jar
Progress (3): 168 kB | 38 kB | 7.6/109 kBProgress (3): 168 kB | 38 kB | 12/109 kB Progress (3): 168 kB | 38 kB | 16/109 kB                                        Downloaded from central: https://repo.maven.apache.org/maven2/commons-logging/commons-logging/1.0.4/commons-logging-1.0.4.jar (38 kB at 427 kB/s)
Downloading from central: https://repo.maven.apache.org/maven2/org/apache/maven/reporting/maven-reporting-api/2.0.4/maven-reporting-api-2.0.4.jar
Progress (2): 168 kB | 20/109 kBProgress (2): 168 kB | 24/109 kBProgress (2): 168 kB | 28/109 kBProgress (2): 168 kB | 32/109 kBProgress (2): 168 kB | 36/109 kBProgress (2): 168 kB | 40/109 kBProgress (2): 168 kB | 44/109 kBProgress (3): 168 kB | 44/109 kB | 2.1/55 kBProgress (3): 168 kB | 49/109 kB | 2.1/55 kBProgress (3): 168 kB | 49/109 kB | 4.9/55 kBProgress (3): 168 kB | 49/109 kB | 7.7/55 kBProgress (3): 168 kB | 53/109 kB | 7.7/55 kBProgress (3): 168 kB | 53/109 kB | 10/55 kB Progress (3): 168 kB | 57/109 kB | 10/55 kBProgress (3): 168 kB | 61/109 kB | 10/55 kBProgress (3): 168 kB | 61/109 kB | 13/55 kBProgress (3): 168 kB | 65/109 kB | 13/55 kBProgress (3): 168 kB | 65/109 kB | 16/55 kBProgress (3): 168 kB | 65/109 kB | 19/55 kBProgress (3): 168 kB | 69/109 kB | 19/55 kBProgress (3): 168 kB | 69/109 kB | 21/55 kBProgress (3): 168 kB | 73/109 kB | 21/55 kBProgress (3): 168 kB | 73/109 kB | 24/55 kBProgress (3): 168 kB | 77/109 kB | 24/55 kBProgress (3): 168 kB | 81/109 kB | 24/55 kBProgress (3): 168 kB | 81/109 kB | 27/55 kBProgress (3): 168 kB | 81/109 kB | 30/55 kBProgress (3): 168 kB | 81/109 kB | 32/55 kBProgress (3): 168 kB | 85/109 kB | 32/55 kBProgress (3): 168 kB | 89/109 kB | 32/55 kBProgress (3): 168 kB | 94/109 kB | 32/55 kBProgress (3): 168 kB | 98/109 kB | 32/55 kBProgress (3): 168 kB | 98/109 kB | 36/55 kBProgress (3): 168 kB | 98/109 kB | 40/55 kBProgress (3): 168 kB | 98/109 kB | 44/55 kBProgress (3): 168 kB | 102/109 kB | 44/55 kBProgress (3): 168 kB | 102/109 kB | 49/55 kBProgress (3): 168 kB | 106/109 kB | 49/55 kBProgress (3): 168 kB | 109 kB | 49/55 kB    Progress (3): 168 kB | 109 kB | 53/55 kBProgress (3): 168 kB | 109 kB | 55 kB                                        Downloaded from central: https://repo.maven.apache.org/maven2/commons-digester/commons-digester/1.6/commons-digester-1.6.jar (168 kB at 1.8 MB/s)
Downloading from central: https://repo.maven.apache.org/maven2/org/apache/maven/doxia/doxia-site-renderer/1.0-alpha-10/doxia-site-renderer-1.0-alpha-10.jar
Progress (3): 109 kB | 55 kB | 2.1/9.9 kBProgress (3): 109 kB | 55 kB | 4.9/9.9 kBProgress (3): 109 kB | 55 kB | 7.6/9.9 kBProgress (3): 109 kB | 55 kB | 9.9 kB                                         Downloaded from central: https://repo.maven.apache.org/maven2/xml-apis/xml-apis/1.0.b2/xml-apis-1.0.b2.jar (109 kB at 1.1 MB/s)
Downloading from central: https://repo.maven.apache.org/maven2/org/apache/maven/doxia/doxia-decoration-model/1.0-alpha-10/doxia-decoration-model-1.0-alpha-10.jar
Downloaded from central: https://repo.maven.apache.org/maven2/org/apache/maven/doxia/doxia-core/1.0-alpha-10/doxia-core-1.0-alpha-10.jar (55 kB at 557 kB/s)
Downloading from central: https://repo.maven.apache.org/maven2/org/apache/maven/doxia/doxia-module-apt/1.0-alpha-10/doxia-module-apt-1.0-alpha-10.jar
Progress (2): 9.9 kB | 2.8/46 kBProgress (2): 9.9 kB | 3.4/46 kBProgress (2): 9.9 kB | 6.2/46 kBProgress (2): 9.9 kB | 7.5/46 kBProgress (2): 9.9 kB | 10/46 kB                                Downloaded from central: https://repo.maven.apache.org/maven2/org/apache/maven/doxia/doxia-sink-api/1.0-alpha-10/doxia-sink-api-1.0-alpha-10.jar (9.9 kB at 99 kB/s)
Progress (1): 12/46 kB                      Downloading from central: https://repo.maven.apache.org/maven2/org/apache/maven/doxia/doxia-module-fml/1.0-alpha-10/doxia-module-fml-1.0-alpha-10.jar
Progress (1): 14/46 kBProgress (1): 16/46 kBProgress (1): 18/46 kBProgress (1): 20/46 kBProgress (1): 23/46 kBProgress (2): 23/46 kB | 4.1/5.0 kBProgress (2): 24/46 kB | 4.1/5.0 kBProgress (2): 24/46 kB | 5.0 kB    Progress (2): 27/46 kB | 5.0 kBProgress (2): 28/46 kB | 5.0 kBProgress (2): 31/46 kB | 5.0 kBProgress (2): 32/46 kB | 5.0 kBProgress (2): 35/46 kB | 5.0 kBProgress (2): 36/46 kB | 5.0 kBProgress (2): 39/46 kB | 5.0 kBProgress (2): 40/46 kB | 5.0 kBProgress (2): 43/46 kB | 5.0 kBProgress (2): 46/46 kB | 5.0 kBProgress (2): 46 kB | 5.0 kB   Progress (3): 46 kB | 5.0 kB | 2.8/47 kBProgress (3): 46 kB | 5.0 kB | 5.5/47 kBProgress (3): 46 kB | 5.0 kB | 8.3/47 kBProgress (3): 46 kB | 5.0 kB | 11/47 kB Progress (3): 46 kB | 5.0 kB | 14/47 kBProgress (4): 46 kB | 5.0 kB | 14/47 kB | 4.1/50 kBProgress (4): 46 kB | 5.0 kB | 16/47 kB | 4.1/50 kBProgress (4): 46 kB | 5.0 kB | 16/47 kB | 7.6/50 kBProgress (4): 46 kB | 5.0 kB | 19/47 kB | 7.6/50 kBProgress (4): 46 kB | 5.0 kB | 19/47 kB | 12/50 kB Progress (4): 46 kB | 5.0 kB | 19/47 kB | 16/50 kBProgress (4): 46 kB | 5.0 kB | 22/47 kB | 16/50 kBProgress (4): 46 kB | 5.0 kB | 25/47 kB | 16/50 kBProgress (4): 46 kB | 5.0 kB | 27/47 kB | 16/50 kBProgress (4): 46 kB | 5.0 kB | 27/47 kB | 20/50 kBProgress (5): 46 kB | 5.0 kB | 27/47 kB | 20/50 kB | 2.1/18 kBProgress (5): 46 kB | 5.0 kB | 27/47 kB | 24/50 kB | 2.1/18 kBProgress (5): 46 kB | 5.0 kB | 30/47 kB | 24/50 kB | 2.1/18 kBProgress (5): 46 kB | 5.0 kB | 30/47 kB | 28/50 kB | 2.1/18 kBProgress (5): 46 kB | 5.0 kB | 30/47 kB | 28/50 kB | 4.9/18 kBProgress (5): 46 kB | 5.0 kB | 33/47 kB | 28/50 kB | 4.9/18 kBProgress (5): 46 kB | 5.0 kB | 33/47 kB | 32/50 kB | 4.9/18 kBProgress (5): 46 kB | 5.0 kB | 33/47 kB | 32/50 kB | 7.7/18 kBProgress (5): 46 kB | 5.0 kB | 33/47 kB | 32/50 kB | 10/18 kB Progress (5): 46 kB | 5.0 kB | 37/47 kB | 32/50 kB | 10/18 kBProgress (5): 46 kB | 5.0 kB | 37/47 kB | 36/50 kB | 10/18 kBProgress (5): 46 kB | 5.0 kB | 37/47 kB | 36/50 kB | 13/18 kBProgress (5): 46 kB | 5.0 kB | 37/47 kB | 40/50 kB | 13/18 kBProgress (5): 46 kB | 5.0 kB | 41/47 kB | 40/50 kB | 13/18 kBProgress (5): 46 kB | 5.0 kB | 41/47 kB | 44/50 kB | 13/18 kBProgress (5): 46 kB | 5.0 kB | 45/47 kB | 44/50 kB | 13/18 kBProgress (5): 46 kB | 5.0 kB | 45/47 kB | 44/50 kB | 16/18 kB                                                             Downloaded from central: https://repo.maven.apache.org/maven2/org/apache/maven/reporting/maven-reporting-api/2.0.4/maven-reporting-api-2.0.4.jar (5.0 kB at 47 kB/s)
Progress (4): 46 kB | 45/47 kB | 44/50 kB | 18 kBProgress (4): 46 kB | 47 kB | 44/50 kB | 18 kB   Progress (4): 46 kB | 47 kB | 49/50 kB | 18 kB                                              Downloading from central: https://repo.maven.apache.org/maven2/org/apache/maven/doxia/doxia-module-xdoc/1.0-alpha-10/doxia-module-xdoc-1.0-alpha-10.jar
Progress (4): 46 kB | 47 kB | 50 kB | 18 kB                                           Downloaded from central: https://repo.maven.apache.org/maven2/org/apache/maven/doxia/doxia-site-renderer/1.0-alpha-10/doxia-site-renderer-1.0-alpha-10.jar (46 kB at 426 kB/s)
Downloading from central: https://repo.maven.apache.org/maven2/org/apache/maven/doxia/doxia-module-xhtml/1.0-alpha-10/doxia-module-xhtml-1.0-alpha-10.jar
Downloaded from central: https://repo.maven.apache.org/maven2/org/apache/maven/doxia/doxia-module-fml/1.0-alpha-10/doxia-module-fml-1.0-alpha-10.jar (18 kB at 161 kB/s)
Downloaded from central: https://repo.maven.apache.org/maven2/org/apache/maven/doxia/doxia-module-apt/1.0-alpha-10/doxia-module-apt-1.0-alpha-10.jar (47 kB at 414 kB/s)
Downloading from central: https://repo.maven.apache.org/maven2/org/codehaus/groovy/maven/support/slf4j-gossip/1.0/slf4j-gossip-1.0.jar
Downloading from central: https://repo.maven.apache.org/maven2/jline/jline/0.9.94/jline-0.9.94.jar
Downloaded from central: https://repo.maven.apache.org/maven2/org/apache/maven/doxia/doxia-decoration-model/1.0-alpha-10/doxia-decoration-model-1.0-alpha-10.jar (50 kB at 441 kB/s)
Progress (1): 1.7/27 kBProgress (1): 4.4/27 kBProgress (1): 5.8/27 kBProgress (2): 5.8/27 kB | 2.1/21 kBProgress (2): 8.5/27 kB | 2.1/21 kBProgress (2): 9.8/27 kB | 2.1/21 kBProgress (2): 9.8/27 kB | 4.9/21 kBProgress (2): 13/27 kB | 4.9/21 kB Progress (2): 13/27 kB | 7.7/21 kBProgress (2): 14/27 kB | 7.7/21 kBProgress (2): 14/27 kB | 10/21 kB Progress (2): 17/27 kB | 10/21 kBProgress (2): 17/27 kB | 13/21 kBProgress (2): 18/27 kB | 13/21 kBProgress (2): 18/27 kB | 16/21 kBProgress (2): 21/27 kB | 16/21 kBProgress (2): 21/27 kB | 19/21 kBProgress (2): 22/27 kB | 19/21 kBProgress (2): 22/27 kB | 21/21 kBProgress (2): 25/27 kB | 21/21 kBProgress (2): 25/27 kB | 21 kB   Progress (2): 27 kB | 21 kB   Progress (3): 27 kB | 21 kB | 2.1/87 kBProgress (3): 27 kB | 21 kB | 4.9/87 kBProgress (3): 27 kB | 21 kB | 7.6/87 kBProgress (3): 27 kB | 21 kB | 10/87 kB Progress (3): 27 kB | 21 kB | 13/87 kBProgress (3): 27 kB | 21 kB | 16/87 kBProgress (3): 27 kB | 21 kB | 19/87 kBProgress (3): 27 kB | 21 kB | 21/87 kBProgress (3): 27 kB | 21 kB | 24/87 kBProgress (3): 27 kB | 21 kB | 27/87 kBProgress (3): 27 kB | 21 kB | 30/87 kBProgress (3): 27 kB | 21 kB | 32/87 kB                                      Downloaded from central: https://repo.maven.apache.org/maven2/org/apache/maven/doxia/doxia-module-xdoc/1.0-alpha-10/doxia-module-xdoc-1.0-alpha-10.jar (27 kB at 227 kB/s)
Progress (2): 21 kB | 36/87 kBProgress (2): 21 kB | 40/87 kB                              Downloaded from central: https://repo.maven.apache.org/maven2/org/apache/maven/doxia/doxia-module-xhtml/1.0-alpha-10/doxia-module-xhtml-1.0-alpha-10.jar (21 kB at 179 kB/s)
Progress (1): 44/87 kBProgress (2): 44/87 kB | 2.1/75 kBProgress (2): 49/87 kB | 2.1/75 kBProgress (2): 49/87 kB | 4.9/75 kBProgress (2): 49/87 kB | 7.7/75 kBProgress (2): 53/87 kB | 7.7/75 kBProgress (2): 53/87 kB | 10/75 kB Progress (2): 57/87 kB | 10/75 kBProgress (2): 61/87 kB | 10/75 kBProgress (2): 61/87 kB | 13/75 kBProgress (2): 65/87 kB | 13/75 kBProgress (2): 65/87 kB | 16/75 kBProgress (2): 65/87 kB | 19/75 kBProgress (2): 69/87 kB | 19/75 kBProgress (2): 69/87 kB | 21/75 kBProgress (2): 73/87 kB | 21/75 kBProgress (2): 73/87 kB | 24/75 kBProgress (2): 77/87 kB | 24/75 kBProgress (2): 81/87 kB | 24/75 kBProgress (2): 81/87 kB | 27/75 kBProgress (2): 81/87 kB | 30/75 kBProgress (2): 85/87 kB | 30/75 kBProgress (2): 87 kB | 30/75 kB   Progress (2): 87 kB | 32/75 kBProgress (2): 87 kB | 36/75 kBProgress (2): 87 kB | 40/75 kBProgress (2): 87 kB | 44/75 kBProgress (2): 87 kB | 49/75 kBProgress (2): 87 kB | 53/75 kBProgress (2): 87 kB | 57/75 kBProgress (2): 87 kB | 61/75 kBProgress (2): 87 kB | 65/75 kBProgress (2): 87 kB | 69/75 kBProgress (2): 87 kB | 73/75 kBProgress (2): 87 kB | 75 kB                              Downloaded from central: https://repo.maven.apache.org/maven2/jline/jline/0.9.94/jline-0.9.94.jar (87 kB at 688 kB/s)
Downloaded from central: https://repo.maven.apache.org/maven2/org/codehaus/groovy/maven/support/slf4j-gossip/1.0/slf4j-gossip-1.0.jar (75 kB at 579 kB/s)
Downloading from central: https://repo.maven.apache.org/maven2/org/codehaus/groovy/maven/runtime/gmaven-runtime-1.6/1.0/gmaven-runtime-1.6-1.0.pom
Progress (1): 3.3 kB                    Downloaded from central: https://repo.maven.apache.org/maven2/org/codehaus/groovy/maven/runtime/gmaven-runtime-1.6/1.0/gmaven-runtime-1.6-1.0.pom (3.3 kB at 222 kB/s)
Downloading from central: https://repo.maven.apache.org/maven2/org/codehaus/groovy/groovy-all/1.6.0/groovy-all-1.6.0.pom
Progress (1): 2.1/24 kBProgress (1): 4.9/24 kBProgress (1): 7.7/24 kBProgress (1): 10/24 kB Progress (1): 13/24 kBProgress (1): 16/24 kBProgress (1): 19/24 kBProgress (1): 21/24 kBProgress (1): 24/24 kBProgress (1): 24 kB                      Downloaded from central: https://repo.maven.apache.org/maven2/org/codehaus/groovy/groovy-all/1.6.0/groovy-all-1.6.0.pom (24 kB at 1.5 MB/s)
Downloading from central: https://repo.maven.apache.org/maven2/org/apache/ant/ant/1.7.1/ant-1.7.1.pom
Progress (1): 2.1/9.8 kBProgress (1): 4.9/9.8 kBProgress (1): 7.7/9.8 kBProgress (1): 9.8 kB                        Downloaded from central: https://repo.maven.apache.org/maven2/org/apache/ant/ant/1.7.1/ant-1.7.1.pom (9.8 kB at 813 kB/s)
Downloading from central: https://repo.maven.apache.org/maven2/org/apache/ant/ant-parent/1.7.1/ant-parent-1.7.1.pom
Progress (1): 2.1/4.4 kBProgress (1): 4.4 kB                        Downloaded from central: https://repo.maven.apache.org/maven2/org/apache/ant/ant-parent/1.7.1/ant-parent-1.7.1.pom (4.4 kB at 365 kB/s)
Downloading from central: https://repo.maven.apache.org/maven2/org/apache/ant/ant-launcher/1.7.1/ant-launcher-1.7.1.pom
Progress (1): 2.2/2.4 kBProgress (1): 2.4 kB                        Downloaded from central: https://repo.maven.apache.org/maven2/org/apache/ant/ant-launcher/1.7.1/ant-launcher-1.7.1.pom (2.4 kB at 199 kB/s)
Downloading from central: https://repo.maven.apache.org/maven2/jline/jline/0.9.94/jline-0.9.94.pom
Downloaded from central: https://repo.maven.apache.org/maven2/jline/jline/0.9.94/jline-0.9.94.pom (0 B at 0 B/s)
Downloading from central: https://repo.maven.apache.org/maven2/org/codehaus/groovy/maven/runtime/gmaven-runtime-1.6/1.0/gmaven-runtime-1.6-1.0.jar
Downloading from central: https://repo.maven.apache.org/maven2/org/codehaus/groovy/groovy-all/1.6.0/groovy-all-1.6.0.jar
Downloading from central: https://repo.maven.apache.org/maven2/org/apache/ant/ant/1.7.1/ant-1.7.1.jar
Downloading from central: https://repo.maven.apache.org/maven2/org/apache/ant/ant-launcher/1.7.1/ant-launcher-1.7.1.jar
Progress (1): 2.1/12 kBProgress (2): 2.1/12 kB | 0/1.3 MBProgress (2): 4.9/12 kB | 0/1.3 MBProgress (3): 4.9/12 kB | 0/1.3 MB | 2.1/43 kBProgress (3): 7.7/12 kB | 0/1.3 MB | 2.1/43 kBProgress (3): 7.7/12 kB | 0/1.3 MB | 2.1/43 kBProgress (3): 10/12 kB | 0/1.3 MB | 2.1/43 kB Progress (3): 10/12 kB | 0/1.3 MB | 4.9/43 kBProgress (3): 10/12 kB | 0/1.3 MB | 4.9/43 kBProgress (3): 12 kB | 0/1.3 MB | 4.9/43 kB   Progress (3): 12 kB | 0/1.3 MB | 7.7/43 kBProgress (3): 12 kB | 0/1.3 MB | 7.7/43 kBProgress (3): 12 kB | 0/1.3 MB | 10/43 kB Progress (3): 12 kB | 0/1.3 MB | 10/43 kBProgress (3): 12 kB | 0/1.3 MB | 13/43 kBProgress (3): 12 kB | 0/1.3 MB | 13/43 kBProgress (3): 12 kB | 0/1.3 MB | 16/43 kBProgress (3): 12 kB | 0/1.3 MB | 16/43 kBProgress (3): 12 kB | 0/1.3 MB | 19/43 kBProgress (3): 12 kB | 0/1.3 MB | 19/43 kBProgress (3): 12 kB | 0/1.3 MB | 21/43 kBProgress (3): 12 kB | 0/1.3 MB | 21/43 kBProgress (3): 12 kB | 0/1.3 MB | 24/43 kBProgress (3): 12 kB | 0/1.3 MB | 27/43 kBProgress (3): 12 kB | 0/1.3 MB | 27/43 kBProgress (3): 12 kB | 0/1.3 MB | 30/43 kBProgress (3): 12 kB | 0/1.3 MB | 30/43 kBProgress (3): 12 kB | 0/1.3 MB | 32/43 kBProgress (3): 12 kB | 0/1.3 MB | 32/43 kBProgress (3): 12 kB | 0/1.3 MB | 36/43 kBProgress (3): 12 kB | 0/1.3 MB | 40/43 kBProgress (3): 12 kB | 0/1.3 MB | 43 kB   Progress (3): 12 kB | 0/1.3 MB | 43 kBProgress (3): 12 kB | 0/1.3 MB | 43 kBProgress (3): 12 kB | 0/1.3 MB | 43 kBProgress (3): 12 kB | 0/1.3 MB | 43 kBProgress (3): 12 kB | 0.1/1.3 MB | 43 kBProgress (3): 12 kB | 0.1/1.3 MB | 43 kBProgress (3): 12 kB | 0.1/1.3 MB | 43 kBProgress (3): 12 kB | 0.1/1.3 MB | 43 kBProgress (3): 12 kB | 0.1/1.3 MB | 43 kBProgress (3): 12 kB | 0.1/1.3 MB | 43 kBProgress (3): 12 kB | 0.1/1.3 MB | 43 kBProgress (3): 12 kB | 0.1/1.3 MB | 43 kBProgress (3): 12 kB | 0.1/1.3 MB | 43 kB                                        Downloaded from central: https://repo.maven.apache.org/maven2/org/apache/ant/ant-launcher/1.7.1/ant-launcher-1.7.1.jar (12 kB at 867 kB/s)
Progress (2): 0.1/1.3 MB | 43 kBProgress (2): 0.1/1.3 MB | 43 kBProgress (2): 0.1/1.3 MB | 43 kBProgress (2): 0.1/1.3 MB | 43 kBProgress (2): 0.1/1.3 MB | 43 kBProgress (2): 0.1/1.3 MB | 43 kBProgress (2): 0.1/1.3 MB | 43 kBProgress (2): 0.1/1.3 MB | 43 kBProgress (2): 0.1/1.3 MB | 43 kBProgress (2): 0.1/1.3 MB | 43 kBProgress (2): 0.1/1.3 MB | 43 kBProgress (2): 0.1/1.3 MB | 43 kBProgress (2): 0.1/1.3 MB | 43 kBProgress (2): 0.1/1.3 MB | 43 kBProgress (2): 0.1/1.3 MB | 43 kB                                Downloaded from central: https://repo.maven.apache.org/maven2/org/codehaus/groovy/maven/runtime/gmaven-runtime-1.6/1.0/gmaven-runtime-1.6-1.0.jar (43 kB at 2.2 MB/s)
Progress (1): 0.2/1.3 MBProgress (1): 0.2/1.3 MBProgress (1): 0.2/1.3 MBProgress (1): 0.2/1.3 MBProgress (1): 0.2/1.3 MBProgress (1): 0.2/1.3 MBProgress (1): 0.2/1.3 MBProgress (1): 0.2/1.3 MBProgress (1): 0.2/1.3 MBProgress (1): 0.2/1.3 MBProgress (1): 0.2/1.3 MBProgress (1): 0.2/1.3 MBProgress (1): 0.2/1.3 MBProgress (1): 0.2/1.3 MBProgress (1): 0.2/1.3 MBProgress (1): 0.2/1.3 MBProgress (1): 0.2/1.3 MBProgress (1): 0.2/1.3 MBProgress (1): 0.2/1.3 MBProgress (1): 0.2/1.3 MBProgress (1): 0.2/1.3 MBProgress (1): 0.2/1.3 MBProgress (1): 0.2/1.3 MBProgress (1): 0.2/1.3 MBProgress (1): 0.2/1.3 MBProgress (1): 0.3/1.3 MBProgress (1): 0.3/1.3 MBProgress (1): 0.3/1.3 MBProgress (1): 0.3/1.3 MBProgress (1): 0.3/1.3 MBProgress (1): 0.3/1.3 MBProgress (1): 0.3/1.3 MBProgress (1): 0.3/1.3 MBProgress (1): 0.3/1.3 MBProgress (1): 0.3/1.3 MBProgress (1): 0.3/1.3 MBProgress (1): 0.3/1.3 MBProgress (1): 0.3/1.3 MBProgress (1): 0.3/1.3 MBProgress (1): 0.3/1.3 MBProgress (1): 0.3/1.3 MBProgress (1): 0.3/1.3 MBProgress (1): 0.3/1.3 MBProgress (1): 0.3/1.3 MBProgress (1): 0.3/1.3 MBProgress (1): 0.3/1.3 MBProgress (1): 0.3/1.3 MBProgress (1): 0.3/1.3 MBProgress (1): 0.3/1.3 MBProgress (1): 0.4/1.3 MBProgress (1): 0.4/1.3 MBProgress (1): 0.4/1.3 MBProgress (1): 0.4/1.3 MBProgress (1): 0.4/1.3 MBProgress (1): 0.4/1.3 MBProgress (1): 0.4/1.3 MBProgress (1): 0.4/1.3 MBProgress (1): 0.4/1.3 MBProgress (1): 0.4/1.3 MBProgress (1): 0.4/1.3 MBProgress (1): 0.4/1.3 MBProgress (1): 0.4/1.3 MBProgress (1): 0.4/1.3 MBProgress (1): 0.4/1.3 MBProgress (1): 0.4/1.3 MBProgress (1): 0.4/1.3 MBProgress (1): 0.4/1.3 MBProgress (1): 0.4/1.3 MBProgress (1): 0.4/1.3 MBProgress (1): 0.4/1.3 MBProgress (1): 0.4/1.3 MBProgress (1): 0.4/1.3 MBProgress (1): 0.4/1.3 MBProgress (1): 0.4/1.3 MBProgress (1): 0.5/1.3 MBProgress (1): 0.5/1.3 MBProgress (1): 0.5/1.3 MBProgress (1): 0.5/1.3 MBProgress (1): 0.5/1.3 MBProgress (1): 0.5/1.3 MBProgress (1): 0.5/1.3 MBProgress (1): 0.5/1.3 MBProgress (1): 0.5/1.3 MBProgress (1): 0.5/1.3 MBProgress (1): 0.5/1.3 MBProgress (1): 0.5/1.3 MBProgress (1): 0.5/1.3 MBProgress (1): 0.5/1.3 MBProgress (1): 0.5/1.3 MBProgress (1): 0.5/1.3 MBProgress (1): 0.5/1.3 MBProgress (1): 0.5/1.3 MBProgress (1): 0.5/1.3 MBProgress (1): 0.5/1.3 MBProgress (1): 0.5/1.3 MBProgress (1): 0.5/1.3 MBProgress (1): 0.5/1.3 MBProgress (1): 0.5/1.3 MBProgress (1): 0.6/1.3 MBProgress (1): 0.6/1.3 MBProgress (1): 0.6/1.3 MBProgress (1): 0.6/1.3 MBProgress (1): 0.6/1.3 MBProgress (1): 0.6/1.3 MBProgress (1): 0.6/1.3 MBProgress (1): 0.6/1.3 MBProgress (1): 0.6/1.3 MBProgress (1): 0.6/1.3 MBProgress (1): 0.6/1.3 MBProgress (1): 0.6/1.3 MBProgress (1): 0.6/1.3 MBProgress (1): 0.6/1.3 MBProgress (1): 0.6/1.3 MBProgress (1): 0.6/1.3 MBProgress (1): 0.6/1.3 MBProgress (1): 0.6/1.3 MBProgress (1): 0.6/1.3 MBProgress (1): 0.6/1.3 MBProgress (1): 0.6/1.3 MBProgress (1): 0.6/1.3 MBProgress (1): 0.6/1.3 MBProgress (1): 0.6/1.3 MBProgress (1): 0.7/1.3 MBProgress (1): 0.7/1.3 MBProgress (1): 0.7/1.3 MBProgress (1): 0.7/1.3 MBProgress (1): 0.7/1.3 MBProgress (1): 0.7/1.3 MBProgress (1): 0.7/1.3 MBProgress (1): 0.7/1.3 MBProgress (1): 0.7/1.3 MBProgress (1): 0.7/1.3 MBProgress (1): 0.7/1.3 MBProgress (1): 0.7/1.3 MBProgress (1): 0.7/1.3 MBProgress (1): 0.7/1.3 MBProgress (1): 0.7/1.3 MBProgress (1): 0.7/1.3 MBProgress (1): 0.7/1.3 MBProgress (1): 0.7/1.3 MBProgress (1): 0.7/1.3 MBProgress (1): 0.7/1.3 MBProgress (1): 0.7/1.3 MBProgress (1): 0.7/1.3 MBProgress (1): 0.7/1.3 MBProgress (1): 0.7/1.3 MBProgress (1): 0.7/1.3 MBProgress (1): 0.8/1.3 MBProgress (1): 0.8/1.3 MBProgress (1): 0.8/1.3 MBProgress (1): 0.8/1.3 MBProgress (1): 0.8/1.3 MBProgress (1): 0.8/1.3 MBProgress (1): 0.8/1.3 MBProgress (1): 0.8/1.3 MBProgress (1): 0.8/1.3 MBProgress (1): 0.8/1.3 MBProgress (1): 0.8/1.3 MBProgress (1): 0.8/1.3 MBProgress (1): 0.8/1.3 MBProgress (1): 0.8/1.3 MBProgress (1): 0.8/1.3 MBProgress (1): 0.8/1.3 MBProgress (1): 0.8/1.3 MBProgress (1): 0.8/1.3 MBProgress (1): 0.8/1.3 MBProgress (1): 0.8/1.3 MBProgress (1): 0.8/1.3 MBProgress (1): 0.8/1.3 MBProgress (1): 0.8/1.3 MBProgress (1): 0.8/1.3 MBProgress (1): 0.9/1.3 MBProgress (1): 0.9/1.3 MBProgress (1): 0.9/1.3 MBProgress (1): 0.9/1.3 MBProgress (1): 0.9/1.3 MBProgress (1): 0.9/1.3 MBProgress (1): 0.9/1.3 MBProgress (1): 0.9/1.3 MBProgress (1): 0.9/1.3 MBProgress (1): 0.9/1.3 MBProgress (1): 0.9/1.3 MBProgress (1): 0.9/1.3 MBProgress (1): 0.9/1.3 MBProgress (1): 0.9/1.3 MBProgress (1): 0.9/1.3 MBProgress (1): 0.9/1.3 MBProgress (1): 0.9/1.3 MBProgress (1): 0.9/1.3 MBProgress (1): 0.9/1.3 MBProgress (1): 0.9/1.3 MBProgress (1): 0.9/1.3 MBProgress (1): 0.9/1.3 MBProgress (1): 0.9/1.3 MBProgress (1): 0.9/1.3 MBProgress (1): 0.9/1.3 MBProgress (1): 1.0/1.3 MBProgress (1): 1.0/1.3 MBProgress (1): 1.0/1.3 MBProgress (1): 1.0/1.3 MBProgress (1): 1.0/1.3 MBProgress (1): 1.0/1.3 MBProgress (1): 1.0/1.3 MBProgress (1): 1.0/1.3 MBProgress (1): 1.0/1.3 MBProgress (1): 1.0/1.3 MBProgress (1): 1.0/1.3 MBProgress (1): 1.0/1.3 MBProgress (1): 1.0/1.3 MBProgress (1): 1.0/1.3 MBProgress (1): 1.0/1.3 MBProgress (1): 1.0/1.3 MBProgress (1): 1.0/1.3 MBProgress (1): 1.0/1.3 MBProgress (1): 1.0/1.3 MBProgress (1): 1.0/1.3 MBProgress (1): 1.0/1.3 MBProgress (1): 1.0/1.3 MBProgress (1): 1.0/1.3 MBProgress (1): 1.0/1.3 MBProgress (1): 1.1/1.3 MBProgress (1): 1.1/1.3 MBProgress (1): 1.1/1.3 MBProgress (1): 1.1/1.3 MBProgress (1): 1.1/1.3 MBProgress (1): 1.1/1.3 MBProgress (1): 1.1/1.3 MBProgress (1): 1.1/1.3 MBProgress (1): 1.1/1.3 MBProgress (1): 1.1/1.3 MBProgress (1): 1.1/1.3 MBProgress (1): 1.1/1.3 MBProgress (1): 1.1/1.3 MBProgress (1): 1.1/1.3 MBProgress (1): 1.1/1.3 MBProgress (1): 1.1/1.3 MBProgress (1): 1.1/1.3 MBProgress (1): 1.1/1.3 MBProgress (1): 1.1/1.3 MBProgress (1): 1.1/1.3 MBProgress (1): 1.1/1.3 MBProgress (1): 1.1/1.3 MBProgress (1): 1.1/1.3 MBProgress (1): 1.1/1.3 MBProgress (1): 1.2/1.3 MBProgress (1): 1.2/1.3 MBProgress (1): 1.2/1.3 MBProgress (1): 1.2/1.3 MBProgress (1): 1.2/1.3 MBProgress (1): 1.2/1.3 MBProgress (1): 1.2/1.3 MBProgress (1): 1.2/1.3 MBProgress (1): 1.2/1.3 MBProgress (1): 1.2/1.3 MBProgress (1): 1.2/1.3 MBProgress (1): 1.2/1.3 MBProgress (1): 1.2/1.3 MBProgress (1): 1.2/1.3 MBProgress (1): 1.2/1.3 MBProgress (1): 1.2/1.3 MBProgress (1): 1.2/1.3 MBProgress (1): 1.2/1.3 MBProgress (1): 1.2/1.3 MBProgress (1): 1.2/1.3 MBProgress (1): 1.2/1.3 MBProgress (1): 1.2/1.3 MBProgress (1): 1.2/1.3 MBProgress (1): 1.2/1.3 MBProgress (1): 1.2/1.3 MBProgress (1): 1.3/1.3 MBProgress (1): 1.3/1.3 MBProgress (1): 1.3/1.3 MBProgress (1): 1.3/1.3 MBProgress (1): 1.3/1.3 MBProgress (1): 1.3/1.3 MBProgress (1): 1.3/1.3 MBProgress (1): 1.3/1.3 MBProgress (1): 1.3/1.3 MBProgress (1): 1.3/1.3 MBProgress (1): 1.3/1.3 MBProgress (1): 1.3/1.3 MBProgress (1): 1.3/1.3 MBProgress (1): 1.3/1.3 MBProgress (1): 1.3/1.3 MBProgress (1): 1.3/1.3 MBProgress (1): 1.3/1.3 MBProgress (1): 1.3/1.3 MBProgress (1): 1.3 MB                        Downloaded from central: https://repo.maven.apache.org/maven2/org/apache/ant/ant/1.7.1/ant-1.7.1.jar (1.3 MB at 16 MB/s)
Progress (1): 0/4.4 MBProgress (1): 0/4.4 MBProgress (1): 0/4.4 MBProgress (1): 0/4.4 MBProgress (1): 0/4.4 MBProgress (1): 0/4.4 MBProgress (1): 0/4.4 MBProgress (1): 0/4.4 MBProgress (1): 0/4.4 MBProgress (1): 0/4.4 MBProgress (1): 0/4.4 MBProgress (1): 0/4.4 MBProgress (1): 0.1/4.4 MBProgress (1): 0.1/4.4 MBProgress (1): 0.1/4.4 MBProgress (1): 0.1/4.4 MBProgress (1): 0.1/4.4 MBProgress (1): 0.1/4.4 MBProgress (1): 0.1/4.4 MBProgress (1): 0.1/4.4 MBProgress (1): 0.1/4.4 MBProgress (1): 0.1/4.4 MBProgress (1): 0.1/4.4 MBProgress (1): 0.1/4.4 MBProgress (1): 0.1/4.4 MBProgress (1): 0.1/4.4 MBProgress (1): 0.1/4.4 MBProgress (1): 0.1/4.4 MBProgress (1): 0.1/4.4 MBProgress (1): 0.1/4.4 MBProgress (1): 0.1/4.4 MBProgress (1): 0.1/4.4 MBProgress (1): 0.1/4.4 MBProgress (1): 0.1/4.4 MBProgress (1): 0.1/4.4 MBProgress (1): 0.1/4.4 MBProgress (1): 0.2/4.4 MBProgress (1): 0.2/4.4 MBProgress (1): 0.2/4.4 MBProgress (1): 0.2/4.4 MBProgress (1): 0.2/4.4 MBProgress (1): 0.2/4.4 MBProgress (1): 0.2/4.4 MBProgress (1): 0.2/4.4 MBProgress (1): 0.2/4.4 MBProgress (1): 0.2/4.4 MBProgress (1): 0.2/4.4 MBProgress (1): 0.2/4.4 MBProgress (1): 0.2/4.4 MBProgress (1): 0.2/4.4 MBProgress (1): 0.2/4.4 MBProgress (1): 0.2/4.4 MBProgress (1): 0.2/4.4 MBProgress (1): 0.2/4.4 MBProgress (1): 0.2/4.4 MBProgress (1): 0.2/4.4 MBProgress (1): 0.2/4.4 MBProgress (1): 0.2/4.4 MBProgress (1): 0.2/4.4 MBProgress (1): 0.2/4.4 MBProgress (1): 0.2/4.4 MBProgress (1): 0.3/4.4 MBProgress (1): 0.3/4.4 MBProgress (1): 0.3/4.4 MBProgress (1): 0.3/4.4 MBProgress (1): 0.3/4.4 MBProgress (1): 0.3/4.4 MBProgress (1): 0.3/4.4 MBProgress (1): 0.3/4.4 MBProgress (1): 0.3/4.4 MBProgress (1): 0.3/4.4 MBProgress (1): 0.3/4.4 MBProgress (1): 0.3/4.4 MBProgress (1): 0.3/4.4 MBProgress (1): 0.3/4.4 MBProgress (1): 0.3/4.4 MBProgress (1): 0.3/4.4 MBProgress (1): 0.3/4.4 MBProgress (1): 0.3/4.4 MBProgress (1): 0.3/4.4 MBProgress (1): 0.3/4.4 MBProgress (1): 0.3/4.4 MBProgress (1): 0.3/4.4 MBProgress (1): 0.3/4.4 MBProgress (1): 0.3/4.4 MBProgress (1): 0.4/4.4 MBProgress (1): 0.4/4.4 MBProgress (1): 0.4/4.4 MBProgress (1): 0.4/4.4 MBProgress (1): 0.4/4.4 MBProgress (1): 0.4/4.4 MBProgress (1): 0.4/4.4 MBProgress (1): 0.4/4.4 MBProgress (1): 0.4/4.4 MBProgress (1): 0.4/4.4 MBProgress (1): 0.4/4.4 MBProgress (1): 0.4/4.4 MBProgress (1): 0.4/4.4 MBProgress (1): 0.4/4.4 MBProgress (1): 0.4/4.4 MBProgress (1): 0.4/4.4 MBProgress (1): 0.4/4.4 MBProgress (1): 0.4/4.4 MBProgress (1): 0.4/4.4 MBProgress (1): 0.4/4.4 MBProgress (1): 0.4/4.4 MBProgress (1): 0.4/4.4 MBProgress (1): 0.4/4.4 MBProgress (1): 0.4/4.4 MBProgress (1): 0.4/4.4 MBProgress (1): 0.5/4.4 MBProgress (1): 0.5/4.4 MBProgress (1): 0.5/4.4 MBProgress (1): 0.5/4.4 MBProgress (1): 0.5/4.4 MBProgress (1): 0.5/4.4 MBProgress (1): 0.5/4.4 MBProgress (1): 0.5/4.4 MBProgress (1): 0.5/4.4 MBProgress (1): 0.5/4.4 MBProgress (1): 0.5/4.4 MBProgress (1): 0.5/4.4 MBProgress (1): 0.5/4.4 MBProgress (1): 0.5/4.4 MBProgress (1): 0.5/4.4 MBProgress (1): 0.5/4.4 MBProgress (1): 0.5/4.4 MBProgress (1): 0.5/4.4 MBProgress (1): 0.5/4.4 MBProgress (1): 0.5/4.4 MBProgress (1): 0.5/4.4 MBProgress (1): 0.5/4.4 MBProgress (1): 0.5/4.4 MBProgress (1): 0.5/4.4 MBProgress (1): 0.6/4.4 MBProgress (1): 0.6/4.4 MBProgress (1): 0.6/4.4 MBProgress (1): 0.6/4.4 MBProgress (1): 0.6/4.4 MBProgress (1): 0.6/4.4 MBProgress (1): 0.6/4.4 MBProgress (1): 0.6/4.4 MBProgress (1): 0.6/4.4 MBProgress (1): 0.6/4.4 MBProgress (1): 0.6/4.4 MBProgress (1): 0.6/4.4 MBProgress (1): 0.6/4.4 MBProgress (1): 0.6/4.4 MBProgress (1): 0.6/4.4 MBProgress (1): 0.6/4.4 MBProgress (1): 0.6/4.4 MBProgress (1): 0.6/4.4 MBProgress (1): 0.6/4.4 MBProgress (1): 0.6/4.4 MBProgress (1): 0.6/4.4 MBProgress (1): 0.6/4.4 MBProgress (1): 0.6/4.4 MBProgress (1): 0.6/4.4 MBProgress (1): 0.7/4.4 MBProgress (1): 0.7/4.4 MBProgress (1): 0.7/4.4 MBProgress (1): 0.7/4.4 MBProgress (1): 0.7/4.4 MBProgress (1): 0.7/4.4 MBProgress (1): 0.7/4.4 MBProgress (1): 0.7/4.4 MBProgress (1): 0.7/4.4 MBProgress (1): 0.7/4.4 MBProgress (1): 0.7/4.4 MBProgress (1): 0.7/4.4 MBProgress (1): 0.7/4.4 MBProgress (1): 0.7/4.4 MBProgress (1): 0.7/4.4 MBProgress (1): 0.7/4.4 MBProgress (1): 0.7/4.4 MBProgress (1): 0.7/4.4 MBProgress (1): 0.7/4.4 MBProgress (1): 0.7/4.4 MBProgress (1): 0.7/4.4 MBProgress (1): 0.7/4.4 MBProgress (1): 0.7/4.4 MBProgress (1): 0.7/4.4 MBProgress (1): 0.7/4.4 MBProgress (1): 0.8/4.4 MBProgress (1): 0.8/4.4 MBProgress (1): 0.8/4.4 MBProgress (1): 0.8/4.4 MBProgress (1): 0.8/4.4 MBProgress (1): 0.8/4.4 MBProgress (1): 0.8/4.4 MBProgress (1): 0.8/4.4 MBProgress (1): 0.8/4.4 MBProgress (1): 0.8/4.4 MBProgress (1): 0.8/4.4 MBProgress (1): 0.8/4.4 MBProgress (1): 0.8/4.4 MBProgress (1): 0.8/4.4 MBProgress (1): 0.8/4.4 MBProgress (1): 0.8/4.4 MBProgress (1): 0.8/4.4 MBProgress (1): 0.8/4.4 MBProgress (1): 0.8/4.4 MBProgress (1): 0.8/4.4 MBProgress (1): 0.8/4.4 MBProgress (1): 0.8/4.4 MBProgress (1): 0.8/4.4 MBProgress (1): 0.8/4.4 MBProgress (1): 0.9/4.4 MBProgress (1): 0.9/4.4 MBProgress (1): 0.9/4.4 MBProgress (1): 0.9/4.4 MBProgress (1): 0.9/4.4 MBProgress (1): 0.9/4.4 MBProgress (1): 0.9/4.4 MBProgress (1): 0.9/4.4 MBProgress (1): 0.9/4.4 MBProgress (1): 0.9/4.4 MBProgress (1): 0.9/4.4 MBProgress (1): 0.9/4.4 MBProgress (1): 0.9/4.4 MBProgress (1): 0.9/4.4 MBProgress (1): 0.9/4.4 MBProgress (1): 0.9/4.4 MBProgress (1): 0.9/4.4 MBProgress (1): 0.9/4.4 MBProgress (1): 0.9/4.4 MBProgress (1): 0.9/4.4 MBProgress (1): 0.9/4.4 MBProgress (1): 0.9/4.4 MBProgress (1): 0.9/4.4 MBProgress (1): 0.9/4.4 MBProgress (1): 0.9/4.4 MBProgress (1): 1.0/4.4 MBProgress (1): 1.0/4.4 MBProgress (1): 1.0/4.4 MBProgress (1): 1.0/4.4 MBProgress (1): 1.0/4.4 MBProgress (1): 1.0/4.4 MBProgress (1): 1.0/4.4 MBProgress (1): 1.0/4.4 MBProgress (1): 1.0/4.4 MBProgress (1): 1.0/4.4 MBProgress (1): 1.0/4.4 MBProgress (1): 1.0/4.4 MBProgress (1): 1.0/4.4 MBProgress (1): 1.0/4.4 MBProgress (1): 1.0/4.4 MBProgress (1): 1.0/4.4 MBProgress (1): 1.0/4.4 MBProgress (1): 1.0/4.4 MBProgress (1): 1.0/4.4 MBProgress (1): 1.0/4.4 MBProgress (1): 1.0/4.4 MBProgress (1): 1.0/4.4 MBProgress (1): 1.0/4.4 MBProgress (1): 1.0/4.4 MBProgress (1): 1.1/4.4 MBProgress (1): 1.1/4.4 MBProgress (1): 1.1/4.4 MBProgress (1): 1.1/4.4 MBProgress (1): 1.1/4.4 MBProgress (1): 1.1/4.4 MBProgress (1): 1.1/4.4 MBProgress (1): 1.1/4.4 MBProgress (1): 1.1/4.4 MBProgress (1): 1.1/4.4 MBProgress (1): 1.1/4.4 MBProgress (1): 1.1/4.4 MBProgress (1): 1.1/4.4 MBProgress (1): 1.1/4.4 MBProgress (1): 1.1/4.4 MBProgress (1): 1.1/4.4 MBProgress (1): 1.1/4.4 MBProgress (1): 1.1/4.4 MBProgress (1): 1.1/4.4 MBProgress (1): 1.1/4.4 MBProgress (1): 1.1/4.4 MBProgress (1): 1.1/4.4 MBProgress (1): 1.1/4.4 MBProgress (1): 1.1/4.4 MBProgress (1): 1.2/4.4 MBProgress (1): 1.2/4.4 MBProgress (1): 1.2/4.4 MBProgress (1): 1.2/4.4 MBProgress (1): 1.2/4.4 MBProgress (1): 1.2/4.4 MBProgress (1): 1.2/4.4 MBProgress (1): 1.2/4.4 MBProgress (1): 1.2/4.4 MBProgress (1): 1.2/4.4 MBProgress (1): 1.2/4.4 MBProgress (1): 1.2/4.4 MBProgress (1): 1.2/4.4 MBProgress (1): 1.2/4.4 MBProgress (1): 1.2/4.4 MBProgress (1): 1.2/4.4 MBProgress (1): 1.2/4.4 MBProgress (1): 1.2/4.4 MBProgress (1): 1.2/4.4 MBProgress (1): 1.2/4.4 MBProgress (1): 1.2/4.4 MBProgress (1): 1.2/4.4 MBProgress (1): 1.2/4.4 MBProgress (1): 1.2/4.4 MBProgress (1): 1.2/4.4 MBProgress (1): 1.3/4.4 MBProgress (1): 1.3/4.4 MBProgress (1): 1.3/4.4 MBProgress (1): 1.3/4.4 MBProgress (1): 1.3/4.4 MBProgress (1): 1.3/4.4 MBProgress (1): 1.3/4.4 MBProgress (1): 1.3/4.4 MBProgress (1): 1.3/4.4 MBProgress (1): 1.3/4.4 MBProgress (1): 1.3/4.4 MBProgress (1): 1.3/4.4 MBProgress (1): 1.3/4.4 MBProgress (1): 1.3/4.4 MBProgress (1): 1.3/4.4 MBProgress (1): 1.3/4.4 MBProgress (1): 1.3/4.4 MBProgress (1): 1.3/4.4 MBProgress (1): 1.3/4.4 MBProgress (1): 1.3/4.4 MBProgress (1): 1.3/4.4 MBProgress (1): 1.3/4.4 MBProgress (1): 1.3/4.4 MBProgress (1): 1.3/4.4 MBProgress (1): 1.4/4.4 MBProgress (1): 1.4/4.4 MBProgress (1): 1.4/4.4 MBProgress (1): 1.4/4.4 MBProgress (1): 1.4/4.4 MBProgress (1): 1.4/4.4 MBProgress (1): 1.4/4.4 MBProgress (1): 1.4/4.4 MBProgress (1): 1.4/4.4 MBProgress (1): 1.4/4.4 MBProgress (1): 1.4/4.4 MBProgress (1): 1.4/4.4 MBProgress (1): 1.4/4.4 MBProgress (1): 1.4/4.4 MBProgress (1): 1.4/4.4 MBProgress (1): 1.4/4.4 MBProgress (1): 1.4/4.4 MBProgress (1): 1.4/4.4 MBProgress (1): 1.4/4.4 MBProgress (1): 1.4/4.4 MBProgress (1): 1.4/4.4 MBProgress (1): 1.4/4.4 MBProgress (1): 1.4/4.4 MBProgress (1): 1.4/4.4 MBProgress (1): 1.4/4.4 MBProgress (1): 1.5/4.4 MBProgress (1): 1.5/4.4 MBProgress (1): 1.5/4.4 MBProgress (1): 1.5/4.4 MBProgress (1): 1.5/4.4 MBProgress (1): 1.5/4.4 MBProgress (1): 1.5/4.4 MBProgress (1): 1.5/4.4 MBProgress (1): 1.5/4.4 MBProgress (1): 1.5/4.4 MBProgress (1): 1.5/4.4 MBProgress (1): 1.5/4.4 MBProgress (1): 1.5/4.4 MBProgress (1): 1.5/4.4 MBProgress (1): 1.5/4.4 MBProgress (1): 1.5/4.4 MBProgress (1): 1.5/4.4 MBProgress (1): 1.5/4.4 MBProgress (1): 1.5/4.4 MBProgress (1): 1.5/4.4 MBProgress (1): 1.5/4.4 MBProgress (1): 1.5/4.4 MBProgress (1): 1.5/4.4 MBProgress (1): 1.5/4.4 MBProgress (1): 1.6/4.4 MBProgress (1): 1.6/4.4 MBProgress (1): 1.6/4.4 MBProgress (1): 1.6/4.4 MBProgress (1): 1.6/4.4 MBProgress (1): 1.6/4.4 MBProgress (1): 1.6/4.4 MBProgress (1): 1.6/4.4 MBProgress (1): 1.6/4.4 MBProgress (1): 1.6/4.4 MBProgress (1): 1.6/4.4 MBProgress (1): 1.6/4.4 MBProgress (1): 1.6/4.4 MBProgress (1): 1.6/4.4 MBProgress (1): 1.6/4.4 MBProgress (1): 1.6/4.4 MBProgress (1): 1.6/4.4 MBProgress (1): 1.6/4.4 MBProgress (1): 1.6/4.4 MBProgress (1): 1.6/4.4 MBProgress (1): 1.6/4.4 MBProgress (1): 1.6/4.4 MBProgress (1): 1.6/4.4 MBProgress (1): 1.6/4.4 MBProgress (1): 1.7/4.4 MBProgress (1): 1.7/4.4 MBProgress (1): 1.7/4.4 MBProgress (1): 1.7/4.4 MBProgress (1): 1.7/4.4 MBProgress (1): 1.7/4.4 MBProgress (1): 1.7/4.4 MBProgress (1): 1.7/4.4 MBProgress (1): 1.7/4.4 MBProgress (1): 1.7/4.4 MBProgress (1): 1.7/4.4 MBProgress (1): 1.7/4.4 MBProgress (1): 1.7/4.4 MBProgress (1): 1.7/4.4 MBProgress (1): 1.7/4.4 MBProgress (1): 1.7/4.4 MBProgress (1): 1.7/4.4 MBProgress (1): 1.7/4.4 MBProgress (1): 1.7/4.4 MBProgress (1): 1.7/4.4 MBProgress (1): 1.7/4.4 MBProgress (1): 1.7/4.4 MBProgress (1): 1.7/4.4 MBProgress (1): 1.7/4.4 MBProgress (1): 1.7/4.4 MBProgress (1): 1.8/4.4 MBProgress (1): 1.8/4.4 MBProgress (1): 1.8/4.4 MBProgress (1): 1.8/4.4 MBProgress (1): 1.8/4.4 MBProgress (1): 1.8/4.4 MBProgress (1): 1.8/4.4 MBProgress (1): 1.8/4.4 MBProgress (1): 1.8/4.4 MBProgress (1): 1.8/4.4 MBProgress (1): 1.8/4.4 MBProgress (1): 1.8/4.4 MBProgress (1): 1.8/4.4 MBProgress (1): 1.8/4.4 MBProgress (1): 1.8/4.4 MBProgress (1): 1.8/4.4 MBProgress (1): 1.8/4.4 MBProgress (1): 1.8/4.4 MBProgress (1): 1.8/4.4 MBProgress (1): 1.8/4.4 MBProgress (1): 1.8/4.4 MBProgress (1): 1.8/4.4 MBProgress (1): 1.8/4.4 MBProgress (1): 1.8/4.4 MBProgress (1): 1.9/4.4 MBProgress (1): 1.9/4.4 MBProgress (1): 1.9/4.4 MBProgress (1): 1.9/4.4 MBProgress (1): 1.9/4.4 MBProgress (1): 1.9/4.4 MBProgress (1): 1.9/4.4 MBProgress (1): 1.9/4.4 MBProgress (1): 1.9/4.4 MBProgress (1): 1.9/4.4 MBProgress (1): 1.9/4.4 MBProgress (1): 1.9/4.4 MBProgress (1): 1.9/4.4 MBProgress (1): 1.9/4.4 MBProgress (1): 1.9/4.4 MBProgress (1): 1.9/4.4 MBProgress (1): 1.9/4.4 MBProgress (1): 1.9/4.4 MBProgress (1): 1.9/4.4 MBProgress (1): 1.9/4.4 MBProgress (1): 1.9/4.4 MBProgress (1): 1.9/4.4 MBProgress (1): 1.9/4.4 MBProgress (1): 1.9/4.4 MBProgress (1): 1.9/4.4 MBProgress (1): 2.0/4.4 MBProgress (1): 2.0/4.4 MBProgress (1): 2.0/4.4 MBProgress (1): 2.0/4.4 MBProgress (1): 2.0/4.4 MBProgress (1): 2.0/4.4 MBProgress (1): 2.0/4.4 MBProgress (1): 2.0/4.4 MBProgress (1): 2.0/4.4 MBProgress (1): 2.0/4.4 MBProgress (1): 2.0/4.4 MBProgress (1): 2.0/4.4 MBProgress (1): 2.0/4.4 MBProgress (1): 2.0/4.4 MBProgress (1): 2.0/4.4 MBProgress (1): 2.0/4.4 MBProgress (1): 2.0/4.4 MBProgress (1): 2.0/4.4 MBProgress (1): 2.0/4.4 MBProgress (1): 2.0/4.4 MBProgress (1): 2.0/4.4 MBProgress (1): 2.0/4.4 MBProgress (1): 2.0/4.4 MBProgress (1): 2.0/4.4 MBProgress (1): 2.1/4.4 MBProgress (1): 2.1/4.4 MBProgress (1): 2.1/4.4 MBProgress (1): 2.1/4.4 MBProgress (1): 2.1/4.4 MBProgress (1): 2.1/4.4 MBProgress (1): 2.1/4.4 MBProgress (1): 2.1/4.4 MBProgress (1): 2.1/4.4 MBProgress (1): 2.1/4.4 MBProgress (1): 2.1/4.4 MBProgress (1): 2.1/4.4 MBProgress (1): 2.1/4.4 MBProgress (1): 2.1/4.4 MBProgress (1): 2.1/4.4 MBProgress (1): 2.1/4.4 MBProgress (1): 2.1/4.4 MBProgress (1): 2.1/4.4 MBProgress (1): 2.1/4.4 MBProgress (1): 2.1/4.4 MBProgress (1): 2.1/4.4 MBProgress (1): 2.1/4.4 MBProgress (1): 2.1/4.4 MBProgress (1): 2.1/4.4 MBProgress (1): 2.1/4.4 MBProgress (1): 2.2/4.4 MBProgress (1): 2.2/4.4 MBProgress (1): 2.2/4.4 MBProgress (1): 2.2/4.4 MBProgress (1): 2.2/4.4 MBProgress (1): 2.2/4.4 MBProgress (1): 2.2/4.4 MBProgress (1): 2.2/4.4 MBProgress (1): 2.2/4.4 MBProgress (1): 2.2/4.4 MBProgress (1): 2.2/4.4 MBProgress (1): 2.2/4.4 MBProgress (1): 2.2/4.4 MBProgress (1): 2.2/4.4 MBProgress (1): 2.2/4.4 MBProgress (1): 2.2/4.4 MBProgress (1): 2.2/4.4 MBProgress (1): 2.2/4.4 MBProgress (1): 2.2/4.4 MBProgress (1): 2.2/4.4 MBProgress (1): 2.2/4.4 MBProgress (1): 2.2/4.4 MBProgress (1): 2.2/4.4 MBProgress (1): 2.2/4.4 MBProgress (1): 2.3/4.4 MBProgress (1): 2.3/4.4 MBProgress (1): 2.3/4.4 MBProgress (1): 2.3/4.4 MBProgress (1): 2.3/4.4 MBProgress (1): 2.3/4.4 MBProgress (1): 2.3/4.4 MBProgress (1): 2.3/4.4 MBProgress (1): 2.3/4.4 MBProgress (1): 2.3/4.4 MBProgress (1): 2.3/4.4 MBProgress (1): 2.3/4.4 MBProgress (1): 2.3/4.4 MBProgress (1): 2.3/4.4 MBProgress (1): 2.3/4.4 MBProgress (1): 2.3/4.4 MBProgress (1): 2.3/4.4 MBProgress (1): 2.3/4.4 MBProgress (1): 2.3/4.4 MBProgress (1): 2.3/4.4 MBProgress (1): 2.3/4.4 MBProgress (1): 2.3/4.4 MBProgress (1): 2.3/4.4 MBProgress (1): 2.3/4.4 MBProgress (1): 2.4/4.4 MBProgress (1): 2.4/4.4 MBProgress (1): 2.4/4.4 MBProgress (1): 2.4/4.4 MBProgress (1): 2.4/4.4 MBProgress (1): 2.4/4.4 MBProgress (1): 2.4/4.4 MBProgress (1): 2.4/4.4 MBProgress (1): 2.4/4.4 MBProgress (1): 2.4/4.4 MBProgress (1): 2.4/4.4 MBProgress (1): 2.4/4.4 MBProgress (1): 2.4/4.4 MBProgress (1): 2.4/4.4 MBProgress (1): 2.4/4.4 MBProgress (1): 2.4/4.4 MBProgress (1): 2.4/4.4 MBProgress (1): 2.4/4.4 MBProgress (1): 2.4/4.4 MBProgress (1): 2.4/4.4 MBProgress (1): 2.4/4.4 MBProgress (1): 2.4/4.4 MBProgress (1): 2.4/4.4 MBProgress (1): 2.4/4.4 MBProgress (1): 2.4/4.4 MBProgress (1): 2.5/4.4 MBProgress (1): 2.5/4.4 MBProgress (1): 2.5/4.4 MBProgress (1): 2.5/4.4 MBProgress (1): 2.5/4.4 MBProgress (1): 2.5/4.4 MBProgress (1): 2.5/4.4 MBProgress (1): 2.5/4.4 MBProgress (1): 2.5/4.4 MBProgress (1): 2.5/4.4 MBProgress (1): 2.5/4.4 MBProgress (1): 2.5/4.4 MBProgress (1): 2.5/4.4 MBProgress (1): 2.5/4.4 MBProgress (1): 2.5/4.4 MBProgress (1): 2.5/4.4 MBProgress (1): 2.5/4.4 MBProgress (1): 2.5/4.4 MBProgress (1): 2.5/4.4 MBProgress (1): 2.5/4.4 MBProgress (1): 2.5/4.4 MBProgress (1): 2.5/4.4 MBProgress (1): 2.5/4.4 MBProgress (1): 2.5/4.4 MBProgress (1): 2.6/4.4 MBProgress (1): 2.6/4.4 MBProgress (1): 2.6/4.4 MBProgress (1): 2.6/4.4 MBProgress (1): 2.6/4.4 MBProgress (1): 2.6/4.4 MBProgress (1): 2.6/4.4 MBProgress (1): 2.6/4.4 MBProgress (1): 2.6/4.4 MBProgress (1): 2.6/4.4 MBProgress (1): 2.6/4.4 MBProgress (1): 2.6/4.4 MBProgress (1): 2.6/4.4 MBProgress (1): 2.6/4.4 MBProgress (1): 2.6/4.4 MBProgress (1): 2.6/4.4 MBProgress (1): 2.6/4.4 MBProgress (1): 2.6/4.4 MBProgress (1): 2.6/4.4 MBProgress (1): 2.6/4.4 MBProgress (1): 2.6/4.4 MBProgress (1): 2.6/4.4 MBProgress (1): 2.6/4.4 MBProgress (1): 2.6/4.4 MBProgress (1): 2.6/4.4 MBProgress (1): 2.7/4.4 MBProgress (1): 2.7/4.4 MBProgress (1): 2.7/4.4 MBProgress (1): 2.7/4.4 MBProgress (1): 2.7/4.4 MBProgress (1): 2.7/4.4 MBProgress (1): 2.7/4.4 MBProgress (1): 2.7/4.4 MBProgress (1): 2.7/4.4 MBProgress (1): 2.7/4.4 MBProgress (1): 2.7/4.4 MBProgress (1): 2.7/4.4 MBProgress (1): 2.7/4.4 MBProgress (1): 2.7/4.4 MBProgress (1): 2.7/4.4 MBProgress (1): 2.7/4.4 MBProgress (1): 2.7/4.4 MBProgress (1): 2.7/4.4 MBProgress (1): 2.7/4.4 MBProgress (1): 2.7/4.4 MBProgress (1): 2.7/4.4 MBProgress (1): 2.7/4.4 MBProgress (1): 2.7/4.4 MBProgress (1): 2.7/4.4 MBProgress (1): 2.8/4.4 MBProgress (1): 2.8/4.4 MBProgress (1): 2.8/4.4 MBProgress (1): 2.8/4.4 MBProgress (1): 2.8/4.4 MBProgress (1): 2.8/4.4 MBProgress (1): 2.8/4.4 MBProgress (1): 2.8/4.4 MBProgress (1): 2.8/4.4 MBProgress (1): 2.8/4.4 MBProgress (1): 2.8/4.4 MBProgress (1): 2.8/4.4 MBProgress (1): 2.8/4.4 MBProgress (1): 2.8/4.4 MBProgress (1): 2.8/4.4 MBProgress (1): 2.8/4.4 MBProgress (1): 2.8/4.4 MBProgress (1): 2.8/4.4 MBProgress (1): 2.8/4.4 MBProgress (1): 2.8/4.4 MBProgress (1): 2.8/4.4 MBProgress (1): 2.8/4.4 MBProgress (1): 2.8/4.4 MBProgress (1): 2.8/4.4 MBProgress (1): 2.9/4.4 MBProgress (1): 2.9/4.4 MBProgress (1): 2.9/4.4 MBProgress (1): 2.9/4.4 MBProgress (1): 2.9/4.4 MBProgress (1): 2.9/4.4 MBProgress (1): 2.9/4.4 MBProgress (1): 2.9/4.4 MBProgress (1): 2.9/4.4 MBProgress (1): 2.9/4.4 MBProgress (1): 2.9/4.4 MBProgress (1): 2.9/4.4 MBProgress (1): 2.9/4.4 MBProgress (1): 2.9/4.4 MBProgress (1): 2.9/4.4 MBProgress (1): 2.9/4.4 MBProgress (1): 2.9/4.4 MBProgress (1): 2.9/4.4 MBProgress (1): 2.9/4.4 MBProgress (1): 2.9/4.4 MBProgress (1): 2.9/4.4 MBProgress (1): 2.9/4.4 MBProgress (1): 2.9/4.4 MBProgress (1): 2.9/4.4 MBProgress (1): 2.9/4.4 MBProgress (1): 3.0/4.4 MBProgress (1): 3.0/4.4 MBProgress (1): 3.0/4.4 MBProgress (1): 3.0/4.4 MBProgress (1): 3.0/4.4 MBProgress (1): 3.0/4.4 MBProgress (1): 3.0/4.4 MBProgress (1): 3.0/4.4 MBProgress (1): 3.0/4.4 MBProgress (1): 3.0/4.4 MBProgress (1): 3.0/4.4 MBProgress (1): 3.0/4.4 MBProgress (1): 3.0/4.4 MBProgress (1): 3.0/4.4 MBProgress (1): 3.0/4.4 MBProgress (1): 3.0/4.4 MBProgress (1): 3.0/4.4 MBProgress (1): 3.0/4.4 MBProgress (1): 3.0/4.4 MBProgress (1): 3.0/4.4 MBProgress (1): 3.0/4.4 MBProgress (1): 3.0/4.4 MBProgress (1): 3.0/4.4 MBProgress (1): 3.0/4.4 MBProgress (1): 3.1/4.4 MBProgress (1): 3.1/4.4 MBProgress (1): 3.1/4.4 MBProgress (1): 3.1/4.4 MBProgress (1): 3.1/4.4 MBProgress (1): 3.1/4.4 MBProgress (1): 3.1/4.4 MBProgress (1): 3.1/4.4 MBProgress (1): 3.1/4.4 MBProgress (1): 3.1/4.4 MBProgress (1): 3.1/4.4 MBProgress (1): 3.1/4.4 MBProgress (1): 3.1/4.4 MBProgress (1): 3.1/4.4 MBProgress (1): 3.1/4.4 MBProgress (1): 3.1/4.4 MBProgress (1): 3.1/4.4 MBProgress (1): 3.1/4.4 MBProgress (1): 3.1/4.4 MBProgress (1): 3.1/4.4 MBProgress (1): 3.1/4.4 MBProgress (1): 3.1/4.4 MBProgress (1): 3.1/4.4 MBProgress (1): 3.1/4.4 MBProgress (1): 3.1/4.4 MBProgress (1): 3.2/4.4 MBProgress (1): 3.2/4.4 MBProgress (1): 3.2/4.4 MBProgress (1): 3.2/4.4 MBProgress (1): 3.2/4.4 MBProgress (1): 3.2/4.4 MBProgress (1): 3.2/4.4 MBProgress (1): 3.2/4.4 MBProgress (1): 3.2/4.4 MBProgress (1): 3.2/4.4 MBProgress (1): 3.2/4.4 MBProgress (1): 3.2/4.4 MBProgress (1): 3.2/4.4 MBProgress (1): 3.2/4.4 MBProgress (1): 3.2/4.4 MBProgress (1): 3.2/4.4 MBProgress (1): 3.2/4.4 MBProgress (1): 3.2/4.4 MBProgress (1): 3.2/4.4 MBProgress (1): 3.2/4.4 MBProgress (1): 3.2/4.4 MBProgress (1): 3.2/4.4 MBProgress (1): 3.2/4.4 MBProgress (1): 3.2/4.4 MBProgress (1): 3.3/4.4 MBProgress (1): 3.3/4.4 MBProgress (1): 3.3/4.4 MBProgress (1): 3.3/4.4 MBProgress (1): 3.3/4.4 MBProgress (1): 3.3/4.4 MBProgress (1): 3.3/4.4 MBProgress (1): 3.3/4.4 MBProgress (1): 3.3/4.4 MBProgress (1): 3.3/4.4 MBProgress (1): 3.3/4.4 MBProgress (1): 3.3/4.4 MBProgress (1): 3.3/4.4 MBProgress (1): 3.3/4.4 MBProgress (1): 3.3/4.4 MBProgress (1): 3.3/4.4 MBProgress (1): 3.3/4.4 MBProgress (1): 3.3/4.4 MBProgress (1): 3.3/4.4 MBProgress (1): 3.3/4.4 MBProgress (1): 3.3/4.4 MBProgress (1): 3.3/4.4 MBProgress (1): 3.3/4.4 MBProgress (1): 3.3/4.4 MBProgress (1): 3.3/4.4 MBProgress (1): 3.4/4.4 MBProgress (1): 3.4/4.4 MBProgress (1): 3.4/4.4 MBProgress (1): 3.4/4.4 MBProgress (1): 3.4/4.4 MBProgress (1): 3.4/4.4 MBProgress (1): 3.4/4.4 MBProgress (1): 3.4/4.4 MBProgress (1): 3.4/4.4 MBProgress (1): 3.4/4.4 MBProgress (1): 3.4/4.4 MBProgress (1): 3.4/4.4 MBProgress (1): 3.4/4.4 MBProgress (1): 3.4/4.4 MBProgress (1): 3.4/4.4 MBProgress (1): 3.4/4.4 MBProgress (1): 3.4/4.4 MBProgress (1): 3.4/4.4 MBProgress (1): 3.4/4.4 MBProgress (1): 3.4/4.4 MBProgress (1): 3.4/4.4 MBProgress (1): 3.4/4.4 MBProgress (1): 3.4/4.4 MBProgress (1): 3.4/4.4 MBProgress (1): 3.5/4.4 MBProgress (1): 3.5/4.4 MBProgress (1): 3.5/4.4 MBProgress (1): 3.5/4.4 MBProgress (1): 3.5/4.4 MBProgress (1): 3.5/4.4 MBProgress (1): 3.5/4.4 MBProgress (1): 3.5/4.4 MBProgress (1): 3.5/4.4 MBProgress (1): 3.5/4.4 MBProgress (1): 3.5/4.4 MBProgress (1): 3.5/4.4 MBProgress (1): 3.5/4.4 MBProgress (1): 3.5/4.4 MBProgress (1): 3.5/4.4 MBProgress (1): 3.5/4.4 MBProgress (1): 3.5/4.4 MBProgress (1): 3.5/4.4 MBProgress (1): 3.5/4.4 MBProgress (1): 3.5/4.4 MBProgress (1): 3.5/4.4 MBProgress (1): 3.5/4.4 MBProgress (1): 3.5/4.4 MBProgress (1): 3.5/4.4 MBProgress (1): 3.6/4.4 MBProgress (1): 3.6/4.4 MBProgress (1): 3.6/4.4 MBProgress (1): 3.6/4.4 MBProgress (1): 3.6/4.4 MBProgress (1): 3.6/4.4 MBProgress (1): 3.6/4.4 MBProgress (1): 3.6/4.4 MBProgress (1): 3.6/4.4 MBProgress (1): 3.6/4.4 MBProgress (1): 3.6/4.4 MBProgress (1): 3.6/4.4 MBProgress (1): 3.6/4.4 MBProgress (1): 3.6/4.4 MBProgress (1): 3.6/4.4 MBProgress (1): 3.6/4.4 MBProgress (1): 3.6/4.4 MBProgress (1): 3.6/4.4 MBProgress (1): 3.6/4.4 MBProgress (1): 3.6/4.4 MBProgress (1): 3.6/4.4 MBProgress (1): 3.6/4.4 MBProgress (1): 3.6/4.4 MBProgress (1): 3.6/4.4 MBProgress (1): 3.6/4.4 MBProgress (1): 3.7/4.4 MBProgress (1): 3.7/4.4 MBProgress (1): 3.7/4.4 MBProgress (1): 3.7/4.4 MBProgress (1): 3.7/4.4 MBProgress (1): 3.7/4.4 MBProgress (1): 3.7/4.4 MBProgress (1): 3.7/4.4 MBProgress (1): 3.7/4.4 MBProgress (1): 3.7/4.4 MBProgress (1): 3.7/4.4 MBProgress (1): 3.7/4.4 MBProgress (1): 3.7/4.4 MBProgress (1): 3.7/4.4 MBProgress (1): 3.7/4.4 MBProgress (1): 3.7/4.4 MBProgress (1): 3.7/4.4 MBProgress (1): 3.7/4.4 MBProgress (1): 3.7/4.4 MBProgress (1): 3.7/4.4 MBProgress (1): 3.7/4.4 MBProgress (1): 3.7/4.4 MBProgress (1): 3.7/4.4 MBProgress (1): 3.7/4.4 MBProgress (1): 3.8/4.4 MBProgress (1): 3.8/4.4 MBProgress (1): 3.8/4.4 MBProgress (1): 3.8/4.4 MBProgress (1): 3.8/4.4 MBProgress (1): 3.8/4.4 MBProgress (1): 3.8/4.4 MBProgress (1): 3.8/4.4 MBProgress (1): 3.8/4.4 MBProgress (1): 3.8/4.4 MBProgress (1): 3.8/4.4 MBProgress (1): 3.8/4.4 MBProgress (1): 3.8/4.4 MBProgress (1): 3.8/4.4 MBProgress (1): 3.8/4.4 MBProgress (1): 3.8/4.4 MBProgress (1): 3.8/4.4 MBProgress (1): 3.8/4.4 MBProgress (1): 3.8/4.4 MBProgress (1): 3.8/4.4 MBProgress (1): 3.8/4.4 MBProgress (1): 3.8/4.4 MBProgress (1): 3.8/4.4 MBProgress (1): 3.8/4.4 MBProgress (1): 3.8/4.4 MBProgress (1): 3.9/4.4 MBProgress (1): 3.9/4.4 MBProgress (1): 3.9/4.4 MBProgress (1): 3.9/4.4 MBProgress (1): 3.9/4.4 MBProgress (1): 3.9/4.4 MBProgress (1): 3.9/4.4 MBProgress (1): 3.9/4.4 MBProgress (1): 3.9/4.4 MBProgress (1): 3.9/4.4 MBProgress (1): 3.9/4.4 MBProgress (1): 3.9/4.4 MBProgress (1): 3.9/4.4 MBProgress (1): 3.9/4.4 MBProgress (1): 3.9/4.4 MBProgress (1): 3.9/4.4 MBProgress (1): 3.9/4.4 MBProgress (1): 3.9/4.4 MBProgress (1): 3.9/4.4 MBProgress (1): 3.9/4.4 MBProgress (1): 3.9/4.4 MBProgress (1): 3.9/4.4 MBProgress (1): 3.9/4.4 MBProgress (1): 3.9/4.4 MBProgress (1): 4.0/4.4 MBProgress (1): 4.0/4.4 MBProgress (1): 4.0/4.4 MBProgress (1): 4.0/4.4 MBProgress (1): 4.0/4.4 MBProgress (1): 4.0/4.4 MBProgress (1): 4.0/4.4 MBProgress (1): 4.0/4.4 MBProgress (1): 4.0/4.4 MBProgress (1): 4.0/4.4 MBProgress (1): 4.0/4.4 MBProgress (1): 4.0/4.4 MBProgress (1): 4.0/4.4 MBProgress (1): 4.0/4.4 MBProgress (1): 4.0/4.4 MBProgress (1): 4.0/4.4 MBProgress (1): 4.0/4.4 MBProgress (1): 4.0/4.4 MBProgress (1): 4.0/4.4 MBProgress (1): 4.0/4.4 MBProgress (1): 4.0/4.4 MBProgress (1): 4.0/4.4 MBProgress (1): 4.0/4.4 MBProgress (1): 4.0/4.4 MBProgress (1): 4.1/4.4 MBProgress (1): 4.1/4.4 MBProgress (1): 4.1/4.4 MBProgress (1): 4.1/4.4 MBProgress (1): 4.1/4.4 MBProgress (1): 4.1/4.4 MBProgress (1): 4.1/4.4 MBProgress (1): 4.1/4.4 MBProgress (1): 4.1/4.4 MBProgress (1): 4.1/4.4 MBProgress (1): 4.1/4.4 MBProgress (1): 4.1/4.4 MBProgress (1): 4.1/4.4 MBProgress (1): 4.1/4.4 MBProgress (1): 4.1/4.4 MBProgress (1): 4.1/4.4 MBProgress (1): 4.1/4.4 MBProgress (1): 4.1/4.4 MBProgress (1): 4.1/4.4 MBProgress (1): 4.1/4.4 MBProgress (1): 4.1/4.4 MBProgress (1): 4.1/4.4 MBProgress (1): 4.1/4.4 MBProgress (1): 4.1/4.4 MBProgress (1): 4.1/4.4 MBProgress (1): 4.2/4.4 MBProgress (1): 4.2/4.4 MBProgress (1): 4.2/4.4 MBProgress (1): 4.2/4.4 MBProgress (1): 4.2/4.4 MBProgress (1): 4.2/4.4 MBProgress (1): 4.2/4.4 MBProgress (1): 4.2/4.4 MBProgress (1): 4.2/4.4 MBProgress (1): 4.2/4.4 MBProgress (1): 4.2/4.4 MBProgress (1): 4.2/4.4 MBProgress (1): 4.2/4.4 MBProgress (1): 4.2/4.4 MBProgress (1): 4.2/4.4 MBProgress (1): 4.2/4.4 MBProgress (1): 4.2/4.4 MBProgress (1): 4.2/4.4 MBProgress (1): 4.2/4.4 MBProgress (1): 4.2/4.4 MBProgress (1): 4.2/4.4 MBProgress (1): 4.2/4.4 MBProgress (1): 4.2/4.4 MBProgress (1): 4.2/4.4 MBProgress (1): 4.3/4.4 MBProgress (1): 4.3/4.4 MBProgress (1): 4.3/4.4 MBProgress (1): 4.3/4.4 MBProgress (1): 4.3/4.4 MBProgress (1): 4.3/4.4 MBProgress (1): 4.3/4.4 MBProgress (1): 4.3/4.4 MBProgress (1): 4.3/4.4 MBProgress (1): 4.3/4.4 MBProgress (1): 4.3/4.4 MBProgress (1): 4.3/4.4 MBProgress (1): 4.3/4.4 MBProgress (1): 4.3/4.4 MBProgress (1): 4.3/4.4 MBProgress (1): 4.3/4.4 MBProgress (1): 4.3/4.4 MBProgress (1): 4.3/4.4 MBProgress (1): 4.3/4.4 MBProgress (1): 4.3/4.4 MBProgress (1): 4.3/4.4 MBProgress (1): 4.3/4.4 MBProgress (1): 4.3/4.4 MBProgress (1): 4.3/4.4 MBProgress (1): 4.3/4.4 MBProgress (1): 4.4/4.4 MBProgress (1): 4.4/4.4 MBProgress (1): 4.4/4.4 MBProgress (1): 4.4/4.4 MBProgress (1): 4.4/4.4 MBProgress (1): 4.4/4.4 MBProgress (1): 4.4/4.4 MBProgress (1): 4.4/4.4 MBProgress (1): 4.4/4.4 MBProgress (1): 4.4/4.4 MBProgress (1): 4.4 MB                        Downloaded from central: https://repo.maven.apache.org/maven2/org/codehaus/groovy/groovy-all/1.6.0/groovy-all-1.6.0.jar (4.4 MB at 6.9 MB/s)
[INFO] 
[INFO] --- maven-site-plugin:3.3:attach-descriptor (attach-descriptor) @ hama-pipes ---
[INFO] 
[INFO] --- apache-rat-plugin:0.10:check (default) @ hama-pipes ---
[INFO] 51 implicit excludes (use -debug for more details).
[INFO] Exclude: **/*.md
[INFO] Exclude: .idea/**
[INFO] Exclude: .git/**
[INFO] Exclude: .repository/**
[INFO] Exclude: .gitignore
[INFO] Exclude: **/.classpath/**
[INFO] Exclude: **/.project
[INFO] Exclude: **/*.iml
[INFO] Exclude: **/.settings/**
[INFO] Exclude: **/*.asc
[INFO] Exclude: **/dependency-reduced-pom.xml
[INFO] Exclude: **/logs/**
[INFO] Exclude: **/docs/**
[INFO] Exclude: CHANGES.txt
[INFO] Exclude: conf/groomservers
[INFO] Exclude: src/site/resources/files/hama-eclipse-formatter.xml
[INFO] Exclude: **/src/test/resources/*.properties
[INFO] Exclude: **dependency-reduced-pom.xml
[INFO] Exclude: **/src/test/resources/*.txt
[INFO] Exclude: **/target/**
[INFO] Exclude: /docker/README.md
[INFO] 22 resources included (use -debug for more details)
Warning:  org.apache.xerces.jaxp.SAXParserImpl$JAXPSAXParser: Property 'http://www.oracle.com/xml/jaxp/properties/entityExpansionLimit' is not recognized.
Compiler warnings:
  WARNING:  'org.apache.xerces.jaxp.SAXParserImpl: Property 'http://javax.xml.XMLConstants/property/accessExternalDTD' is not recognized.'
Warning:  org.apache.xerces.parsers.SAXParser: Feature 'http://javax.xml.XMLConstants/feature/secure-processing' is not recognized.
Warning:  org.apache.xerces.parsers.SAXParser: Property 'http://javax.xml.XMLConstants/property/accessExternalDTD' is not recognized.
Warning:  org.apache.xerces.parsers.SAXParser: Property 'http://www.oracle.com/xml/jaxp/properties/entityExpansionLimit' is not recognized.
[INFO] Rat check: Summary of files. Unapproved: 0 unknown: 0 generated: 0 approved: 20 licence.
[INFO] 
[INFO] --- maven-javadoc-plugin:2.9.1:jar (default) @ hama-pipes ---
[INFO] Not executing Javadoc as the project is not a Java classpath-capable package
[INFO] 
[INFO] --- maven-install-plugin:2.3.1:install (default-install) @ hama-pipes ---
[INFO] Installing <https://builds.apache.org/job/Hama-trunk/ws/c++/pom.xml> to <https://builds.apache.org/job/Hama-trunk/ws/.repository/org/apache/hama/hama-pipes/0.7.2-SNAPSHOT/hama-pipes-0.7.2-SNAPSHOT.pom>
[INFO] 
[INFO] ------------------------------------------------------------------------
[INFO] Building commons 0.7.2-SNAPSHOT
[INFO] ------------------------------------------------------------------------
Downloading from central: https://repo.maven.apache.org/maven2/org/apache/maven/plugins/maven-resources-plugin/2.5/maven-resources-plugin-2.5.pom
Progress (1): 2.2/7.1 kBProgress (1): 4.9/7.1 kBProgress (1): 7.1 kB                        Downloaded from central: https://repo.maven.apache.org/maven2/org/apache/maven/plugins/maven-resources-plugin/2.5/maven-resources-plugin-2.5.pom (7.1 kB at 593 kB/s)
Downloading from central: https://repo.maven.apache.org/maven2/org/apache/maven/plugins/maven-resources-plugin/2.5/maven-resources-plugin-2.5.jar
Progress (1): 2.1/26 kBProgress (1): 4.9/26 kBProgress (1): 7.7/26 kBProgress (1): 10/26 kB Progress (1): 13/26 kBProgress (1): 16/26 kBProgress (1): 19/26 kBProgress (1): 21/26 kBProgress (1): 24/26 kBProgress (1): 26 kB                      Downloaded from central: https://repo.maven.apache.org/maven2/org/apache/maven/plugins/maven-resources-plugin/2.5/maven-resources-plugin-2.5.jar (26 kB at 2.2 MB/s)
Downloading from central: https://repo.maven.apache.org/maven2/org/apache/maven/plugins/maven-compiler-plugin/2.3.2/maven-compiler-plugin-2.3.2.pom
Progress (1): 2.1/7.3 kBProgress (1): 4.9/7.3 kBProgress (1): 7.3 kB                        Downloaded from central: https://repo.maven.apache.org/maven2/org/apache/maven/plugins/maven-compiler-plugin/2.3.2/maven-compiler-plugin-2.3.2.pom (7.3 kB at 611 kB/s)
Downloading from central: https://repo.maven.apache.org/maven2/org/apache/maven/plugins/maven-compiler-plugin/2.3.2/maven-compiler-plugin-2.3.2.jar
Progress (1): 2.1/29 kBProgress (1): 4.9/29 kBProgress (1): 7.7/29 kBProgress (1): 10/29 kB Progress (1): 13/29 kBProgress (1): 16/29 kBProgress (1): 19/29 kBProgress (1): 21/29 kBProgress (1): 24/29 kBProgress (1): 27/29 kBProgress (1): 29 kB                      Downloaded from central: https://repo.maven.apache.org/maven2/org/apache/maven/plugins/maven-compiler-plugin/2.3.2/maven-compiler-plugin-2.3.2.jar (29 kB at 2.2 MB/s)
Downloading from central: https://repo.maven.apache.org/maven2/org/apache/maven/plugins/maven-surefire-plugin/2.6/maven-surefire-plugin-2.6.pom
Progress (1): 2.2/9.4 kBProgress (1): 4.9/9.4 kBProgress (1): 7.7/9.4 kBProgress (1): 9.4 kB                        Downloaded from central: https://repo.maven.apache.org/maven2/org/apache/maven/plugins/maven-surefire-plugin/2.6/maven-surefire-plugin-2.6.pom (9.4 kB at 494 kB/s)
Downloading from central: https://repo.maven.apache.org/maven2/org/apache/maven/surefire/surefire/2.6/surefire-2.6.pom
Progress (1): 2.2/8.8 kBProgress (1): 4.9/8.8 kBProgress (1): 7.7/8.8 kBProgress (1): 8.8 kB                        Downloaded from central: https://repo.maven.apache.org/maven2/org/apache/maven/surefire/surefire/2.6/surefire-2.6.pom (8.8 kB at 737 kB/s)
Downloading from central: https://repo.maven.apache.org/maven2/org/apache/maven/plugins/maven-surefire-plugin/2.6/maven-surefire-plugin-2.6.jar
Progress (1): 2.1/28 kBProgress (1): 4.9/28 kBProgress (1): 7.7/28 kBProgress (1): 10/28 kB Progress (1): 13/28 kBProgress (1): 16/28 kBProgress (1): 19/28 kBProgress (1): 21/28 kBProgress (1): 24/28 kBProgress (1): 27/28 kBProgress (1): 28 kB                      Downloaded from central: https://repo.maven.apache.org/maven2/org/apache/maven/plugins/maven-surefire-plugin/2.6/maven-surefire-plugin-2.6.jar (28 kB at 2.2 MB/s)
Downloading from central: https://repo.maven.apache.org/maven2/org/apache/maven/plugins/maven-jar-plugin/2.3.1/maven-jar-plugin-2.3.1.pom
Progress (1): 2.2/5.7 kBProgress (1): 4.9/5.7 kBProgress (1): 5.7 kB                        Downloaded from central: https://repo.maven.apache.org/maven2/org/apache/maven/plugins/maven-jar-plugin/2.3.1/maven-jar-plugin-2.3.1.pom (5.7 kB at 477 kB/s)
Downloading from central: https://repo.maven.apache.org/maven2/org/apache/maven/plugins/maven-jar-plugin/2.3.1/maven-jar-plugin-2.3.1.jar
Progress (1): 2.1/32 kBProgress (1): 4.9/32 kBProgress (1): 7.7/32 kBProgress (1): 10/32 kB Progress (1): 13/32 kBProgress (1): 16/32 kBProgress (1): 19/32 kBProgress (1): 21/32 kBProgress (1): 24/32 kBProgress (1): 27/32 kBProgress (1): 30/32 kBProgress (1): 32/32 kBProgress (1): 32 kB                      Downloaded from central: https://repo.maven.apache.org/maven2/org/apache/maven/plugins/maven-jar-plugin/2.3.1/maven-jar-plugin-2.3.1.jar (32 kB at 2.5 MB/s)
[INFO] 
[INFO] --- maven-clean-plugin:2.4.1:clean (default-clean) @ hama-commons ---
[INFO] Deleting <https://builds.apache.org/job/Hama-trunk/ws/commons> (includes = [lib/**, logs/**, **/docs, docs/apidocs/**, c++/src/CMakeCache.txt, c++/src/CMakeFiles/, c++/src/Makefile, c++/src/cmake_install.cmake, c++/src/examples/], excludes = [])
[INFO] 
[INFO] --- maven-remote-resources-plugin:1.2.1:process (default) @ hama-commons ---
[INFO] 
[INFO] --- maven-resources-plugin:2.5:resources (default-resources) @ hama-commons ---
Downloading from central: https://repo.maven.apache.org/maven2/org/codehaus/plexus/plexus-interpolation/1.13/plexus-interpolation-1.13.jar
Progress (1): 2.1/61 kBProgress (1): 4.9/61 kBProgress (1): 7.6/61 kBProgress (1): 10/61 kB Progress (1): 13/61 kBProgress (1): 16/61 kBProgress (1): 19/61 kBProgress (1): 21/61 kBProgress (1): 24/61 kBProgress (1): 27/61 kBProgress (1): 30/61 kBProgress (1): 32/61 kBProgress (1): 36/61 kBProgress (1): 40/61 kBProgress (1): 44/61 kBProgress (1): 49/61 kBProgress (1): 53/61 kBProgress (1): 57/61 kBProgress (1): 61/61 kBProgress (1): 61 kB                      Downloaded from central: https://repo.maven.apache.org/maven2/org/codehaus/plexus/plexus-interpolation/1.13/plexus-interpolation-1.13.jar (61 kB at 4.1 MB/s)
[debug] execute contextualize
[INFO] Using 'UTF-8' encoding to copy filtered resources.
[INFO] skip non existing resourceDirectory <https://builds.apache.org/job/Hama-trunk/ws/commons/src/main/resources>
[INFO] Copying 3 resources
[INFO] 
[INFO] --- maven-compiler-plugin:2.3.2:compile (default-compile) @ hama-commons ---
Downloading from central: https://repo.maven.apache.org/maven2/org/apache/maven/maven-toolchain/1.0/maven-toolchain-1.0.pom
Progress (1): 2.8/3.4 kBProgress (1): 3.4 kB                        Downloaded from central: https://repo.maven.apache.org/maven2/org/apache/maven/maven-toolchain/1.0/maven-toolchain-1.0.pom (3.4 kB at 310 kB/s)
Downloading from central: https://repo.maven.apache.org/maven2/org/codehaus/plexus/plexus-compiler-api/1.8.1/plexus-compiler-api-1.8.1.pom
Progress (1): 805 B                   Downloaded from central: https://repo.maven.apache.org/maven2/org/codehaus/plexus/plexus-compiler-api/1.8.1/plexus-compiler-api-1.8.1.pom (805 B at 73 kB/s)
Downloading from central: https://repo.maven.apache.org/maven2/org/codehaus/plexus/plexus-compiler/1.8.1/plexus-compiler-1.8.1.pom
Progress (1): 2.1/3.5 kBProgress (1): 3.5 kB                        Downloaded from central: https://repo.maven.apache.org/maven2/org/codehaus/plexus/plexus-compiler/1.8.1/plexus-compiler-1.8.1.pom (3.5 kB at 316 kB/s)
Downloading from central: https://repo.maven.apache.org/maven2/org/codehaus/plexus/plexus-compiler-manager/1.8.1/plexus-compiler-manager-1.8.1.pom
Progress (1): 713 B                   Downloaded from central: https://repo.maven.apache.org/maven2/org/codehaus/plexus/plexus-compiler-manager/1.8.1/plexus-compiler-manager-1.8.1.pom (713 B at 65 kB/s)
Downloading from central: https://repo.maven.apache.org/maven2/org/codehaus/plexus/plexus-compiler-javac/1.8.1/plexus-compiler-javac-1.8.1.pom
Progress (1): 710 B                   Downloaded from central: https://repo.maven.apache.org/maven2/org/codehaus/plexus/plexus-compiler-javac/1.8.1/plexus-compiler-javac-1.8.1.pom (710 B at 59 kB/s)
Downloading from central: https://repo.maven.apache.org/maven2/org/codehaus/plexus/plexus-compilers/1.8.1/plexus-compilers-1.8.1.pom
Progress (1): 1.3 kB                    Downloaded from central: https://repo.maven.apache.org/maven2/org/codehaus/plexus/plexus-compilers/1.8.1/plexus-compilers-1.8.1.pom (1.3 kB at 121 kB/s)
Downloading from central: https://repo.maven.apache.org/maven2/org/apache/maven/maven-toolchain/1.0/maven-toolchain-1.0.jar
Downloading from central: https://repo.maven.apache.org/maven2/org/codehaus/plexus/plexus-compiler-api/1.8.1/plexus-compiler-api-1.8.1.jar
Downloading from central: https://repo.maven.apache.org/maven2/org/codehaus/plexus/plexus-compiler-manager/1.8.1/plexus-compiler-manager-1.8.1.jar
Downloading from central: https://repo.maven.apache.org/maven2/org/codehaus/plexus/plexus-compiler-javac/1.8.1/plexus-compiler-javac-1.8.1.jar
Progress (1): 2.1/33 kBProgress (1): 4.9/33 kBProgress (1): 7.6/33 kBProgress (1): 10/33 kB Progress (1): 13/33 kBProgress (1): 16/33 kBProgress (1): 19/33 kBProgress (1): 21/33 kBProgress (1): 24/33 kBProgress (1): 27/33 kBProgress (1): 30/33 kBProgress (1): 32/33 kBProgress (1): 33 kB   Progress (2): 33 kB | 2.8/20 kBProgress (2): 33 kB | 5.5/20 kBProgress (2): 33 kB | 8.3/20 kBProgress (2): 33 kB | 11/20 kB Progress (2): 33 kB | 14/20 kBProgress (2): 33 kB | 16/20 kBProgress (3): 33 kB | 16/20 kB | 2.1/5.3 kBProgress (3): 33 kB | 19/20 kB | 2.1/5.3 kBProgress (3): 33 kB | 20 kB | 2.1/5.3 kB   Progress (3): 33 kB | 20 kB | 4.9/5.3 kBProgress (3): 33 kB | 20 kB | 5.3 kB    Progress (4): 33 kB | 20 kB | 5.3 kB | 2.1/13 kBProgress (4): 33 kB | 20 kB | 5.3 kB | 4.9/13 kBProgress (4): 33 kB | 20 kB | 5.3 kB | 7.6/13 kBProgress (4): 33 kB | 20 kB | 5.3 kB | 10/13 kB Progress (4): 33 kB | 20 kB | 5.3 kB | 13 kB                                               Downloaded from central: https://repo.maven.apache.org/maven2/org/apache/maven/maven-toolchain/1.0/maven-toolchain-1.0.jar (33 kB at 2.2 MB/s)
Downloaded from central: https://repo.maven.apache.org/maven2/org/codehaus/plexus/plexus-compiler-api/1.8.1/plexus-compiler-api-1.8.1.jar (20 kB at 1.2 MB/s)
Downloaded from central: https://repo.maven.apache.org/maven2/org/codehaus/plexus/plexus-compiler-manager/1.8.1/plexus-compiler-manager-1.8.1.jar (5.3 kB at 333 kB/s)
Downloaded from central: https://repo.maven.apache.org/maven2/org/codehaus/plexus/plexus-compiler-javac/1.8.1/plexus-compiler-javac-1.8.1.jar (13 kB at 659 kB/s)
[INFO] Compiling 34 source files to <https://builds.apache.org/job/Hama-trunk/ws/commons/target/classes>
[INFO] -------------------------------------------------------------
[ERROR] COMPILATION ERROR : 
[INFO] -------------------------------------------------------------
[ERROR] Failure executing javac, but could not parse the error:
javac: invalid target release: 1.8
Usage: javac <options> <source files>
use -help for a list of possible options

[INFO] 1 error
[INFO] -------------------------------------------------------------
[INFO] ------------------------------------------------------------------------
[INFO] Reactor Summary:
[INFO] 
[INFO] Apache Hama parent POM ............................. SUCCESS [ 18.674 s]
[INFO] pipes .............................................. SUCCESS [ 21.518 s]
[INFO] commons ............................................ FAILURE [  1.226 s]
[INFO] core ............................................... SKIPPED
[INFO] graph .............................................. SKIPPED
[INFO] machine learning ................................... SKIPPED
[INFO] examples ........................................... SKIPPED
[INFO] mesos .............................................. SKIPPED
[INFO] yarn ............................................... SKIPPED
[INFO] hama-dist .......................................... SKIPPED
[INFO] ------------------------------------------------------------------------
[INFO] BUILD FAILURE
[INFO] ------------------------------------------------------------------------
[INFO] Total time: 43.238 s
[INFO] Finished at: 2018-02-24T13:45:36Z
[INFO] Final Memory: 53M/1826M
[INFO] ------------------------------------------------------------------------
[ERROR] Failed to execute goal org.apache.maven.plugins:maven-compiler-plugin:2.3.2:compile (default-compile) on project hama-commons: Compilation failure
[ERROR] Failure executing javac, but could not parse the error:
[ERROR] javac: invalid target release: 1.8
[ERROR] Usage: javac <options> <source files>
[ERROR] use -help for a list of possible options
[ERROR] 
[ERROR] 
[ERROR] -> [Help 1]
[ERROR] 
[ERROR] To see the full stack trace of the errors, re-run Maven with the -e switch.
[ERROR] Re-run Maven using the -X switch to enable full debug logging.
[ERROR] 
[ERROR] For more information about the errors and possible solutions, please read the following articles:
[ERROR] [Help 1] http://cwiki.apache.org/confluence/display/MAVEN/MojoFailureException
[ERROR] 
[ERROR] After correcting the problems, you can resume the build with the command
[ERROR]   mvn <goals> -rf :hama-commons
Build step 'Invoke top-level Maven targets' marked build as failure
Archiving artifacts
Recording test results
ERROR: Step ?Publish JUnit test result report? failed: No test report files were found. Configuration error?
[JIRA] Updating issue HAMA-1003


Mime
View raw message