hama-dev mailing list archives

Site index · List index
Message view « Date » · « Thread »
Top « Date » · « Thread »
From Apache Jenkins Server <jenk...@builds.apache.org>
Subject Build failed in Jenkins: Hama-trunk #458
Date Wed, 23 Sep 2015 00:13:59 GMT
See <https://builds.apache.org/job/Hama-trunk/458/changes>

Changes:

[edwardyoon] Create README.md file

[edwardyoon] Update README.md

[edwardyoon] Improve readme md file.

------------------------------------------
[...truncated 14855 lines...]
Downloaded: http://repo.maven.apache.org/maven2/org/apache/maven/doxia/doxia-module-fml/1.2/doxia-module-fml-1.2.jar
(37 KB at 486.5 KB/sec)
Downloading: http://repo.maven.apache.org/maven2/org/apache/maven/reporting/maven-reporting-api/3.0/maven-reporting-api-3.0.jar
8/8 KB   11/11 KB   2/383 KB   
8/8 KB   11/11 KB   6/383 KB   
8/8 KB   11/11 KB   10/383 KB   
8/8 KB   11/11 KB   14/383 KB   
8/8 KB   11/11 KB   18/383 KB   
8/8 KB   11/11 KB   22/383 KB   
8/8 KB   11/11 KB   26/383 KB   
8/8 KB   11/11 KB   30/383 KB   
8/8 KB   11/11 KB   34/383 KB   
8/8 KB   11/11 KB   38/383 KB   
8/8 KB   11/11 KB   42/383 KB   
8/8 KB   11/11 KB   46/383 KB   
8/8 KB   11/11 KB   50/383 KB   
8/8 KB   11/11 KB   54/383 KB   
8/8 KB   11/11 KB   58/383 KB   
8/8 KB   11/11 KB   62/383 KB   
8/8 KB   11/11 KB   66/383 KB   
8/8 KB   11/11 KB   70/383 KB   
8/8 KB   11/11 KB   74/383 KB   
8/8 KB   11/11 KB   78/383 KB   
8/8 KB   11/11 KB   82/383 KB   
8/8 KB   11/11 KB   86/383 KB   
8/8 KB   11/11 KB   90/383 KB   
8/8 KB   11/11 KB   94/383 KB   
8/8 KB   11/11 KB   98/383 KB   
8/8 KB   11/11 KB   102/383 KB   
8/8 KB   11/11 KB   106/383 KB   
4/64 KB   8/8 KB   11/11 KB   106/383 KB   
4/64 KB   8/8 KB   11/11 KB   110/383 KB   
4/64 KB   8/8 KB   11/11 KB   114/383 KB   
8/64 KB   8/8 KB   11/11 KB   114/383 KB   
8/64 KB   8/8 KB   11/11 KB   118/383 KB   
12/64 KB   8/8 KB   11/11 KB   118/383 KB   
12/64 KB   8/8 KB   11/11 KB   122/383 KB   
16/64 KB   8/8 KB   11/11 KB   122/383 KB   
16/64 KB   8/8 KB   11/11 KB   126/383 KB   
20/64 KB   8/8 KB   11/11 KB   126/383 KB   
20/64 KB   8/8 KB   11/11 KB   130/383 KB   
24/64 KB   8/8 KB   11/11 KB   130/383 KB   
24/64 KB   8/8 KB   11/11 KB   134/383 KB   
28/64 KB   8/8 KB   11/11 KB   134/383 KB   
28/64 KB   8/8 KB   11/11 KB   138/383 KB   
32/64 KB   8/8 KB   11/11 KB   138/383 KB   
32/64 KB   8/8 KB   11/11 KB   142/383 KB   
36/64 KB   8/8 KB   11/11 KB   142/383 KB   
36/64 KB   8/8 KB   11/11 KB   146/383 KB   
40/64 KB   8/8 KB   11/11 KB   146/383 KB   
40/64 KB   8/8 KB   11/11 KB   150/383 KB   
44/64 KB   8/8 KB   11/11 KB   150/383 KB   
44/64 KB   8/8 KB   11/11 KB   154/383 KB   
48/64 KB   8/8 KB   11/11 KB   154/383 KB   
48/64 KB   8/8 KB   11/11 KB   158/383 KB   
52/64 KB   8/8 KB   11/11 KB   158/383 KB   
52/64 KB   8/8 KB   11/11 KB   162/383 KB   
56/64 KB   8/8 KB   11/11 KB   162/383 KB   
56/64 KB   8/8 KB   11/11 KB   166/383 KB   
60/64 KB   8/8 KB   11/11 KB   166/383 KB   
60/64 KB   8/8 KB   11/11 KB   170/383 KB   
64/64 KB   8/8 KB   11/11 KB   170/383 KB   
64/64 KB   8/8 KB   11/11 KB   174/383 KB   
64/64 KB   8/8 KB   11/11 KB   174/383 KB   
64/64 KB   8/8 KB   11/11 KB   178/383 KB   
64/64 KB   8/8 KB   11/11 KB   182/383 KB   
64/64 KB   8/8 KB   11/11 KB   186/383 KB   
64/64 KB   8/8 KB   11/11 KB   190/383 KB   
64/64 KB   8/8 KB   11/11 KB   194/383 KB   
64/64 KB   8/8 KB   11/11 KB   198/383 KB   
                                            
64/64 KB   11/11 KB   202/383 KB            
Downloaded: http://repo.maven.apache.org/maven2/org/codehaus/plexus/plexus-velocity/1.1.7/plexus-velocity-1.1.7.jar
(8 KB at 99.8 KB/sec)
64/64 KB   11/11 KB   206/383 KB   
Downloading: http://repo.maven.apache.org/maven2/org/codehaus/plexus/plexus-utils/3.0.8/plexus-utils-3.0.8.jar
64/64 KB   11/11 KB   210/383 KB   
64/64 KB   11/11 KB   214/383 KB   
64/64 KB   11/11 KB   218/383 KB   
64/64 KB   11/11 KB   222/383 KB   
64/64 KB   11/11 KB   226/383 KB   
64/64 KB   11/11 KB   230/383 KB   
64/64 KB   11/11 KB   231/383 KB   
4/11 KB   64/64 KB   11/11 KB   231/383 KB   
8/11 KB   64/64 KB   11/11 KB   231/383 KB   
11/11 KB   64/64 KB   11/11 KB   231/383 KB   
                                              
Downloaded: http://repo.maven.apache.org/maven2/org/codehaus/plexus/plexus-i18n/1.0-beta-7/plexus-i18n-1.0-beta-7.jar
(11 KB at 105.8 KB/sec)
11/11 KB   64/64 KB   233/383 KB              
11/11 KB   64/64 KB   237/383 KB   
11/11 KB   64/64 KB   241/383 KB   
11/11 KB   64/64 KB   245/383 KB   
11/11 KB   64/64 KB   249/383 KB   
11/11 KB   64/64 KB   253/383 KB   
11/11 KB   64/64 KB   257/383 KB   
11/11 KB   64/64 KB   261/383 KB   
11/11 KB   64/64 KB   265/383 KB   
11/11 KB   64/64 KB   269/383 KB   
11/11 KB   64/64 KB   273/383 KB   
11/11 KB   64/64 KB   277/383 KB   
11/11 KB   64/64 KB   281/383 KB   
11/11 KB   64/64 KB   285/383 KB   
11/11 KB   64/64 KB   289/383 KB   
11/11 KB   64/64 KB   293/383 KB   
11/11 KB   64/64 KB   297/383 KB   
11/11 KB   64/64 KB   301/383 KB   
11/11 KB   64/64 KB   305/383 KB   
11/11 KB   64/64 KB   309/383 KB   
11/11 KB   64/64 KB   313/383 KB   
11/11 KB   64/64 KB   317/383 KB   
11/11 KB   64/64 KB   321/383 KB   
11/11 KB   64/64 KB   325/383 KB   
11/11 KB   64/64 KB   329/383 KB   
11/11 KB   64/64 KB   333/383 KB   
11/11 KB   64/64 KB   337/383 KB   
11/11 KB   64/64 KB   341/383 KB   
11/11 KB   64/64 KB   345/383 KB   
11/11 KB   64/64 KB   349/383 KB   
11/11 KB   64/64 KB   353/383 KB   
11/11 KB   64/64 KB   357/383 KB   
11/11 KB   64/64 KB   361/383 KB   
11/11 KB   64/64 KB   365/383 KB   
11/11 KB   64/64 KB   369/383 KB   
11/11 KB   64/64 KB   373/383 KB   
11/11 KB   64/64 KB   377/383 KB   
11/11 KB   64/64 KB   381/383 KB   
11/11 KB   64/64 KB   383/383 KB   
                                   
Downloaded: http://repo.maven.apache.org/maven2/oro/oro/2.0.8/oro-2.0.8.jar (64 KB at 849.8
KB/sec)
11/11 KB   4/227 KB   383/383 KB   
11/11 KB   8/227 KB   383/383 KB   
11/11 KB   12/227 KB   383/383 KB   
11/11 KB   16/227 KB   383/383 KB   
11/11 KB   20/227 KB   383/383 KB   
11/11 KB   24/227 KB   383/383 KB   
11/11 KB   28/227 KB   383/383 KB   
11/11 KB   32/227 KB   383/383 KB   
11/11 KB   36/227 KB   383/383 KB   
11/11 KB   40/227 KB   383/383 KB   
11/11 KB   44/227 KB   383/383 KB   
11/11 KB   48/227 KB   383/383 KB   
11/11 KB   52/227 KB   383/383 KB   
11/11 KB   56/227 KB   383/383 KB   
11/11 KB   60/227 KB   383/383 KB   
11/11 KB   64/227 KB   383/383 KB   
11/11 KB   68/227 KB   383/383 KB   
11/11 KB   72/227 KB   383/383 KB   
11/11 KB   76/227 KB   383/383 KB   
11/11 KB   80/227 KB   383/383 KB   
11/11 KB   84/227 KB   383/383 KB   
11/11 KB   88/227 KB   383/383 KB   
11/11 KB   92/227 KB   383/383 KB   
11/11 KB   96/227 KB   383/383 KB   
11/11 KB   100/227 KB   383/383 KB   
11/11 KB   104/227 KB   383/383 KB   
11/11 KB   108/227 KB   383/383 KB   
11/11 KB   112/227 KB   383/383 KB   
11/11 KB   116/227 KB   383/383 KB   
11/11 KB   120/227 KB   383/383 KB   
11/11 KB   124/227 KB   383/383 KB   
11/11 KB   128/227 KB   383/383 KB   
11/11 KB   132/227 KB   383/383 KB   
11/11 KB   136/227 KB   383/383 KB   
11/11 KB   140/227 KB   383/383 KB   
11/11 KB   144/227 KB   383/383 KB   
11/11 KB   148/227 KB   383/383 KB   
11/11 KB   152/227 KB   383/383 KB   
11/11 KB   156/227 KB   383/383 KB   
11/11 KB   160/227 KB   383/383 KB   
11/11 KB   164/227 KB   383/383 KB   
                                     
168/227 KB   383/383 KB              
Downloaded: http://repo.maven.apache.org/maven2/org/apache/maven/reporting/maven-reporting-api/3.0/maven-reporting-api-3.0.jar
(11 KB at 142.4 KB/sec)
172/227 KB   383/383 KB   
176/227 KB   383/383 KB   
180/227 KB   383/383 KB   
184/227 KB   383/383 KB   
188/227 KB   383/383 KB   
192/227 KB   383/383 KB   
196/227 KB   383/383 KB   
200/227 KB   383/383 KB   
204/227 KB   383/383 KB   
208/227 KB   383/383 KB   
212/227 KB   383/383 KB   
216/227 KB   383/383 KB   
220/227 KB   383/383 KB   
224/227 KB   383/383 KB   
227/227 KB   383/383 KB   
                          
Downloaded: http://repo.maven.apache.org/maven2/org/apache/velocity/velocity/1.5/velocity-1.5.jar
(383 KB at 3481.2 KB/sec)
                          
Downloaded: http://repo.maven.apache.org/maven2/org/codehaus/plexus/plexus-utils/3.0.8/plexus-utils-3.0.8.jar
(227 KB at 2794.9 KB/sec)
[INFO] 60 implicit excludes (use -debug for more details).
[INFO] Exclude: .idea/**
[INFO] Exclude: .git/**
[INFO] Exclude: .repository/**
[INFO] Exclude: .gitignore
[INFO] Exclude: **/.classpath/**
[INFO] Exclude: **/.project
[INFO] Exclude: **/*.iml
[INFO] Exclude: **/.settings/**
[INFO] Exclude: **/*.asc
[INFO] Exclude: **/dependency-reduced-pom.xml
[INFO] Exclude: **/logs/**
[INFO] Exclude: **/docs/**
[INFO] Exclude: CHANGES.txt
[INFO] Exclude: conf/groomservers
[INFO] Exclude: src/site/resources/files/hama-eclipse-formatter.xml
[INFO] Exclude: **/src/test/resources/*.properties
[INFO] Exclude: **dependency-reduced-pom.xml
[INFO] Exclude: **/src/test/resources/*.txt
[INFO] Exclude: **/target/**
[INFO] Exclude: /docker/README.md
[INFO] 52 resources included (use -debug for more details)
[INFO] Rat check: Summary of files. Unapproved: 1 unknown: 1 generated: 0 approved: 38 licence.
[INFO] ------------------------------------------------------------------------
[INFO] Reactor Summary:
[INFO] 
[INFO] Apache Hama parent POM ............................ FAILURE [33.474s]
[INFO] pipes ............................................. SKIPPED
[INFO] commons ........................................... SKIPPED
[INFO] core .............................................. SKIPPED
[INFO] graph ............................................. SKIPPED
[INFO] machine learning .................................. SKIPPED
[INFO] examples .......................................... SKIPPED
[INFO] mesos ............................................. SKIPPED
[INFO] yarn .............................................. SKIPPED
[INFO] hama-dist ......................................... SKIPPED
[INFO] ------------------------------------------------------------------------
[INFO] BUILD FAILURE
[INFO] ------------------------------------------------------------------------
[INFO] Total time: 36.082s
[INFO] Finished at: Wed Sep 23 00:14:14 UTC 2015
[INFO] Final Memory: 21M/159M
[INFO] ------------------------------------------------------------------------
[ERROR] Failed to execute goal org.apache.rat:apache-rat-plugin:0.10:check (default) on project
hama-parent: Too many files with unapproved license: 1 See RAT report in: <https://builds.apache.org/job/Hama-trunk/ws/target/rat.txt>
-> [Help 1]
[ERROR] 
[ERROR] To see the full stack trace of the errors, re-run Maven with the -e switch.
[ERROR] Re-run Maven using the -X switch to enable full debug logging.
[ERROR] 
[ERROR] For more information about the errors and possible solutions, please read the following
articles:
[ERROR] [Help 1] http://cwiki.apache.org/confluence/display/MAVEN/MojoFailureException
Build step 'Invoke top-level Maven targets' marked build as failure
Archiving artifacts
Sending artifact delta relative to Hama-trunk #457
Archived 1 artifacts
Archive block size is 32768
Received 0 blocks and 3382 bytes
Compression is 0.0%
Took 2.3 sec
Recording test results

Mime
View raw message