hama-dev mailing list archives

Site index · List index
Message view « Date » · « Thread »
Top « Date » · « Thread »
From Apache Jenkins Server <jenk...@builds.apache.org>
Subject Build failed in Jenkins: Hama-Nightly-for-Hadoop-1.x #1660
Date Thu, 02 Jul 2015 00:42:04 GMT
See <https://builds.apache.org/job/Hama-Nightly-for-Hadoop-1.x/1660/>

------------------------------------------
[...truncated 42856 lines...]

15/07/02 00:01:41 INFO bsp.TestCheckpoint: Got port = 12502

15/07/02 00:01:41 INFO bsp.TestCheckpoint: Getting value for key job_checkpttest_0001/checkpoint/1/

15/07/02 00:01:41 INFO bsp.TestCheckpoint: SyncClient Storing value step = 1 count = 0 for
key job_checkpttest_0001/checkpoint/1/

15/07/02 00:01:41 INFO ft.AsyncRcvdMsgCheckpointImpl: Enabled = true checkPointInterval =
2 lastCheckPointStep = 1 getSuperstepCount() = 1

15/07/02 00:01:41 INFO ft.AsyncRcvdMsgCheckpointImpl: checkpointNext = false checkpointMessageCount
= 0

15/07/02 00:01:41 INFO bsp.TestCheckpoint: After barrier 1

15/07/02 00:01:41 INFO bsp.TestCheckpoint: Getting value for key job_checkpttest_0001/checkpoint/1/

15/07/02 00:01:41 INFO ft.AsyncRcvdMsgCheckpointImpl: Enabled = true checkPointInterval =
2 lastCheckPointStep = 1 getSuperstepCount() = 2

15/07/02 00:01:41 INFO ft.AsyncRcvdMsgCheckpointImpl: checkpointNext = true checkpointMessageCount
= 0

15/07/02 00:01:41 INFO bsp.TestCheckpoint: After barrier 2

15/07/02 00:01:41 INFO bsp.TestCheckpoint: Getting value for key job_checkpttest_0001/checkpoint/1/

15/07/02 00:01:41 INFO ft.AsyncRcvdMsgCheckpointImpl: Creating path checkpoint/job_checkpttest_0001/3/1

15/07/02 00:01:41 INFO bsp.TestCheckpoint: SyncClient Storing value step = 3 count = 1 for
key job_checkpttest_0001/checkpoint/1/

15/07/02 00:01:41 INFO ft.AsyncRcvdMsgCheckpointImpl: Enabled = true checkPointInterval =
2 lastCheckPointStep = 3 getSuperstepCount() = 3

15/07/02 00:01:41 INFO ft.AsyncRcvdMsgCheckpointImpl: checkpointNext = false checkpointMessageCount
= 0

15/07/02 00:01:41 INFO bsp.TestCheckpoint: After barrier 3

15/07/02 00:01:41 INFO bsp.TestCheckpoint: Getting value for key job_checkpttest_0001/checkpoint/1/

15/07/02 00:01:41 INFO ft.AsyncRcvdMsgCheckpointImpl: Enabled = true checkPointInterval =
2 lastCheckPointStep = 3 getSuperstepCount() = 4

15/07/02 00:01:41 INFO ft.AsyncRcvdMsgCheckpointImpl: checkpointNext = true checkpointMessageCount
= 0

15/07/02 00:01:41 INFO bsp.TestCheckpoint: After barrier 4

15/07/02 00:01:41 INFO bsp.TestCheckpoint: Getting value for key job_checkpttest_0001/checkpoint/1/

15/07/02 00:01:41 INFO ft.AsyncRcvdMsgCheckpointImpl: Creating path checkpoint/job_checkpttest_0001/5/1

15/07/02 00:01:41 INFO bsp.TestCheckpoint: SyncClient Storing value step = 5 count = 2 for
key job_checkpttest_0001/checkpoint/1/

15/07/02 00:01:41 INFO ft.AsyncRcvdMsgCheckpointImpl: Enabled = true checkPointInterval =
2 lastCheckPointStep = 5 getSuperstepCount() = 5

15/07/02 00:01:41 INFO ft.AsyncRcvdMsgCheckpointImpl: checkpointNext = false checkpointMessageCount
= 0

15/07/02 00:01:41 INFO bsp.TestCheckpoint: After barrier 5

15/07/02 00:01:41 INFO bsp.TestCheckpoint: Getting value for key job_checkpttest_0001/checkpoint/1/

15/07/02 00:01:41 INFO ft.AsyncRcvdMsgCheckpointImpl: Enabled = true checkPointInterval =
2 lastCheckPointStep = 5 getSuperstepCount() = 6

15/07/02 00:01:41 INFO ft.AsyncRcvdMsgCheckpointImpl: checkpointNext = true checkpointMessageCount
= 0

15/07/02 00:01:41 INFO bsp.TestCheckpoint: After barrier 6

15/07/02 00:01:41 INFO bsp.TestCheckpoint: Getting value for key job_checkpttest_0001/checkpoint/1/

15/07/02 00:01:41 INFO bsp.TestCheckpoint: Got port = 12502

15/07/02 00:01:41 INFO bsp.TestCheckpoint: Created bsp peer and other parameters

15/07/02 00:01:41 INFO bsp.TestCheckpoint: SyncClient Storing value step = 1 count = 0 for
key job_checkpttest_0001/checkpoint/1/

15/07/02 00:01:41 INFO ft.AsyncRcvdMsgCheckpointImpl: Enabled = true checkPointInterval =
1 lastCheckPointStep = 1 getSuperstepCount() = 1

15/07/02 00:01:41 INFO ft.AsyncRcvdMsgCheckpointImpl: checkpointNext = true checkpointMessageCount
= 0

15/07/02 00:01:41 INFO bsp.TestCheckpoint: After barrier 1

15/07/02 00:01:41 INFO bsp.TestCheckpoint: Completed first sync.

15/07/02 00:01:41 INFO bsp.TestCheckpoint: Getting value for key job_checkpttest_0001/checkpoint/1/

15/07/02 00:01:41 INFO ft.AsyncRcvdMsgCheckpointImpl: Creating path checkpoint/job_checkpttest_0001/2/1

15/07/02 00:01:41 INFO bsp.TestCheckpoint: SyncClient Storing value step = 2 count = 1 for
key job_checkpttest_0001/checkpoint/1/

15/07/02 00:01:41 INFO ft.AsyncRcvdMsgCheckpointImpl: Enabled = true checkPointInterval =
1 lastCheckPointStep = 2 getSuperstepCount() = 2

15/07/02 00:01:41 INFO ft.AsyncRcvdMsgCheckpointImpl: checkpointNext = true checkpointMessageCount
= 0

15/07/02 00:01:41 INFO bsp.TestCheckpoint: After barrier 2

15/07/02 00:01:41 INFO bsp.TestCheckpoint: Completed second sync.

15/07/02 00:01:41 INFO bsp.TestCheckpoint: Getting value for key job_checkpttest_0001/checkpoint/1/

15/07/02 00:01:41 INFO bsp.TestCheckpoint: Got port = 12502

15/07/02 00:01:41 INFO bsp.TestCheckpoint: SyncClient Storing value step = 3 count = 5 for
key job_checkpttest_0001/checkpoint/1/

15/07/02 00:01:41 INFO bsp.TestCheckpoint: Getting value for key job_checkpttest_0001/checkpoint/1/

Tests run: 3, Failures: 0, Errors: 0, Skipped: 0, Time elapsed: 0.017 sec
Forking command line: /bin/sh -c cd <https://builds.apache.org/job/Hama-Nightly-for-Hadoop-1.x/ws/trunk/core>
&& /home/jenkins/tools/java/jdk1.7.0_25-32/jre/bin/java -jar /tmp/surefirebooter6507044769723465279.jar
/tmp/surefire8896502316460938151tmp /tmp/surefire8269869675734142108tmp
Running org.apache.hama.bsp.TestTaskAllocation
Tests run: 1, Failures: 0, Errors: 0, Skipped: 0, Time elapsed: 0.043 sec
Forking command line: /bin/sh -c cd <https://builds.apache.org/job/Hama-Nightly-for-Hadoop-1.x/ws/trunk/core>
&& /home/jenkins/tools/java/jdk1.7.0_25-32/jre/bin/java -jar /tmp/surefirebooter6288681000573369100.jar
/tmp/surefire6816126119442732850tmp /tmp/surefire5937118605613994395tmp
Running org.apache.hama.monitor.fd.TestFD
Forking command line: /bin/sh -c cd <https://builds.apache.org/job/Hama-Nightly-for-Hadoop-1.x/ws/trunk/core>
&& /home/jenkins/tools/java/jdk1.7.0_25-32/jre/bin/java -jar /tmp/surefirebooter730012329129029264.jar
/tmp/surefire9033029194040601274tmp /tmp/surefire8888490272894916181tmp
Running org.apache.hama.monitor.TestConfigurator
15/07/02 00:01:44 INFO monitor.TestConfigurator: Plugins dir is not created, returned tasks
should be null -> null

Tests run: 1, Failures: 0, Errors: 0, Skipped: 0, Time elapsed: 0.016 sec
Forking command line: /bin/sh -c cd <https://builds.apache.org/job/Hama-Nightly-for-Hadoop-1.x/ws/trunk/core>
&& /home/jenkins/tools/java/jdk1.7.0_25-32/jre/bin/java -jar /tmp/surefirebooter8320713756379302643.jar
/tmp/surefire8541036042696511142tmp /tmp/surefire4847682743694044661tmp
Running org.apache.hama.bsp.TestLocalRunner
15/07/02 00:01:46 WARN util.NativeCodeLoader: Unable to load native-hadoop library for your
platform... using builtin-java classes where applicable

15/07/02 00:01:47 WARN bsp.BSPJobClient: No job jar file set.  User classes may not be found.
See BSPJob#setJar(String) or check Your jar file.

15/07/02 00:01:47 INFO Configuration.deprecation: user.name is deprecated. Instead, use mapreduce.job.user.name

15/07/02 00:01:47 INFO Configuration.deprecation: io.bytes.per.checksum is deprecated. Instead,
use dfs.bytes-per-checksum

15/07/02 00:01:48 WARN conf.Configuration: org.apache.hadoop.fs.ChecksumFileSystem$FSDataBoundedInputStream@1d7d5ee:an
attempt to override final parameter: mapreduce.job.end-notification.max.retry.interval;  Ignoring.

15/07/02 00:01:48 WARN conf.Configuration: org.apache.hadoop.fs.ChecksumFileSystem$FSDataBoundedInputStream@1d7d5ee:an
attempt to override final parameter: mapreduce.job.end-notification.max.attempts;  Ignoring.

15/07/02 00:01:48 INFO Configuration.deprecation: user.name is deprecated. Instead, use mapreduce.job.user.name

15/07/02 00:01:48 INFO Configuration.deprecation: io.bytes.per.checksum is deprecated. Instead,
use dfs.bytes-per-checksum

15/07/02 00:01:48 INFO Configuration.deprecation: io.bytes.per.checksum is deprecated. Instead,
use dfs.bytes-per-checksum

15/07/02 00:01:48 INFO Configuration.deprecation: io.bytes.per.checksum is deprecated. Instead,
use dfs.bytes-per-checksum

15/07/02 00:01:48 INFO Configuration.deprecation: io.bytes.per.checksum is deprecated. Instead,
use dfs.bytes-per-checksum

15/07/02 00:01:48 INFO bsp.BSPJobClient: Running job: job_localrunner_0001

15/07/02 00:01:48 INFO bsp.LocalBSPRunner: Setting up a new barrier for 3 tasks!

15/07/02 00:01:48 INFO Configuration.deprecation: mapred.cache.localFiles is deprecated. Instead,
use mapreduce.job.cache.local.files

15/07/02 00:01:51 INFO bsp.BSPJobClient: Current supersteps number: 14

15/07/02 00:01:51 INFO bsp.BSPJobClient: The total number of supersteps: 14

15/07/02 00:01:51 INFO bsp.BSPJobClient: Counters: 7

15/07/02 00:01:51 INFO bsp.BSPJobClient:   org.apache.hama.bsp.JobInProgress$JobCounter

15/07/02 00:01:51 INFO bsp.BSPJobClient:     SUPERSTEPS=14

15/07/02 00:01:51 INFO bsp.BSPJobClient:     LAUNCHED_TASKS=3

15/07/02 00:01:51 INFO bsp.BSPJobClient:   org.apache.hama.bsp.BSPPeerImpl$PeerCounter

15/07/02 00:01:51 INFO bsp.BSPJobClient:     SUPERSTEP_SUM=45

15/07/02 00:01:51 INFO bsp.BSPJobClient:     TIME_IN_SYNC_MS=156

15/07/02 00:01:51 INFO bsp.BSPJobClient:     TOTAL_MESSAGES_SENT=135

15/07/02 00:01:51 INFO bsp.BSPJobClient:     TOTAL_MESSAGES_RECEIVED=135

15/07/02 00:01:51 INFO bsp.BSPJobClient:     TASK_OUTPUT_RECORDS=135

Tests run: 1, Failures: 0, Errors: 0, Skipped: 0, Time elapsed: 0.01 sec
Forking command line: /bin/sh -c cd <https://builds.apache.org/job/Hama-Nightly-for-Hadoop-1.x/ws/trunk/core>
&& /home/jenkins/tools/java/jdk1.7.0_25-32/jre/bin/java -jar /tmp/surefirebooter5944871206497755008.jar
/tmp/surefire3423298042441417391tmp /tmp/surefire4907540324712566746tmp
Killed
Forking command line: /bin/sh -c cd <https://builds.apache.org/job/Hama-Nightly-for-Hadoop-1.x/ws/trunk/core>
&& /home/jenkins/tools/java/jdk1.7.0_25-32/jre/bin/java -jar /tmp/surefirebooter4261666566145781456.jar
/tmp/surefire8888832595680899530tmp /tmp/surefire1427255633401005338tmp
Running org.apache.hama.zookeeper.TestZKTools
Tests run: 1, Failures: 0, Errors: 0, Skipped: 0, Time elapsed: 0.009 sec
Forking command line: /bin/sh -c cd <https://builds.apache.org/job/Hama-Nightly-for-Hadoop-1.x/ws/trunk/core>
&& /home/jenkins/tools/java/jdk1.7.0_25-32/jre/bin/java -jar /tmp/surefirebooter7195585556563922323.jar
/tmp/surefire3540527973865594239tmp /tmp/surefire6824559637477066773tmp
Running org.apache.hama.bsp.TestZooKeeper
15/07/02 00:41:40 ERROR quorum.QuorumPeerConfig: Invalid configuration, only one server specified
(ignoring)


Results :

Tests run: 53, Failures: 0, Errors: 0, Skipped: 0

[INFO] ------------------------------------------------------------------------
[INFO] Reactor Summary:
[INFO] 
[INFO] Apache Hama parent POM ............................ SUCCESS [40.210s]
[INFO] pipes ............................................. SUCCESS [34.682s]
[INFO] commons ........................................... SUCCESS [14.521s]
[INFO] core .............................................. FAILURE [43:03.060s]
[INFO] graph ............................................. SKIPPED
[INFO] machine learning .................................. SKIPPED
[INFO] examples .......................................... SKIPPED
[INFO] mesos ............................................. SKIPPED
[INFO] hama-dist ......................................... SKIPPED
[INFO] ------------------------------------------------------------------------
[INFO] BUILD FAILURE
[INFO] ------------------------------------------------------------------------
[INFO] Total time: 44:35.616s
[INFO] Finished at: Thu Jul 02 00:41:51 UTC 2015
[INFO] Final Memory: 63M/264M
[INFO] ------------------------------------------------------------------------
[ERROR] Failed to execute goal org.apache.maven.plugins:maven-surefire-plugin:2.6:test (default-test)
on project hama-core: There are test failures.
[ERROR] 
[ERROR] Please refer to <https://builds.apache.org/job/Hama-Nightly-for-Hadoop-1.x/ws/trunk/core/target/surefire-reports>
for the individual test results.
[ERROR] -> [Help 1]
org.apache.maven.lifecycle.LifecycleExecutionException: Failed to execute goal org.apache.maven.plugins:maven-surefire-plugin:2.6:test
(default-test) on project hama-core: There are test failures.

Please refer to <https://builds.apache.org/job/Hama-Nightly-for-Hadoop-1.x/ws/trunk/core/target/surefire-reports>
for the individual test results.
	at org.apache.maven.lifecycle.internal.MojoExecutor.execute(MojoExecutor.java:213)
	at org.apache.maven.lifecycle.internal.MojoExecutor.execute(MojoExecutor.java:153)
	at org.apache.maven.lifecycle.internal.MojoExecutor.execute(MojoExecutor.java:145)
	at org.apache.maven.lifecycle.internal.LifecycleModuleBuilder.buildProject(LifecycleModuleBuilder.java:84)
	at org.apache.maven.lifecycle.internal.LifecycleModuleBuilder.buildProject(LifecycleModuleBuilder.java:59)
	at org.apache.maven.lifecycle.internal.LifecycleStarter.singleThreadedBuild(LifecycleStarter.java:183)
	at org.apache.maven.lifecycle.internal.LifecycleStarter.execute(LifecycleStarter.java:161)
	at org.apache.maven.DefaultMaven.doExecute(DefaultMaven.java:320)
	at org.apache.maven.DefaultMaven.execute(DefaultMaven.java:156)
	at org.apache.maven.cli.MavenCli.execute(MavenCli.java:537)
	at org.apache.maven.cli.MavenCli.doMain(MavenCli.java:196)
	at org.apache.maven.cli.MavenCli.main(MavenCli.java:141)
	at sun.reflect.NativeMethodAccessorImpl.invoke0(Native Method)
	at sun.reflect.NativeMethodAccessorImpl.invoke(NativeMethodAccessorImpl.java:57)
	at sun.reflect.DelegatingMethodAccessorImpl.invoke(DelegatingMethodAccessorImpl.java:43)
	at java.lang.reflect.Method.invoke(Method.java:606)
	at org.codehaus.plexus.classworlds.launcher.Launcher.launchEnhanced(Launcher.java:290)
	at org.codehaus.plexus.classworlds.launcher.Launcher.launch(Launcher.java:230)
	at org.codehaus.plexus.classworlds.launcher.Launcher.mainWithExitCode(Launcher.java:409)
	at org.codehaus.plexus.classworlds.launcher.Launcher.main(Launcher.java:352)
Caused by: org.apache.maven.plugin.MojoFailureException: There are test failures.

Please refer to <https://builds.apache.org/job/Hama-Nightly-for-Hadoop-1.x/ws/trunk/core/target/surefire-reports>
for the individual test results.
	at org.apache.maven.plugin.surefire.SurefireHelper.reportExecution(SurefireHelper.java:55)
	at org.apache.maven.plugin.surefire.SurefirePlugin.execute(SurefirePlugin.java:592)
	at org.apache.maven.plugin.DefaultBuildPluginManager.executeMojo(DefaultBuildPluginManager.java:101)
	at org.apache.maven.lifecycle.internal.MojoExecutor.execute(MojoExecutor.java:209)
	... 19 more
[ERROR] 
[ERROR] 
[ERROR] For more information about the errors and possible solutions, please read the following
articles:
[ERROR] [Help 1] http://cwiki.apache.org/confluence/display/MAVEN/MojoFailureException
[ERROR] 
[ERROR] After correcting the problems, you can resume the build with the command
[ERROR]   mvn <goals> -rf :hama-core
Build step 'Invoke top-level Maven targets' marked build as failure
Archiving artifacts
Sending artifact delta relative to Hama-Nightly-for-Hadoop-1.x #1659
Archived 69 artifacts
Archive block size is 32768
Received 0 blocks and 191797 bytes
Compression is 0.0%
Took 11 sec
Recording test results

Mime
View raw message