hama-dev mailing list archives

Site index · List index
Message view « Date » · « Thread »
Top « Date » · « Thread »
From Apache Jenkins Server <jenk...@builds.apache.org>
Subject Build failed in Jenkins: Hama-Nightly-for-Hadoop-1.x #1582
Date Wed, 15 Apr 2015 00:01:39 GMT
See <https://builds.apache.org/job/Hama-Nightly-for-Hadoop-1.x/1582/changes>

Changes:

[edwardyoon] 

[edwardyoon] fix minor bug

[edwardyoon] HAMA-944: Add JSON format option to fastgen command (Minho Kim via edwardyoon)

[edwardyoon] Use thread pool

------------------------------------------
[...truncated 21594 lines...]

15/04/15 00:00:48 INFO graph.GraphJobRunner: Total time spent for loading vertices: 24 ms

15/04/15 00:00:48 INFO graph.GraphJobRunner: Total time spent for broadcasting global vertex
count: 151 ms

15/04/15 00:00:48 ERROR bsp.BSPTask: Error running bsp setup and bsp function.
java.lang.IllegalArgumentException
	at java.util.concurrent.ThreadPoolExecutor.<init>(ThreadPoolExecutor.java:1310)
	at java.util.concurrent.ThreadPoolExecutor.<init>(ThreadPoolExecutor.java:1198)
	at java.util.concurrent.Executors.newFixedThreadPool(Executors.java:89)
	at org.apache.hama.graph.GraphJobRunner.doInitialSuperstep(GraphJobRunner.java:281)
	at org.apache.hama.graph.GraphJobRunner.setup(GraphJobRunner.java:126)
	at org.apache.hama.bsp.BSPTask.runBSP(BSPTask.java:170)
	at org.apache.hama.bsp.BSPTask.run(BSPTask.java:144)
	at org.apache.hama.bsp.GroomServer$BSPPeerChild.main(GroomServer.java:1255)

15/04/15 00:00:48 ERROR bsp.BSPTask: Error cleaning up after bsp executed.
java.lang.NullPointerException
	at org.apache.hadoop.io.SequenceFile$Writer.append(SequenceFile.java:1308)
	at org.apache.hadoop.io.SequenceFile$Writer.append(SequenceFile.java:1298)
	at org.apache.hama.bsp.SequenceFileRecordWriter.write(SequenceFileRecordWriter.java:47)
	at org.apache.hama.bsp.SequenceFileRecordWriter.write(SequenceFileRecordWriter.java:31)
	at org.apache.hama.bsp.BSPPeerImpl$1.collect(BSPPeerImpl.java:333)
	at org.apache.hama.bsp.BSPPeerImpl.write(BSPPeerImpl.java:607)
	at org.apache.hama.graph.DefaultVertexOutputWriter.write(DefaultVertexOutputWriter.java:50)
	at org.apache.hama.graph.GraphJobRunner.cleanup(GraphJobRunner.java:185)
	at org.apache.hama.bsp.BSPTask.runBSP(BSPTask.java:177)
	at org.apache.hama.bsp.BSPTask.run(BSPTask.java:144)
	at org.apache.hama.bsp.GroomServer$BSPPeerChild.main(GroomServer.java:1255)

15/04/15 00:00:48 INFO server.PrepRequestProcessor: Processed session termination for sessionid:
0x14cba60bb0c0002

15/04/15 00:00:48 INFO zookeeper.ZooKeeper: Session: 0x14cba60bb0c0002 closed
15/04/15 00:00:48 INFO zookeeper.ClientCnxn: EventThread shut down

15/04/15 00:00:48 INFO ipc.Server: Stopping server on 61001

15/04/15 00:00:48 INFO ipc.Server: IPC Server handler 0 on 61001: exiting

15/04/15 00:00:48 INFO ipc.Server: IPC Server handler 1 on 61001: exiting

15/04/15 00:00:48 INFO ipc.Server: IPC Server handler 4 on 61001: exiting

15/04/15 00:00:48 INFO ipc.Server: IPC Server handler 3 on 61001: exiting

15/04/15 00:00:48 INFO server.NIOServerCnxn: Closed socket connection for client /0:0:0:0:0:0:0:1:56208
which had sessionid 0x14cba60bb0c0002

15/04/15 00:00:48 INFO ipc.Server: IPC Server handler 2 on 61001: exiting

15/04/15 00:00:48 INFO ipc.Server: Stopping IPC Server listener on 61001

15/04/15 00:00:48 INFO ipc.Server: Stopping IPC Server Responder

15/04/15 00:00:48 INFO Configuration.deprecation: mapred.cache.localFiles is deprecated. Instead,
use mapreduce.job.cache.local.files

15/04/15 00:00:48 ERROR bsp.BSPTask: Shutting down ping service.

15/04/15 00:00:48 FATAL bsp.GroomServer: Error running child
java.lang.IllegalArgumentException
	at java.util.concurrent.ThreadPoolExecutor.<init>(ThreadPoolExecutor.java:1310)
	at java.util.concurrent.ThreadPoolExecutor.<init>(ThreadPoolExecutor.java:1198)
	at java.util.concurrent.Executors.newFixedThreadPool(Executors.java:89)
	at org.apache.hama.graph.GraphJobRunner.doInitialSuperstep(GraphJobRunner.java:281)
	at org.apache.hama.graph.GraphJobRunner.setup(GraphJobRunner.java:126)
	at org.apache.hama.bsp.BSPTask.runBSP(BSPTask.java:170)
	at org.apache.hama.bsp.BSPTask.run(BSPTask.java:144)
	at org.apache.hama.bsp.GroomServer$BSPPeerChild.main(GroomServer.java:1255)

java.lang.IllegalArgumentException
	at java.util.concurrent.ThreadPoolExecutor.<init>(ThreadPoolExecutor.java:1310)

	at java.util.concurrent.ThreadPoolExecutor.<init>(ThreadPoolExecutor.java:1198)

	at java.util.concurrent.Executors.newFixedThreadPool(Executors.java:89)
	at org.apache.hama.graph.GraphJobRunner.doInitialSuperstep(GraphJobRunner.java:281)
	at org.apache.hama.graph.GraphJobRunner.setup(GraphJobRunner.java:126)

	at org.apache.hama.bsp.BSPTask.runBSP(BSPTask.java:170)
	at org.apache.hama.bsp.BSPTask.run(BSPTask.java:144)

	at org.apache.hama.bsp.GroomServer$BSPPeerChild.main(GroomServer.java:1255)
15/04/15 00:00:49 INFO bsp.BSPJobClient: Current supersteps number: 2

15/04/15 00:01:21 INFO bsp.GroomServer: adding purge task: attempt_201504150000_0001_000000_0

15/04/15 00:01:21 INFO bsp.GroomServer: About to purge task: attempt_201504150000_0001_000000_0

15/04/15 00:01:21 INFO bsp.JobInProgress: Taskid 'attempt_201504150000_0001_000000_0' has
failed.

15/04/15 00:01:21 INFO bsp.TaskInProgress: Task 'task_201504150000_0001_000000' has failed.

15/04/15 00:01:21 INFO bsp.JobInProgress: Job failed.

15/04/15 00:01:21 INFO bsp.GroomServer: Kill 1 tasks.

15/04/15 00:01:22 INFO bsp.BSPJobClient: Current supersteps number: 0

15/04/15 00:01:22 WARN bsp.BSPJobClient: Error reading task outputhttp://asf910.gq1.ygridcore.net:40015/tasklog?plaintext=true&taskid=attempt_201504150000_0001_000000_0&filter=stdout

15/04/15 00:01:22 WARN mortbay.log: /tasklog: java.io.IOException: Closed

15/04/15 00:01:22 INFO bsp.BSPJobClient: Job failed.

15/04/15 00:01:22 INFO server.PrepRequestProcessor: Processed session termination for sessionid:
0x14cba60bb0c0000

15/04/15 00:01:22 INFO zookeeper.ZooKeeper: Session: 0x14cba60bb0c0000 closed

15/04/15 00:01:22 INFO server.NIOServerCnxn: Closed socket connection for client /0:0:0:0:0:0:0:1:56202
which had sessionid 0x14cba60bb0c0000

15/04/15 00:01:22 INFO zookeeper.ClientCnxn: EventThread shut down

15/04/15 00:01:22 INFO ipc.Server: Stopping server on 40000

15/04/15 00:01:22 INFO ipc.Server: IPC Server handler 0 on 40000: exiting

15/04/15 00:01:22 INFO ipc.Server: Stopping IPC Server listener on 40000

15/04/15 00:01:22 INFO bsp.BSPMaster: Stopped RPC Master server.

15/04/15 00:01:22 INFO ipc.Server: Stopping IPC Server Responder

15/04/15 00:01:22 INFO server.PrepRequestProcessor: Processed session termination for sessionid:
0x14cba60bb0c0001

15/04/15 00:01:22 INFO zookeeper.ZooKeeper: Session: 0x14cba60bb0c0001 closed

15/04/15 00:01:22 INFO server.NIOServerCnxn: Closed socket connection for client /127.0.0.1:34772
which had sessionid 0x14cba60bb0c0001

15/04/15 00:01:22 INFO zookeeper.ClientCnxn: EventThread shut down

15/04/15 00:01:22 INFO ipc.Server: Stopping server on 33655

15/04/15 00:01:22 INFO ipc.Server: IPC Server handler 0 on 33655: exiting

15/04/15 00:01:22 INFO ipc.Server: Stopping IPC Server listener on 33655

15/04/15 00:01:22 INFO ipc.Server: Stopping server on 52120

15/04/15 00:01:22 INFO ipc.Server: Stopping IPC Server Responder

15/04/15 00:01:22 INFO ipc.Server: IPC Server handler 1 on 52120: exiting

15/04/15 00:01:22 INFO ipc.Server: IPC Server handler 4 on 52120: exiting

15/04/15 00:01:22 INFO ipc.Server: IPC Server handler 0 on 52120: exiting

15/04/15 00:01:22 INFO ipc.Server: Stopping IPC Server listener on 52120

15/04/15 00:01:22 INFO ipc.Server: IPC Server handler 3 on 52120: exiting

15/04/15 00:01:22 INFO ipc.Server: Stopping IPC Server Responder

15/04/15 00:01:22 INFO ipc.Server: IPC Server handler 2 on 52120: exiting

15/04/15 00:01:22 INFO server.NIOServerCnxnFactory: NIOServerCnxn factory exited run method

15/04/15 00:01:22 INFO server.ZooKeeperServer: shutting down

15/04/15 00:01:22 INFO server.SessionTrackerImpl: Shutting down

15/04/15 00:01:22 INFO server.PrepRequestProcessor: Shutting down

15/04/15 00:01:22 INFO server.SyncRequestProcessor: Shutting down

15/04/15 00:01:22 INFO server.PrepRequestProcessor: PrepRequestProcessor exited loop!

15/04/15 00:01:22 INFO server.SyncRequestProcessor: SyncRequestProcessor exited!

15/04/15 00:01:22 INFO server.FinalRequestProcessor: shutdown of request processor complete

Tests run: 1, Failures: 1, Errors: 0, Skipped: 0, Time elapsed: 0.017 sec <<< FAILURE!

Results :

Failed tests: 
  testSubmitJob(org.apache.hama.graph.TestSubmitGraphJob)

Tests run: 7, Failures: 1, Errors: 0, Skipped: 0

[INFO] ------------------------------------------------------------------------
[INFO] Reactor Summary:
[INFO] 
[INFO] Apache Hama parent POM ............................ SUCCESS [4.277s]
[INFO] pipes ............................................. SUCCESS [15.473s]
[INFO] commons ........................................... SUCCESS [6.318s]
[INFO] core .............................................. SUCCESS [3:01.068s]
[INFO] graph ............................................. FAILURE [45.415s]
[INFO] machine learning .................................. SKIPPED
[INFO] examples .......................................... SKIPPED
[INFO] mesos ............................................. SKIPPED
[INFO] hama-dist ......................................... SKIPPED
[INFO] ------------------------------------------------------------------------
[INFO] BUILD FAILURE
[INFO] ------------------------------------------------------------------------
[INFO] Total time: 4:13.162s
[INFO] Finished at: Wed Apr 15 00:01:22 UTC 2015
[INFO] Final Memory: 90M/635M
[INFO] ------------------------------------------------------------------------
[ERROR] Failed to execute goal org.apache.maven.plugins:maven-surefire-plugin:2.6:test (default-test)
on project hama-graph: There are test failures.
[ERROR] 
[ERROR] Please refer to <https://builds.apache.org/job/Hama-Nightly-for-Hadoop-1.x/ws/trunk/graph/target/surefire-reports>
for the individual test results.
[ERROR] -> [Help 1]
org.apache.maven.lifecycle.LifecycleExecutionException: Failed to execute goal org.apache.maven.plugins:maven-surefire-plugin:2.6:test
(default-test) on project hama-graph: There are test failures.

Please refer to <https://builds.apache.org/job/Hama-Nightly-for-Hadoop-1.x/ws/trunk/graph/target/surefire-reports>
for the individual test results.
	at org.apache.maven.lifecycle.internal.MojoExecutor.execute(MojoExecutor.java:213)
	at org.apache.maven.lifecycle.internal.MojoExecutor.execute(MojoExecutor.java:153)
	at org.apache.maven.lifecycle.internal.MojoExecutor.execute(MojoExecutor.java:145)
	at org.apache.maven.lifecycle.internal.LifecycleModuleBuilder.buildProject(LifecycleModuleBuilder.java:84)
	at org.apache.maven.lifecycle.internal.LifecycleModuleBuilder.buildProject(LifecycleModuleBuilder.java:59)
	at org.apache.maven.lifecycle.internal.LifecycleStarter.singleThreadedBuild(LifecycleStarter.java:183)
	at org.apache.maven.lifecycle.internal.LifecycleStarter.execute(LifecycleStarter.java:161)
	at org.apache.maven.DefaultMaven.doExecute(DefaultMaven.java:320)
	at org.apache.maven.DefaultMaven.execute(DefaultMaven.java:156)
	at org.apache.maven.cli.MavenCli.execute(MavenCli.java:537)
	at org.apache.maven.cli.MavenCli.doMain(MavenCli.java:196)
	at org.apache.maven.cli.MavenCli.main(MavenCli.java:141)
	at sun.reflect.NativeMethodAccessorImpl.invoke0(Native Method)
	at sun.reflect.NativeMethodAccessorImpl.invoke(NativeMethodAccessorImpl.java:57)
	at sun.reflect.DelegatingMethodAccessorImpl.invoke(DelegatingMethodAccessorImpl.java:43)
	at java.lang.reflect.Method.invoke(Method.java:606)
	at org.codehaus.plexus.classworlds.launcher.Launcher.launchEnhanced(Launcher.java:290)
	at org.codehaus.plexus.classworlds.launcher.Launcher.launch(Launcher.java:230)
	at org.codehaus.plexus.classworlds.launcher.Launcher.mainWithExitCode(Launcher.java:409)
	at org.codehaus.plexus.classworlds.launcher.Launcher.main(Launcher.java:352)
Caused by: org.apache.maven.plugin.MojoFailureException: There are test failures.

Please refer to <https://builds.apache.org/job/Hama-Nightly-for-Hadoop-1.x/ws/trunk/graph/target/surefire-reports>
for the individual test results.
	at org.apache.maven.plugin.surefire.SurefireHelper.reportExecution(SurefireHelper.java:55)
	at org.apache.maven.plugin.surefire.SurefirePlugin.execute(SurefirePlugin.java:592)
	at org.apache.maven.plugin.DefaultBuildPluginManager.executeMojo(DefaultBuildPluginManager.java:101)
	at org.apache.maven.lifecycle.internal.MojoExecutor.execute(MojoExecutor.java:209)
	... 19 more
[ERROR] 
[ERROR] 
[ERROR] For more information about the errors and possible solutions, please read the following
articles:
[ERROR] [Help 1] http://cwiki.apache.org/confluence/display/MAVEN/MojoFailureException
[ERROR] 
[ERROR] After correcting the problems, you can resume the build with the command
[ERROR]   mvn <goals> -rf :hama-graph
Build step 'Invoke top-level Maven targets' marked build as failure
Archiving artifacts
Sending artifact delta relative to Hama-Nightly-for-Hadoop-1.x #1581
Archived 86 artifacts
Archive block size is 32768
Received 0 blocks and 269039 bytes
Compression is 0.0%
Took 14 sec
Recording test results
Updating HAMA-944

Mime
View raw message