hama-dev mailing list archives

Site index · List index
Message view « Date » · « Thread »
Top « Date » · « Thread »
From Apache Jenkins Server <jenk...@builds.apache.org>
Subject Build failed in Jenkins: Hama-Nightly-for-Hadoop-1.x #1579
Date Sun, 12 Apr 2015 00:03:46 GMT
See <https://builds.apache.org/job/Hama-Nightly-for-Hadoop-1.x/1579/>

------------------------------------------
[...truncated 50052 lines...]

15/04/12 00:03:24 INFO server.NIOServerCnxnFactory: binding to port 0.0.0.0/0.0.0.0:21810

15/04/12 00:03:24 INFO persistence.FileTxnSnapLog: Snapshotting: 0x0 to /tmp/hama-test/build/data/testSubmitJob/zookeeper/version-2/snapshot.0

15/04/12 00:03:24 INFO server.NIOServerCnxnFactory: Accepted socket connection from /127.0.0.1:50344

15/04/12 00:03:24 INFO server.NIOServerCnxn: Processing stat command from /127.0.0.1:50344

15/04/12 00:03:24 INFO server.NIOServerCnxn: Stat command output

15/04/12 00:03:24 INFO server.NIOServerCnxn: Closed socket connection for client /127.0.0.1:50344
(no session established for client)

15/04/12 00:03:24 INFO hama.MiniBSPCluster: Groom server number 1

15/04/12 00:03:24 INFO hama.MiniBSPCluster: Thread pool value 10

15/04/12 00:03:24 INFO hama.MiniBSPCluster: Waiting BSPMaster up.

15/04/12 00:03:24 INFO hama.MiniBSPCluster: Starting BSP Master.

15/04/12 00:03:24 INFO bsp.BSPMaster: RPC BSPMaster: host localhost port 40000

15/04/12 00:03:24 INFO ipc.Server: Starting Socket Reader #1 for port 40000

15/04/12 00:03:24 INFO mortbay.log: Logging to org.slf4j.impl.Log4jLoggerAdapter(org.mortbay.log)
via org.mortbay.log.Slf4jLog

15/04/12 00:03:24 INFO http.HttpServer: Port returned by webServer.getConnectors()[0].getLocalPort()
before open() is -1. Opening the listener on 40013

15/04/12 00:03:24 INFO http.HttpServer: listener.getLocalPort() returned 40013 webServer.getConnectors()[0].getLocalPort()
returned 40013

15/04/12 00:03:24 INFO http.HttpServer: Jetty bound to port 40013

15/04/12 00:03:24 INFO mortbay.log: jetty-6.1.14

15/04/12 00:03:24 INFO mortbay.log: Extract jar:<https://builds.apache.org/job/Hama-Nightly-for-Hadoop-1.x/ws/trunk/core/target/hama-core-0.7.0-SNAPSHOT.jar!/webapp/bspmaster/>
to /tmp/Jetty_localhost_40013_bspmaster____.4scbvw/webapp

15/04/12 00:03:25 INFO mortbay.log: Started SelectChannelConnector@localhost:40013

15/04/12 00:03:25 INFO bsp.BSPMaster: Cleaning up the system directory

15/04/12 00:03:25 INFO bsp.BSPMaster: file:/tmp/hadoop/bsp/system

15/04/12 00:03:25 INFO zookeeper.ZooKeeper: Client environment:zookeeper.version=3.4.5-1392090,
built on 09/30/2012 17:52 GMT

15/04/12 00:03:25 INFO zookeeper.ZooKeeper: Client environment:host.name=proserpina.apache.org

15/04/12 00:03:25 INFO zookeeper.ZooKeeper: Client environment:java.version=1.7.0_25

15/04/12 00:03:25 INFO zookeeper.ZooKeeper: Client environment:java.vendor=Oracle Corporation

15/04/12 00:03:25 INFO zookeeper.ZooKeeper: Client environment:java.home=/home/jenkins/tools/java/jdk1.7.0_25-32/jre

15/04/12 00:03:25 INFO zookeeper.ZooKeeper: Client environment:java.class.path=/tmp/surefirebooter3143128793337450223.jar

15/04/12 00:03:25 INFO zookeeper.ZooKeeper: Client environment:java.library.path=/usr/java/packages/lib/i386:/lib:/usr/lib

15/04/12 00:03:25 INFO zookeeper.ZooKeeper: Client environment:java.io.tmpdir=/tmp

15/04/12 00:03:25 INFO zookeeper.ZooKeeper: Client environment:java.compiler=<NA>

15/04/12 00:03:25 INFO zookeeper.ZooKeeper: Client environment:os.name=Linux

15/04/12 00:03:25 INFO zookeeper.ZooKeeper: Client environment:os.arch=i386

15/04/12 00:03:25 INFO zookeeper.ZooKeeper: Client environment:os.version=3.13.0-36-lowlatency

15/04/12 00:03:25 INFO zookeeper.ZooKeeper: Client environment:user.name=jenkins

15/04/12 00:03:25 INFO zookeeper.ZooKeeper: Client environment:user.home=/home/jenkins

15/04/12 00:03:25 INFO zookeeper.ZooKeeper: Client environment:user.dir=<https://builds.apache.org/job/Hama-Nightly-for-Hadoop-1.x/ws/trunk/graph>

15/04/12 00:03:25 INFO zookeeper.ZooKeeper: Initiating client connection, connectString=localhost:21810
sessionTimeout=1200000 watcher=org.apache.hama.bsp.sync.ZKSyncBSPMasterClient@65fa44

15/04/12 00:03:25 INFO sync.ZKSyncBSPMasterClient: Initialized ZK false

15/04/12 00:03:25 INFO sync.ZKSyncClient: Initializing ZK Sync Client

15/04/12 00:03:25 INFO zookeeper.ClientCnxn: Opening socket connection to server localhost/127.0.0.1:21810.
Will not attempt to authenticate using SASL (unknown error)

15/04/12 00:03:25 INFO server.NIOServerCnxnFactory: Accepted socket connection from /127.0.0.1:50345

15/04/12 00:03:25 INFO zookeeper.ClientCnxn: Socket connection established to localhost/127.0.0.1:21810,
initiating session

15/04/12 00:03:25 INFO server.ZooKeeperServer: Client attempting to establish new session
at /127.0.0.1:50345

15/04/12 00:03:25 INFO persistence.FileTxnLog: Creating new log file: log.1

15/04/12 00:03:25 INFO server.ZooKeeperServer: Established session 0x14caaf01bca0000 with
negotiated timeout 40000 for client /127.0.0.1:50345

15/04/12 00:03:25 INFO zookeeper.ClientCnxn: Session establishment complete on server localhost/127.0.0.1:21810,
sessionid = 0x14caaf01bca0000, negotiated timeout = 40000

15/04/12 00:03:25 INFO ipc.Server: IPC Server Responder: starting

15/04/12 00:03:25 INFO ipc.Server: IPC Server listener on 40000: starting

15/04/12 00:03:25 INFO ipc.Server: IPC Server handler 0 on 40000: starting

15/04/12 00:03:25 INFO bsp.BSPMaster: Starting RUNNING

15/04/12 00:03:25 INFO hama.MiniBSPCluster: Waitin for GroomServer up.

15/04/12 00:03:25 INFO bsp.GroomServer: groom start

15/04/12 00:03:25 INFO zookeeper.ZooKeeper: Initiating client connection, connectString=localhost:21810
sessionTimeout=1200000 watcher=org.apache.hama.bsp.GroomServer@695ee1

15/04/12 00:03:25 INFO zookeeper.ClientCnxn: Opening socket connection to server localhost/127.0.0.1:21810.
Will not attempt to authenticate using SASL (unknown error)

15/04/12 00:03:25 INFO zookeeper.ClientCnxn: Socket connection established to localhost/127.0.0.1:21810,
initiating session

15/04/12 00:03:25 INFO server.NIOServerCnxnFactory: Accepted socket connection from /127.0.0.1:50346

15/04/12 00:03:25 INFO server.ZooKeeperServer: Client attempting to establish new session
at /127.0.0.1:50346

15/04/12 00:03:25 INFO bsp.GroomServer: /tmp/hama-test

15/04/12 00:03:25 ERROR bsp.GroomServer: Got fatal exception while reinitializing GroomServer:
java.net.BindException: Problem binding to proserpina.apache.org/67.195.81.189:56213 : Address
already in use
	at org.apache.hama.ipc.Server.bind(Server.java:250)
	at org.apache.hama.ipc.Server$Listener.<init>(Server.java:316)
	at org.apache.hama.ipc.Server.<init>(Server.java:1313)
	at org.apache.hama.ipc.RPC$Server.<init>(RPC.java:597)
	at org.apache.hama.ipc.RPC.getServer(RPC.java:553)
	at org.apache.hama.ipc.RPC.getServer(RPC.java:540)
	at org.apache.hama.ipc.RPC.getServer(RPC.java:530)
	at org.apache.hama.bsp.GroomServer.initialize(GroomServer.java:344)
	at org.apache.hama.bsp.GroomServer.run(GroomServer.java:860)
	at java.lang.Thread.run(Thread.java:724)
Caused by: java.net.BindException: Address already in use
	at sun.nio.ch.Net.bind0(Native Method)
	at sun.nio.ch.Net.bind(Net.java:444)
	at sun.nio.ch.Net.bind(Net.java:436)
	at sun.nio.ch.ServerSocketChannelImpl.bind(ServerSocketChannelImpl.java:214)
	at sun.nio.ch.ServerSocketAdaptor.bind(ServerSocketAdaptor.java:74)
	at org.apache.hama.ipc.Server.bind(Server.java:248)
	... 9 more


15/04/12 00:03:25 INFO server.ZooKeeperServer: Established session 0x14caaf01bca0001 with
negotiated timeout 40000 for client /127.0.0.1:50346

15/04/12 00:03:25 INFO zookeeper.ClientCnxn: Session establishment complete on server localhost/127.0.0.1:21810,
sessionid = 0x14caaf01bca0001, negotiated timeout = 40000

15/04/12 00:03:25 INFO server.PrepRequestProcessor: Processed session termination for sessionid:
0x14caaf01bca0001

15/04/12 00:03:25 INFO zookeeper.ClientCnxn: EventThread shut down

15/04/12 00:03:25 INFO zookeeper.ZooKeeper: Session: 0x14caaf01bca0001 closed

15/04/12 00:03:25 INFO server.NIOServerCnxn: Closed socket connection for client /127.0.0.1:50346
which had sessionid 0x14caaf01bca0001

15/04/12 00:03:26 INFO hama.MiniBSPCluster: Waitin for GroomServer up.

15/04/12 00:03:27 INFO hama.MiniBSPCluster: Waitin for GroomServer up.

15/04/12 00:03:28 INFO hama.MiniBSPCluster: Waitin for GroomServer up.

15/04/12 00:03:29 INFO hama.MiniBSPCluster: Waitin for GroomServer up.

15/04/12 00:03:30 INFO hama.MiniBSPCluster: Waitin for GroomServer up.

15/04/12 00:03:31 INFO hama.MiniBSPCluster: Waitin for GroomServer up.

15/04/12 00:03:32 INFO hama.MiniBSPCluster: Waitin for GroomServer up.

15/04/12 00:03:33 INFO hama.MiniBSPCluster: Waitin for GroomServer up.

15/04/12 00:03:34 INFO hama.MiniBSPCluster: Waitin for GroomServer up.

15/04/12 00:03:35 INFO hama.MiniBSPCluster: Waitin for GroomServer up.

Tests run: 1, Failures: 1, Errors: 0, Skipped: 0, Time elapsed: 0.017 sec <<< FAILURE!

Results :

Failed tests: 
  testSubmitJob(org.apache.hama.graph.TestSubmitGraphJob)

Tests run: 7, Failures: 1, Errors: 0, Skipped: 0

[INFO] ------------------------------------------------------------------------
[INFO] Reactor Summary:
[INFO] 
[INFO] Apache Hama parent POM ............................ SUCCESS [1:09.448s]
[INFO] pipes ............................................. SUCCESS [37.082s]
[INFO] commons ........................................... SUCCESS [18.678s]
[INFO] core .............................................. SUCCESS [3:55.305s]
[INFO] graph ............................................. FAILURE [19.109s]
[INFO] machine learning .................................. SKIPPED
[INFO] examples .......................................... SKIPPED
[INFO] mesos ............................................. SKIPPED
[INFO] hama-dist ......................................... SKIPPED
[INFO] ------------------------------------------------------------------------
[INFO] BUILD FAILURE
[INFO] ------------------------------------------------------------------------
[INFO] Total time: 6:24.669s
[INFO] Finished at: Sun Apr 12 00:03:37 UTC 2015
[INFO] Final Memory: 89M/329M
[INFO] ------------------------------------------------------------------------
[ERROR] Failed to execute goal org.apache.maven.plugins:maven-surefire-plugin:2.6:test (default-test)
on project hama-graph: There are test failures.
[ERROR] 
[ERROR] Please refer to <https://builds.apache.org/job/Hama-Nightly-for-Hadoop-1.x/ws/trunk/graph/target/surefire-reports>
for the individual test results.
[ERROR] -> [Help 1]
org.apache.maven.lifecycle.LifecycleExecutionException: Failed to execute goal org.apache.maven.plugins:maven-surefire-plugin:2.6:test
(default-test) on project hama-graph: There are test failures.

Please refer to <https://builds.apache.org/job/Hama-Nightly-for-Hadoop-1.x/ws/trunk/graph/target/surefire-reports>
for the individual test results.
	at org.apache.maven.lifecycle.internal.MojoExecutor.execute(MojoExecutor.java:213)
	at org.apache.maven.lifecycle.internal.MojoExecutor.execute(MojoExecutor.java:153)
	at org.apache.maven.lifecycle.internal.MojoExecutor.execute(MojoExecutor.java:145)
	at org.apache.maven.lifecycle.internal.LifecycleModuleBuilder.buildProject(LifecycleModuleBuilder.java:84)
	at org.apache.maven.lifecycle.internal.LifecycleModuleBuilder.buildProject(LifecycleModuleBuilder.java:59)
	at org.apache.maven.lifecycle.internal.LifecycleStarter.singleThreadedBuild(LifecycleStarter.java:183)
	at org.apache.maven.lifecycle.internal.LifecycleStarter.execute(LifecycleStarter.java:161)
	at org.apache.maven.DefaultMaven.doExecute(DefaultMaven.java:320)
	at org.apache.maven.DefaultMaven.execute(DefaultMaven.java:156)
	at org.apache.maven.cli.MavenCli.execute(MavenCli.java:537)
	at org.apache.maven.cli.MavenCli.doMain(MavenCli.java:196)
	at org.apache.maven.cli.MavenCli.main(MavenCli.java:141)
	at sun.reflect.NativeMethodAccessorImpl.invoke0(Native Method)
	at sun.reflect.NativeMethodAccessorImpl.invoke(NativeMethodAccessorImpl.java:57)
	at sun.reflect.DelegatingMethodAccessorImpl.invoke(DelegatingMethodAccessorImpl.java:43)
	at java.lang.reflect.Method.invoke(Method.java:606)
	at org.codehaus.plexus.classworlds.launcher.Launcher.launchEnhanced(Launcher.java:290)
	at org.codehaus.plexus.classworlds.launcher.Launcher.launch(Launcher.java:230)
	at org.codehaus.plexus.classworlds.launcher.Launcher.mainWithExitCode(Launcher.java:409)
	at org.codehaus.plexus.classworlds.launcher.Launcher.main(Launcher.java:352)
Caused by: org.apache.maven.plugin.MojoFailureException: There are test failures.

Please refer to <https://builds.apache.org/job/Hama-Nightly-for-Hadoop-1.x/ws/trunk/graph/target/surefire-reports>
for the individual test results.
	at org.apache.maven.plugin.surefire.SurefireHelper.reportExecution(SurefireHelper.java:55)
	at org.apache.maven.plugin.surefire.SurefirePlugin.execute(SurefirePlugin.java:592)
	at org.apache.maven.plugin.DefaultBuildPluginManager.executeMojo(DefaultBuildPluginManager.java:101)
	at org.apache.maven.lifecycle.internal.MojoExecutor.execute(MojoExecutor.java:209)
	... 19 more
[ERROR] 
[ERROR] 
[ERROR] For more information about the errors and possible solutions, please read the following
articles:
[ERROR] [Help 1] http://cwiki.apache.org/confluence/display/MAVEN/MojoFailureException
[ERROR] 
[ERROR] After correcting the problems, you can resume the build with the command
[ERROR]   mvn <goals> -rf :hama-graph
Build step 'Invoke top-level Maven targets' marked build as failure
Archiving artifacts
Sending artifact delta relative to Hama-Nightly-for-Hadoop-1.x #1574
Archived 85 artifacts
Archive block size is 32768
Received 0 blocks and 251697 bytes
Compression is 0.0%
Took 8.4 sec
Recording test results

Mime
View raw message