hama-dev mailing list archives

Site index · List index
Message view « Date » · « Thread »
Top « Date » · « Thread »
From Apache Jenkins Server <jenk...@builds.apache.org>
Subject Build failed in Jenkins: Hama-Nightly-for-Hadoop-1.x #1587
Date Mon, 20 Apr 2015 00:01:15 GMT
See <https://builds.apache.org/job/Hama-Nightly-for-Hadoop-1.x/1587/changes>

Changes:

[edwardyoon] Use newCachedThreadPool

------------------------------------------
[...truncated 21522 lines...]

15/04/20 00:00:50 INFO graph.GraphJobRunner: Total time spent for broadcasting aggregation
values: 25 ms

15/04/20 00:00:50 INFO graph.GraphJobRunner: Total time spent for 46 superstep: 2 ms

15/04/20 00:00:50 INFO graph.GraphJobRunner: Total time spent for broadcasting aggregation
values: 38 ms

15/04/20 00:00:50 INFO graph.GraphJobRunner: Total time spent for 48 superstep: 3 ms

15/04/20 00:00:50 INFO graph.GraphJobRunner: Total time spent for broadcasting aggregation
values: 24 ms

15/04/20 00:00:50 INFO graph.GraphJobRunner: Total time spent for 50 superstep: 1 ms

15/04/20 00:00:50 INFO graph.GraphJobRunner: Total time spent for broadcasting aggregation
values: 37 ms

15/04/20 00:00:50 INFO graph.GraphJobRunner: Total time spent for 52 superstep: 1 ms

15/04/20 00:00:50 INFO graph.GraphJobRunner: Total time spent for broadcasting aggregation
values: 26 ms

15/04/20 00:00:50 INFO graph.GraphJobRunner: Total time spent for 54 superstep: 2 ms

15/04/20 00:00:50 INFO graph.GraphJobRunner: Total time spent for broadcasting aggregation
values: 31 ms

15/04/20 00:00:50 INFO graph.GraphJobRunner: Total time spent for 56 superstep: 2 ms

15/04/20 00:00:50 INFO graph.GraphJobRunner: Total time spent for broadcasting aggregation
values: 24 ms

15/04/20 00:00:50 INFO graph.GraphJobRunner: Total time spent for 58 superstep: 2 ms

15/04/20 00:00:50 INFO graph.GraphJobRunner: Total time spent for broadcasting aggregation
values: 39 ms

15/04/20 00:00:50 INFO graph.GraphJobRunner: Total time spent for 60 superstep: 2 ms

15/04/20 00:00:50 INFO graph.GraphJobRunner: Total time spent for broadcasting aggregation
values: 23 ms

15/04/20 00:00:50 INFO graph.GraphJobRunner: Total time spent for 62 superstep: 2 ms

15/04/20 00:00:50 INFO server.PrepRequestProcessor: Processed session termination for sessionid:
0x14cd42088560002

15/04/20 00:00:50 INFO zookeeper.ZooKeeper: Session: 0x14cd42088560002 closed

15/04/20 00:00:50 INFO zookeeper.ClientCnxn: EventThread shut down

15/04/20 00:00:50 INFO ipc.Server: Stopping server on 61001

15/04/20 00:00:50 INFO ipc.Server: IPC Server handler 1 on 61001: exiting

15/04/20 00:00:50 INFO ipc.Server: IPC Server handler 0 on 61001: exiting
15/04/20 00:00:50 INFO ipc.Server: IPC Server handler 2 on 61001: exiting

15/04/20 00:00:50 INFO ipc.Server: IPC Server handler 3 on 61001: exiting

15/04/20 00:00:50 INFO server.NIOServerCnxn: Closed socket connection for client /0:0:0:0:0:0:0:1:55574
which had sessionid 0x14cd42088560002

15/04/20 00:00:50 INFO ipc.Server: IPC Server handler 4 on 61001: exiting

15/04/20 00:00:50 INFO ipc.Server: Stopping IPC Server listener on 61001

15/04/20 00:00:50 INFO ipc.Server: Stopping IPC Server Responder

15/04/20 00:00:50 INFO Configuration.deprecation: mapred.cache.localFiles is deprecated. Instead,
use mapreduce.job.cache.local.files

15/04/20 00:00:50 INFO bsp.GroomServer: Task attempt_201504200000_0001_000000_0 is done.

15/04/20 00:00:51 INFO bsp.JobInProgress: Job successfully done.

15/04/20 00:00:52 INFO bsp.BSPJobClient: Current supersteps number: 62

15/04/20 00:00:52 INFO bsp.BSPJobClient: The total number of supersteps: 62

15/04/20 00:00:52 INFO bsp.BSPJobClient: Counters: 12

15/04/20 00:00:52 INFO bsp.BSPJobClient:   org.apache.hama.graph.GraphJobRunner$GraphJobCounter

15/04/20 00:00:52 INFO bsp.BSPJobClient:     ITERATIONS=29

15/04/20 00:00:52 INFO bsp.BSPJobClient:     INPUT_VERTICES=7

15/04/20 00:00:52 INFO bsp.BSPJobClient:   org.apache.hama.bsp.JobInProgress$JobCounter

15/04/20 00:00:52 INFO bsp.BSPJobClient:     SUPERSTEPS=62

15/04/20 00:00:52 INFO bsp.BSPJobClient:     LAUNCHED_TASKS=1

15/04/20 00:00:52 INFO bsp.BSPJobClient:   org.apache.hama.bsp.BSPPeerImpl$PeerCounter

15/04/20 00:00:52 INFO bsp.BSPJobClient:     SUPERSTEP_SUM=62

15/04/20 00:00:52 INFO bsp.BSPJobClient:     TIME_IN_SYNC_MS=1196

15/04/20 00:00:52 INFO bsp.BSPJobClient:     IO_BYTES_READ=392

15/04/20 00:00:52 INFO bsp.BSPJobClient:     TOTAL_MESSAGES_SENT=661

15/04/20 00:00:52 INFO bsp.BSPJobClient:     TOTAL_COMPRESSED_BYTES_TRANSFERED=14835

15/04/20 00:00:52 INFO bsp.BSPJobClient:     TASK_INPUT_RECORDS=8

15/04/20 00:00:52 INFO bsp.BSPJobClient:     TOTAL_DECOMPRESSED_BYTES=17846

15/04/20 00:00:52 INFO bsp.BSPJobClient:     TOTAL_MESSAGES_RECEIVED=271

15/04/20 00:00:52 INFO bsp.TestBSPMasterGroomServer: Sum is: 0.8962563992382957

15/04/20 00:00:52 INFO server.PrepRequestProcessor: Processed session termination for sessionid:
0x14cd42088560000

15/04/20 00:00:52 INFO zookeeper.ZooKeeper: Session: 0x14cd42088560000 closed

15/04/20 00:00:52 INFO zookeeper.ClientCnxn: EventThread shut down

15/04/20 00:00:52 INFO ipc.Server: Stopping server on 40000

15/04/20 00:00:52 INFO server.NIOServerCnxn: Closed socket connection for client /127.0.0.1:37338
which had sessionid 0x14cd42088560000

15/04/20 00:00:52 INFO ipc.Server: Stopping IPC Server listener on 40000

15/04/20 00:00:52 INFO ipc.Server: IPC Server handler 0 on 40000: exiting

15/04/20 00:00:52 INFO bsp.BSPMaster: Stopped RPC Master server.

15/04/20 00:00:52 INFO ipc.Server: Stopping IPC Server Responder

15/04/20 00:00:52 INFO server.PrepRequestProcessor: Processed session termination for sessionid:
0x14cd42088560001

15/04/20 00:00:52 INFO zookeeper.ZooKeeper: Session: 0x14cd42088560001 closed

15/04/20 00:00:52 INFO server.NIOServerCnxn: Closed socket connection for client /127.0.0.1:37339
which had sessionid 0x14cd42088560001

15/04/20 00:00:52 INFO zookeeper.ClientCnxn: EventThread shut down

15/04/20 00:00:52 INFO ipc.Server: Stopping server on 42463

15/04/20 00:00:52 INFO ipc.Server: IPC Server handler 0 on 42463: exiting

15/04/20 00:00:52 INFO ipc.Server: Stopping IPC Server listener on 42463

15/04/20 00:00:52 INFO ipc.Server: Stopping IPC Server Responder

15/04/20 00:00:52 INFO ipc.Server: Stopping server on 57293

15/04/20 00:00:52 INFO ipc.Server: IPC Server handler 2 on 57293: exiting

15/04/20 00:00:52 INFO ipc.Server: IPC Server handler 0 on 57293: exiting

15/04/20 00:00:52 INFO ipc.Server: IPC Server handler 3 on 57293: exiting

15/04/20 00:00:52 INFO ipc.Server: IPC Server handler 1 on 57293: exiting

15/04/20 00:00:52 INFO ipc.Server: Stopping IPC Server listener on 57293

15/04/20 00:00:52 INFO ipc.Server: Stopping IPC Server Responder

15/04/20 00:00:52 INFO server.NIOServerCnxnFactory: NIOServerCnxn factory exited run method

15/04/20 00:00:52 INFO ipc.Server: IPC Server handler 4 on 57293: exiting

15/04/20 00:00:52 INFO server.ZooKeeperServer: shutting down

15/04/20 00:00:52 INFO server.SessionTrackerImpl: Shutting down

15/04/20 00:00:52 INFO server.PrepRequestProcessor: Shutting down

15/04/20 00:00:52 INFO server.SyncRequestProcessor: Shutting down

15/04/20 00:00:52 INFO server.PrepRequestProcessor: PrepRequestProcessor exited loop!

15/04/20 00:00:52 INFO server.SyncRequestProcessor: SyncRequestProcessor exited!

15/04/20 00:00:52 INFO server.FinalRequestProcessor: shutdown of request processor complete

Tests run: 1, Failures: 1, Errors: 0, Skipped: 0, Time elapsed: 0.021 sec <<< FAILURE!

Results :

Failed tests: 
  testSubmitJob(org.apache.hama.graph.TestSubmitGraphJob)

Tests run: 7, Failures: 1, Errors: 0, Skipped: 0

[INFO] ------------------------------------------------------------------------
[INFO] Reactor Summary:
[INFO] 
[INFO] Apache Hama parent POM ............................ SUCCESS [4.921s]
[INFO] pipes ............................................. SUCCESS [17.880s]
[INFO] commons ........................................... SUCCESS [7.003s]
[INFO] core .............................................. SUCCESS [2:58.720s]
[INFO] graph ............................................. FAILURE [15.313s]
[INFO] machine learning .................................. SKIPPED
[INFO] examples .......................................... SKIPPED
[INFO] mesos ............................................. SKIPPED
[INFO] hama-dist ......................................... SKIPPED
[INFO] ------------------------------------------------------------------------
[INFO] BUILD FAILURE
[INFO] ------------------------------------------------------------------------
[INFO] Total time: 3:44.509s
[INFO] Finished at: Mon Apr 20 00:00:53 UTC 2015
[INFO] Final Memory: 89M/642M
[INFO] ------------------------------------------------------------------------
[ERROR] Failed to execute goal org.apache.maven.plugins:maven-surefire-plugin:2.6:test (default-test)
on project hama-graph: There are test failures.
[ERROR] 
[ERROR] Please refer to <https://builds.apache.org/job/Hama-Nightly-for-Hadoop-1.x/ws/trunk/graph/target/surefire-reports>
for the individual test results.
[ERROR] -> [Help 1]
org.apache.maven.lifecycle.LifecycleExecutionException: Failed to execute goal org.apache.maven.plugins:maven-surefire-plugin:2.6:test
(default-test) on project hama-graph: There are test failures.

Please refer to <https://builds.apache.org/job/Hama-Nightly-for-Hadoop-1.x/ws/trunk/graph/target/surefire-reports>
for the individual test results.
	at org.apache.maven.lifecycle.internal.MojoExecutor.execute(MojoExecutor.java:213)
	at org.apache.maven.lifecycle.internal.MojoExecutor.execute(MojoExecutor.java:153)
	at org.apache.maven.lifecycle.internal.MojoExecutor.execute(MojoExecutor.java:145)
	at org.apache.maven.lifecycle.internal.LifecycleModuleBuilder.buildProject(LifecycleModuleBuilder.java:84)
	at org.apache.maven.lifecycle.internal.LifecycleModuleBuilder.buildProject(LifecycleModuleBuilder.java:59)
	at org.apache.maven.lifecycle.internal.LifecycleStarter.singleThreadedBuild(LifecycleStarter.java:183)
	at org.apache.maven.lifecycle.internal.LifecycleStarter.execute(LifecycleStarter.java:161)
	at org.apache.maven.DefaultMaven.doExecute(DefaultMaven.java:320)
	at org.apache.maven.DefaultMaven.execute(DefaultMaven.java:156)
	at org.apache.maven.cli.MavenCli.execute(MavenCli.java:537)
	at org.apache.maven.cli.MavenCli.doMain(MavenCli.java:196)
	at org.apache.maven.cli.MavenCli.main(MavenCli.java:141)
	at sun.reflect.NativeMethodAccessorImpl.invoke0(Native Method)
	at sun.reflect.NativeMethodAccessorImpl.invoke(NativeMethodAccessorImpl.java:57)
	at sun.reflect.DelegatingMethodAccessorImpl.invoke(DelegatingMethodAccessorImpl.java:43)
	at java.lang.reflect.Method.invoke(Method.java:606)
	at org.codehaus.plexus.classworlds.launcher.Launcher.launchEnhanced(Launcher.java:290)
	at org.codehaus.plexus.classworlds.launcher.Launcher.launch(Launcher.java:230)
	at org.codehaus.plexus.classworlds.launcher.Launcher.mainWithExitCode(Launcher.java:409)
	at org.codehaus.plexus.classworlds.launcher.Launcher.main(Launcher.java:352)
Caused by: org.apache.maven.plugin.MojoFailureException: There are test failures.

Please refer to <https://builds.apache.org/job/Hama-Nightly-for-Hadoop-1.x/ws/trunk/graph/target/surefire-reports>
for the individual test results.
	at org.apache.maven.plugin.surefire.SurefireHelper.reportExecution(SurefireHelper.java:55)
	at org.apache.maven.plugin.surefire.SurefirePlugin.execute(SurefirePlugin.java:592)
	at org.apache.maven.plugin.DefaultBuildPluginManager.executeMojo(DefaultBuildPluginManager.java:101)
	at org.apache.maven.lifecycle.internal.MojoExecutor.execute(MojoExecutor.java:209)
	... 19 more
[ERROR] 
[ERROR] 
[ERROR] For more information about the errors and possible solutions, please read the following
articles:
[ERROR] [Help 1] http://cwiki.apache.org/confluence/display/MAVEN/MojoFailureException
[ERROR] 
[ERROR] After correcting the problems, you can resume the build with the command
[ERROR]   mvn <goals> -rf :hama-graph
Build step 'Invoke top-level Maven targets' marked build as failure
Archiving artifacts
Sending artifact delta relative to Hama-Nightly-for-Hadoop-1.x #1584
Archived 86 artifacts
Archive block size is 32768
Received 0 blocks and 272658 bytes
Compression is 0.0%
Took 20 sec
Recording test results

Mime
View raw message