hama-dev mailing list archives

Site index · List index
Message view « Date » · « Thread »
Top « Date » · « Thread »
From Apache Jenkins Server <jenk...@builds.apache.org>
Subject Build failed in Jenkins: Hama-trunk #393
Date Thu, 23 Apr 2015 00:21:00 GMT
See <https://builds.apache.org/job/Hama-trunk/393/changes>

Changes:

[edwardyoon] minor improvements

------------------------------------------
[...truncated 109728 lines...]
	at java.lang.Thread.run(Thread.java:724)
Exception in thread "pool-18-thread-23" 
Exception in thread "pool-18-thread-33" 
java.lang.NullPointerException
	at org.apache.hama.graph.GraphJobRunner$ComputeRunnable.run(GraphJobRunner.java:350)
	at java.util.concurrent.ThreadPoolExecutor.runWorker(ThreadPoolExecutor.java:1145)
	at java.util.concurrent.ThreadPoolExecutor$Worker.run(ThreadPoolExecutor.java:615)
	at java.lang.Thread.run(Thread.java:724)
Exception in thread "pool-18-thread-19" 
java.lang.NullPointerException
	at org.apache.hama.graph.GraphJobRunner$ComputeRunnable.run(GraphJobRunner.java:350)
	at java.util.concurrent.ThreadPoolExecutor.runWorker(ThreadPoolExecutor.java:1145)
	at java.util.concurrent.ThreadPoolExecutor$Worker.run(ThreadPoolExecutor.java:615)
	at java.lang.Thread.run(Thread.java:724)
java.lang.NullPointerException
	at org.apache.hama.graph.GraphJobRunner$ComputeRunnable.run(GraphJobRunner.java:350)
	at java.util.concurrent.ThreadPoolExecutor.runWorker(ThreadPoolExecutor.java:1145)
	at java.util.concurrent.ThreadPoolExecutor$Worker.run(ThreadPoolExecutor.java:615)
	at java.lang.Thread.run(Thread.java:724)
Exception in thread "pool-18-thread-8" 
java.lang.NullPointerException
	at org.apache.hama.graph.GraphJobRunner$ComputeRunnable.run(GraphJobRunner.java:350)
	at java.util.concurrent.ThreadPoolExecutor.runWorker(ThreadPoolExecutor.java:1145)
	at java.util.concurrent.ThreadPoolExecutor$Worker.run(ThreadPoolExecutor.java:615)
	at java.lang.Thread.run(Thread.java:724)
15/04/23 00:20:19 INFO graph.GraphJobRunner: Total time spent for superstep-16 looping: 25
ms

15/04/23 00:20:19 INFO graph.GraphJobRunner: Total time spent for superstep-16 computing vertices:
28 ms

15/04/23 00:20:19 INFO graph.GraphJobRunner: Total time spent for superstep-16 synchronizing:
1 ms

15/04/23 00:20:19 INFO graph.GraphJobRunner: Total time spent for broadcasting aggregation
values: 0 ms

Exception in thread "pool-19-thread-1" 
java.lang.NullPointerException
	at org.apache.hama.graph.GraphJobRunner$ComputeRunnable.run(GraphJobRunner.java:350)
	at java.util.concurrent.ThreadPoolExecutor.runWorker(ThreadPoolExecutor.java:1145)
	at java.util.concurrent.ThreadPoolExecutor$Worker.run(ThreadPoolExecutor.java:615)
	at java.lang.Thread.run(Thread.java:724)
Exception in thread "pool-19-thread-2" 
java.lang.NullPointerException
	at org.apache.hama.graph.GraphJobRunner$ComputeRunnable.run(GraphJobRunner.java:350)
	at java.util.concurrent.ThreadPoolExecutor.runWorker(ThreadPoolExecutor.java:1145)
	at java.util.concurrent.ThreadPoolExecutor$Worker.run(ThreadPoolExecutor.java:615)
	at java.lang.Thread.run(Thread.java:724)
Exception in thread "pool-19-thread-10" 
java.lang.NullPointerException
	at org.apache.hama.graph.GraphJobRunner$ComputeRunnable.run(GraphJobRunner.java:350)
	at java.util.concurrent.ThreadPoolExecutor.runWorker(ThreadPoolExecutor.java:1145)
	at java.util.concurrent.ThreadPoolExecutor$Worker.run(ThreadPoolExecutor.java:615)
	at java.lang.Thread.run(Thread.java:724)
Exception in thread "pool-19-thread-8" 
java.lang.NullPointerException
	at org.apache.hama.graph.GraphJobRunner$ComputeRunnable.run(GraphJobRunner.java:350)
	at java.util.concurrent.ThreadPoolExecutor.runWorker(ThreadPoolExecutor.java:1145)
	at java.util.concurrent.ThreadPoolExecutor$Worker.run(ThreadPoolExecutor.java:615)
	at java.lang.Thread.run(Thread.java:724)
Exception in thread "pool-19-thread-7" 
java.lang.NullPointerException
	at org.apache.hama.graph.GraphJobRunner$ComputeRunnable.run(GraphJobRunner.java:350)
	at java.util.concurrent.ThreadPoolExecutor.runWorker(ThreadPoolExecutor.java:1145)
	at java.util.concurrent.ThreadPoolExecutor$Worker.run(ThreadPoolExecutor.java:615)
	at java.lang.Thread.run(Thread.java:724)
Exception in thread "pool-19-thread-9" 
java.lang.NullPointerException
	at org.apache.hama.graph.GraphJobRunner$ComputeRunnable.run(GraphJobRunner.java:350)
	at java.util.concurrent.ThreadPoolExecutor.runWorker(ThreadPoolExecutor.java:1145)
	at java.util.concurrent.ThreadPoolExecutor$Worker.run(ThreadPoolExecutor.java:615)
	at java.lang.Thread.run(Thread.java:724)
Exception in thread "pool-19-thread-18" 
java.lang.NullPointerException
	at org.apache.hama.graph.GraphJobRunner$ComputeRunnable.run(GraphJobRunner.java:350)
	at java.util.concurrent.ThreadPoolExecutor.runWorker(ThreadPoolExecutor.java:1145)
	at java.util.concurrent.ThreadPoolExecutor$Worker.run(ThreadPoolExecutor.java:615)
	at java.lang.Thread.run(Thread.java:724)
Exception in thread "pool-19-thread-3" 
java.lang.NullPointerException
	at org.apache.hama.graph.GraphJobRunner$ComputeRunnable.run(GraphJobRunner.java:350)
	at java.util.concurrent.ThreadPoolExecutor.runWorker(ThreadPoolExecutor.java:1145)
	at java.util.concurrent.ThreadPoolExecutor$Worker.run(ThreadPoolExecutor.java:615)
	at java.lang.Thread.run(Thread.java:724)
Exception in thread "pool-19-thread-16" 
java.lang.NullPointerException
	at org.apache.hama.graph.GraphJobRunner$ComputeRunnable.run(GraphJobRunner.java:350)
	at java.util.concurrent.ThreadPoolExecutor.runWorker(ThreadPoolExecutor.java:1145)
	at java.util.concurrent.ThreadPoolExecutor$Worker.run(ThreadPoolExecutor.java:615)
	at java.lang.Thread.run(Thread.java:724)
Exception in thread "pool-19-thread-6" 
java.lang.NullPointerException
	at org.apache.hama.graph.GraphJobRunner$ComputeRunnable.run(GraphJobRunner.java:350)
	at java.util.concurrent.ThreadPoolExecutor.runWorker(ThreadPoolExecutor.java:1145)
	at java.util.concurrent.ThreadPoolExecutor$Worker.run(ThreadPoolExecutor.java:615)
	at java.lang.Thread.run(Thread.java:724)
Exception in thread "pool-19-thread-17" 
java.lang.NullPointerException
	at org.apache.hama.graph.GraphJobRunner$ComputeRunnable.run(GraphJobRunner.java:350)
	at java.util.concurrent.ThreadPoolExecutor.runWorker(ThreadPoolExecutor.java:1145)
	at java.util.concurrent.ThreadPoolExecutor$Worker.run(ThreadPoolExecutor.java:615)
	at java.lang.Thread.run(Thread.java:724)
Exception in thread "pool-19-thread-19" 
java.lang.NullPointerException
	at org.apache.hama.graph.GraphJobRunner$ComputeRunnable.run(GraphJobRunner.java:350)
	at java.util.concurrent.ThreadPoolExecutor.runWorker(ThreadPoolExecutor.java:1145)
	at java.util.concurrent.ThreadPoolExecutor$Worker.run(ThreadPoolExecutor.java:615)
	at java.lang.Thread.run(Thread.java:724)
Exception in thread "pool-19-thread-21" 
java.lang.NullPointerException
	at org.apache.hama.graph.GraphJobRunner$ComputeRunnable.run(GraphJobRunner.java:350)
	at java.util.concurrent.ThreadPoolExecutor.runWorker(ThreadPoolExecutor.java:1145)
	at java.util.concurrent.ThreadPoolExecutor$Worker.run(ThreadPoolExecutor.java:615)
	at java.lang.Thread.run(Thread.java:724)
Exception in thread "pool-19-thread-4" 
Exception in thread "pool-19-thread-5" 
java.lang.NullPointerException
	at org.apache.hama.graph.GraphJobRunner$ComputeRunnable.run(GraphJobRunner.java:350)
	at java.util.concurrent.ThreadPoolExecutor.runWorker(ThreadPoolExecutor.java:1145)
	at java.util.concurrent.ThreadPoolExecutor$Worker.run(ThreadPoolExecutor.java:615)
	at java.lang.Thread.run(Thread.java:724)
java.lang.NullPointerException
	at org.apache.hama.graph.GraphJobRunner$ComputeRunnable.run(GraphJobRunner.java:350)
	at java.util.concurrent.ThreadPoolExecutor.runWorker(ThreadPoolExecutor.java:1145)
	at java.util.concurrent.ThreadPoolExecutor$Worker.run(ThreadPoolExecutor.java:615)
	at java.lang.Thread.run(Thread.java:724)
Exception in thread "pool-19-thread-27" 
java.lang.NullPointerException
	at org.apache.hama.graph.GraphJobRunner$ComputeRunnable.run(GraphJobRunner.java:350)
	at java.util.concurrent.ThreadPoolExecutor.runWorker(ThreadPoolExecutor.java:1145)
	at java.util.concurrent.ThreadPoolExecutor$Worker.run(ThreadPoolExecutor.java:615)
	at java.lang.Thread.run(Thread.java:724)
Exception in thread "pool-19-thread-23" 
java.lang.NullPointerException
	at org.apache.hama.graph.GraphJobRunner$ComputeRunnable.run(GraphJobRunner.java:350)
	at java.util.concurrent.ThreadPoolExecutor.runWorker(ThreadPoolExecutor.java:1145)
	at java.util.concurrent.ThreadPoolExecutor$Worker.run(ThreadPoolExecutor.java:615)
	at java.lang.Thread.run(Thread.java:724)
Exception in thread "pool-19-thread-24" 
java.lang.NullPointerException
	at org.apache.hama.graph.GraphJobRunner$ComputeRunnable.run(GraphJobRunner.java:350)
	at java.util.concurrent.ThreadPoolExecutor.runWorker(ThreadPoolExecutor.java:1145)
	at java.util.concurrent.ThreadPoolExecutor$Worker.run(ThreadPoolExecutor.java:615)
	at java.lang.Thread.run(Thread.java:724)
Exception in thread "pool-19-thread-30" 
java.lang.NullPointerException
	at org.apache.hama.graph.GraphJobRunner$ComputeRunnable.run(GraphJobRunner.java:350)
	at java.util.concurrent.ThreadPoolExecutor.runWorker(ThreadPoolExecutor.java:1145)
	at java.util.concurrent.ThreadPoolExecutor$Worker.run(ThreadPoolExecutor.java:615)
15/04/23 00:20:19 INFO graph.GraphJobRunner: Total time spent for superstep-17 looping: 17
ms

	at java.lang.Thread.run(Thread.java:724)
15/04/23 00:20:19 INFO graph.GraphJobRunner: Total time spent for superstep-17 computing vertices:
18 ms

15/04/23 00:20:19 INFO graph.GraphJobRunner: Total time spent for superstep-17 synchronizing:
1 ms

15/04/23 00:20:19 INFO Configuration.deprecation: mapred.cache.localFiles is deprecated. Instead,
use mapreduce.job.cache.local.files

15/04/23 00:20:21 INFO bsp.BSPJobClient: Current supersteps number: 16

15/04/23 00:20:21 INFO bsp.BSPJobClient: The total number of supersteps: 16

15/04/23 00:20:21 INFO bsp.BSPJobClient: Counters: 11

15/04/23 00:20:21 INFO bsp.BSPJobClient:   org.apache.hama.graph.GraphJobRunner$GraphJobCounter

15/04/23 00:20:21 INFO bsp.BSPJobClient:     ITERATIONS=16

15/04/23 00:20:21 INFO bsp.BSPJobClient:     INPUT_VERTICES=81

15/04/23 00:20:21 INFO bsp.BSPJobClient:   org.apache.hama.bsp.JobInProgress$JobCounter

15/04/23 00:20:21 INFO bsp.BSPJobClient:     SUPERSTEPS=16

15/04/23 00:20:21 INFO bsp.BSPJobClient:     LAUNCHED_TASKS=1

15/04/23 00:20:21 INFO bsp.BSPJobClient:   org.apache.hama.bsp.BSPPeerImpl$PeerCounter

15/04/23 00:20:21 INFO bsp.BSPJobClient:     SUPERSTEP_SUM=17

15/04/23 00:20:21 INFO bsp.BSPJobClient:     IO_BYTES_READ=7189

15/04/23 00:20:21 INFO bsp.BSPJobClient:     TIME_IN_SYNC_MS=2

15/04/23 00:20:21 INFO bsp.BSPJobClient:     TOTAL_MESSAGES_SENT=1632

15/04/23 00:20:21 INFO bsp.BSPJobClient:     TASK_INPUT_RECORDS=100

15/04/23 00:20:21 INFO bsp.BSPJobClient:     TOTAL_MESSAGES_RECEIVED=1530

15/04/23 00:20:21 INFO bsp.BSPJobClient:     TASK_OUTPUT_RECORDS=81

Job Finished in 3.43 seconds
C1668 = [70, 73, 71, 72, 76, 77, 79, 78]
C1815 = [80, 88, 82, 81, 83, 86]
C1722 = [53, 50, 51, 57, 54, 59, 52]
C79 = [4, 9, 5, 2, 3, 7, 6, 1, 0, 8]
C1753 = [65, 67, 61, 69, 62, 66, 60]
C1846 = [95, 98, 90, 99, 93, 92, 94]
C1601 = [18, 16, 19, 14, 17, 13, 15]
C1660 = [36, 31, 44, 48, 49, 37, 41, 34, 47, 32, 35, 42, 45, 30, 33, 46, 38, 40, 43, 39]
C1606 = [24, 27, 22, 25, 28, 23, 20, 21, 29]
Tests run: 1, Failures: 1, Errors: 0, Skipped: 0, Time elapsed: 0.055 sec <<< FAILURE!

Results :

Failed tests: 
  testSemiClustering(org.apache.hama.examples.SemiClusterMatchingTest)

Tests run: 23, Failures: 1, Errors: 0, Skipped: 0

[INFO] ------------------------------------------------------------------------
[INFO] Reactor Summary:
[INFO] 
[INFO] Apache Hama parent POM ............................ SUCCESS [4.069s]
[INFO] pipes ............................................. SUCCESS [15.407s]
[INFO] commons ........................................... SUCCESS [6.243s]
[INFO] core .............................................. SUCCESS [3:00.892s]
[INFO] graph ............................................. SUCCESS [17.406s]
[INFO] machine learning .................................. SUCCESS [1:49.044s]
[INFO] examples .......................................... FAILURE [1:37.688s]
[INFO] mesos ............................................. SKIPPED
[INFO] hama-dist ......................................... SKIPPED
[INFO] ------------------------------------------------------------------------
[INFO] BUILD FAILURE
[INFO] ------------------------------------------------------------------------
[INFO] Total time: 7:11.412s
[INFO] Finished at: Thu Apr 23 00:20:22 UTC 2015
[INFO] Final Memory: 135M/693M
[INFO] ------------------------------------------------------------------------
[ERROR] Failed to execute goal org.apache.maven.plugins:maven-surefire-plugin:2.6:test (default-test)
on project hama-examples: There are test failures.
[ERROR] 
[ERROR] Please refer to <https://builds.apache.org/job/Hama-trunk/ws/trunk/examples/target/surefire-reports>
for the individual test results.
[ERROR] -> [Help 1]
[ERROR] 
[ERROR] To see the full stack trace of the errors, re-run Maven with the -e switch.
[ERROR] Re-run Maven using the -X switch to enable full debug logging.
[ERROR] 
[ERROR] For more information about the errors and possible solutions, please read the following
articles:
[ERROR] [Help 1] http://cwiki.apache.org/confluence/display/MAVEN/MojoFailureException
[ERROR] 
[ERROR] After correcting the problems, you can resume the build with the command
[ERROR]   mvn <goals> -rf :hama-examples
Build step 'Invoke top-level Maven targets' marked build as failure
Archiving artifacts
Sending artifact delta relative to Hama-trunk #392
Archived 149 artifacts
Archive block size is 32768
Received 3823 blocks and 585681 bytes
Compression is 99.5%
Took 36 sec
Recording test results

Mime
View raw message