hama-dev mailing list archives

Site index · List index
Message view « Date » · « Thread »
Top « Date » · « Thread »
From Apache Jenkins Server <jenk...@builds.apache.org>
Subject Build failed in Jenkins: Hama-Nightly-for-Hadoop-1.x #1568
Date Wed, 01 Apr 2015 00:08:26 GMT
See <https://builds.apache.org/job/Hama-Nightly-for-Hadoop-1.x/1568/>

------------------------------------------
[...truncated 157277 lines...]

15/04/01 00:07:49 INFO bsp.BSPJobClient:   org.apache.hama.bsp.BSPPeerImpl$PeerCounter

15/04/01 00:07:49 INFO bsp.BSPJobClient:     SUPERSTEP_SUM=2

15/04/01 00:07:49 INFO bsp.BSPJobClient:     IO_BYTES_READ=562

15/04/01 00:07:49 INFO bsp.BSPJobClient:     TIME_IN_SYNC_MS=0

15/04/01 00:07:49 INFO bsp.BSPJobClient:     TASK_INPUT_RECORDS=18

15/04/01 00:07:49 INFO bsp.FileInputFormat: Total input paths to process : 3

15/04/01 00:07:49 WARN bsp.BSPJobClient: No job jar file set.  User classes may not be found.
See BSPJob#setJar(String) or check Your jar file.

15/04/01 00:07:49 WARN conf.Configuration: org.apache.hadoop.fs.ChecksumFileSystem$FSDataBoundedInputStream@4bb879:an
attempt to override final parameter: mapreduce.job.end-notification.max.retry.interval;  Ignoring.

15/04/01 00:07:49 WARN conf.Configuration: org.apache.hadoop.fs.ChecksumFileSystem$FSDataBoundedInputStream@4bb879:an
attempt to override final parameter: mapreduce.job.end-notification.max.attempts;  Ignoring.

15/04/01 00:07:49 INFO Configuration.deprecation: user.name is deprecated. Instead, use mapreduce.job.user.name

15/04/01 00:07:49 INFO bsp.LocalBSPRunner: Setting up a new barrier for 3 tasks!

15/04/01 00:07:49 INFO bsp.BSPJobClient: Running job: job_localrunner_0001

15/04/01 00:07:49 INFO graph.GraphJobRunner: 2 vertices are loaded into local:2

15/04/01 00:07:49 INFO graph.GraphJobRunner: 2 vertices are loaded into local:0

15/04/01 00:07:49 INFO graph.GraphJobRunner: 2 vertices are loaded into local:1

maxFlow is: 23.0
15/04/01 00:07:49 ERROR bsp.LocalBSPRunner: Exception during BSP execution!
java.util.concurrent.ExecutionException: java.lang.AssertionError: vertex value cannot be
null
	at java.util.concurrent.FutureTask$Sync.innerGet(FutureTask.java:252)
	at java.util.concurrent.FutureTask.get(FutureTask.java:111)
	at org.apache.hama.bsp.LocalBSPRunner$ThreadObserver.run(LocalBSPRunner.java:314)
	at java.lang.Thread.run(Thread.java:724)
Caused by: java.lang.AssertionError: vertex value cannot be null
	at org.apache.hama.graph.DefaultVertexOutputWriter.write(DefaultVertexOutputWriter.java:49)
	at org.apache.hama.graph.GraphJobRunner.cleanup(GraphJobRunner.java:171)
	at org.apache.hama.bsp.LocalBSPRunner$BSPRunner.run(LocalBSPRunner.java:263)
	at org.apache.hama.bsp.LocalBSPRunner$BSPRunner.call(LocalBSPRunner.java:287)
	at org.apache.hama.bsp.LocalBSPRunner$BSPRunner.call(LocalBSPRunner.java:211)
	at java.util.concurrent.FutureTask$Sync.innerRun(FutureTask.java:334)
	at java.util.concurrent.FutureTask.run(FutureTask.java:166)
	at java.util.concurrent.Executors$RunnableAdapter.call(Executors.java:471)
	at java.util.concurrent.FutureTask$Sync.innerRun(FutureTask.java:334)
	at java.util.concurrent.FutureTask.run(FutureTask.java:166)
	at java.util.concurrent.ThreadPoolExecutor.runWorker(ThreadPoolExecutor.java:1145)
	at java.util.concurrent.ThreadPoolExecutor$Worker.run(ThreadPoolExecutor.java:615)
	... 1 more

15/04/01 00:07:52 INFO bsp.BSPJobClient: Current supersteps number: 42

15/04/01 00:07:52 INFO bsp.BSPJobClient: Job failed.

maxflow is: 23.0
Tests run: 1, Failures: 0, Errors: 0, Skipped: 0, Time elapsed: 0.008 sec
Forking command line: /bin/sh -c cd <https://builds.apache.org/job/Hama-Nightly-for-Hadoop-1.x/ws/trunk/examples>
&& /home/jenkins/tools/java/jdk1.7.0_25-32/jre/bin/java -jar /tmp/surefirebooter7165891964240691603.jar
/tmp/surefire6377112755386587410tmp /tmp/surefire5237609711693500282tmp
Running org.apache.hama.examples.SemiClusterMatchingTest
15/04/01 00:07:53 WARN util.NativeCodeLoader: Unable to load native-hadoop library for your
platform... using builtin-java classes where applicable

15/04/01 00:07:53 INFO bsp.FileInputFormat: Total input paths to process : 1

15/04/01 00:07:53 INFO bsp.FileInputFormat: Total input paths to process : 1

15/04/01 00:07:53 WARN bsp.BSPJobClient: No job jar file set.  User classes may not be found.
See BSPJob#setJar(String) or check Your jar file.

15/04/01 00:07:53 INFO Configuration.deprecation: user.name is deprecated. Instead, use mapreduce.job.user.name

15/04/01 00:07:54 WARN conf.Configuration: org.apache.hadoop.fs.ChecksumFileSystem$FSDataBoundedInputStream@398091:an
attempt to override final parameter: mapreduce.job.end-notification.max.retry.interval;  Ignoring.

15/04/01 00:07:54 WARN conf.Configuration: org.apache.hadoop.fs.ChecksumFileSystem$FSDataBoundedInputStream@398091:an
attempt to override final parameter: mapreduce.job.end-notification.max.attempts;  Ignoring.

15/04/01 00:07:54 INFO Configuration.deprecation: user.name is deprecated. Instead, use mapreduce.job.user.name

15/04/01 00:07:54 INFO bsp.BSPJobClient: Running job: job_localrunner_0001

15/04/01 00:07:54 INFO bsp.LocalBSPRunner: Setting up a new barrier for 1 tasks!

15/04/01 00:07:54 INFO Configuration.deprecation: io.sort.mb is deprecated. Instead, use mapreduce.task.io.sort.mb

15/04/01 00:07:54 INFO Configuration.deprecation: io.sort.factor is deprecated. Instead, use
mapreduce.task.io.sort.factor

15/04/01 00:07:54 INFO Configuration.deprecation: mapred.cache.localFiles is deprecated. Instead,
use mapreduce.job.cache.local.files

15/04/01 00:07:57 INFO bsp.BSPJobClient: Current supersteps number: 1

15/04/01 00:07:57 INFO bsp.BSPJobClient: The total number of supersteps: 1

15/04/01 00:07:57 INFO bsp.BSPJobClient: Counters: 6

15/04/01 00:07:57 INFO bsp.BSPJobClient:   org.apache.hama.bsp.JobInProgress$JobCounter

15/04/01 00:07:57 INFO bsp.BSPJobClient:     SUPERSTEPS=1

15/04/01 00:07:57 INFO bsp.BSPJobClient:     LAUNCHED_TASKS=1

15/04/01 00:07:57 INFO bsp.BSPJobClient:   org.apache.hama.bsp.BSPPeerImpl$PeerCounter

15/04/01 00:07:57 INFO bsp.BSPJobClient:     SUPERSTEP_SUM=2

15/04/01 00:07:57 INFO bsp.BSPJobClient:     IO_BYTES_READ=7189

15/04/01 00:07:57 INFO bsp.BSPJobClient:     TIME_IN_SYNC_MS=0

15/04/01 00:07:57 INFO bsp.BSPJobClient:     TASK_INPUT_RECORDS=100

15/04/01 00:07:57 INFO bsp.FileInputFormat: Total input paths to process : 3

15/04/01 00:07:57 WARN bsp.BSPJobClient: No job jar file set.  User classes may not be found.
See BSPJob#setJar(String) or check Your jar file.

15/04/01 00:07:57 WARN conf.Configuration: org.apache.hadoop.fs.ChecksumFileSystem$FSDataBoundedInputStream@1b51005:an
attempt to override final parameter: mapreduce.job.end-notification.max.retry.interval;  Ignoring.

15/04/01 00:07:57 WARN conf.Configuration: org.apache.hadoop.fs.ChecksumFileSystem$FSDataBoundedInputStream@1b51005:an
attempt to override final parameter: mapreduce.job.end-notification.max.attempts;  Ignoring.

15/04/01 00:07:57 INFO Configuration.deprecation: user.name is deprecated. Instead, use mapreduce.job.user.name

15/04/01 00:07:57 INFO bsp.LocalBSPRunner: Setting up a new barrier for 3 tasks!

15/04/01 00:07:57 INFO bsp.BSPJobClient: Running job: job_localrunner_0001

15/04/01 00:07:57 INFO graph.GraphJobRunner: 34 vertices are loaded into local:1

15/04/01 00:07:57 INFO graph.GraphJobRunner: 33 vertices are loaded into local:0

15/04/01 00:07:57 INFO graph.GraphJobRunner: 33 vertices are loaded into local:2

15/04/01 00:08:00 INFO bsp.BSPJobClient: Current supersteps number: 15

15/04/01 00:08:00 INFO bsp.BSPJobClient: The total number of supersteps: 15

15/04/01 00:08:00 INFO bsp.BSPJobClient: Counters: 12

15/04/01 00:08:00 INFO bsp.BSPJobClient:   org.apache.hama.graph.GraphJobRunner$GraphJobCounter

15/04/01 00:08:00 INFO bsp.BSPJobClient:     ITERATIONS=15

15/04/01 00:08:00 INFO bsp.BSPJobClient:     INPUT_VERTICES=100

15/04/01 00:08:00 INFO bsp.BSPJobClient:   org.apache.hama.bsp.JobInProgress$JobCounter

15/04/01 00:08:00 INFO bsp.BSPJobClient:     SUPERSTEPS=15

15/04/01 00:08:00 INFO bsp.BSPJobClient:     LAUNCHED_TASKS=3

15/04/01 00:08:00 INFO bsp.BSPJobClient:   org.apache.hama.bsp.BSPPeerImpl$PeerCounter

15/04/01 00:08:00 INFO bsp.BSPJobClient:     SUPERSTEP_SUM=48

15/04/01 00:08:00 INFO bsp.BSPJobClient:     IO_BYTES_READ=8850

15/04/01 00:08:00 INFO bsp.BSPJobClient:     TIME_IN_SYNC_MS=103

15/04/01 00:08:00 INFO bsp.BSPJobClient:     TOTAL_MESSAGES_SENT=165927

15/04/01 00:08:00 INFO bsp.BSPJobClient:     TASK_INPUT_RECORDS=100

15/04/01 00:08:00 INFO bsp.BSPJobClient:     TOTAL_MESSAGE_BYTES_TRANSFERED=33225322

15/04/01 00:08:00 INFO bsp.BSPJobClient:     TOTAL_MESSAGES_RECEIVED=4596

15/04/01 00:08:00 INFO bsp.BSPJobClient:     TASK_OUTPUT_RECORDS=100

Job Finished in 6.668 seconds
C1691 = [41, 44, 47, 40, 43, 46, 49, 42, 45, 48]
C1598 = [14, 17, 11, 19, 16, 10, 13, 18, 15, 12]
C1784 = [77, 74, 71, 79, 76, 73, 70, 78, 72, 75]
C1722 = [56, 59, 50, 53, 55, 58, 52]
Tests run: 1, Failures: 1, Errors: 0, Skipped: 0, Time elapsed: 0.013 sec <<< FAILURE!

Results :

Failed tests: 
  testSemiClustering(org.apache.hama.examples.SemiClusterMatchingTest)

Tests run: 22, Failures: 1, Errors: 0, Skipped: 0

[INFO] ------------------------------------------------------------------------
[INFO] Reactor Summary:
[INFO] 
[INFO] Apache Hama parent POM ............................ SUCCESS [32.718s]
[INFO] pipes ............................................. SUCCESS [21.204s]
[INFO] commons ........................................... SUCCESS [9.703s]
[INFO] core .............................................. SUCCESS [3:58.152s]
[INFO] graph ............................................. SUCCESS [21.406s]
[INFO] machine learning .................................. SUCCESS [2:55.844s]
[INFO] examples .......................................... FAILURE [2:19.053s]
[INFO] mesos ............................................. SKIPPED
[INFO] hama-dist ......................................... SKIPPED
[INFO] ------------------------------------------------------------------------
[INFO] BUILD FAILURE
[INFO] ------------------------------------------------------------------------
[INFO] Total time: 10:51.131s
[INFO] Finished at: Wed Apr 01 00:08:00 UTC 2015
[INFO] Final Memory: 126M/356M
[INFO] ------------------------------------------------------------------------
[ERROR] Failed to execute goal org.apache.maven.plugins:maven-surefire-plugin:2.6:test (default-test)
on project hama-examples: There are test failures.
[ERROR] 
[ERROR] Please refer to <https://builds.apache.org/job/Hama-Nightly-for-Hadoop-1.x/ws/trunk/examples/target/surefire-reports>
for the individual test results.
[ERROR] -> [Help 1]
org.apache.maven.lifecycle.LifecycleExecutionException: Failed to execute goal org.apache.maven.plugins:maven-surefire-plugin:2.6:test
(default-test) on project hama-examples: There are test failures.

Please refer to <https://builds.apache.org/job/Hama-Nightly-for-Hadoop-1.x/ws/trunk/examples/target/surefire-reports>
for the individual test results.
	at org.apache.maven.lifecycle.internal.MojoExecutor.execute(MojoExecutor.java:213)
	at org.apache.maven.lifecycle.internal.MojoExecutor.execute(MojoExecutor.java:153)
	at org.apache.maven.lifecycle.internal.MojoExecutor.execute(MojoExecutor.java:145)
	at org.apache.maven.lifecycle.internal.LifecycleModuleBuilder.buildProject(LifecycleModuleBuilder.java:84)
	at org.apache.maven.lifecycle.internal.LifecycleModuleBuilder.buildProject(LifecycleModuleBuilder.java:59)
	at org.apache.maven.lifecycle.internal.LifecycleStarter.singleThreadedBuild(LifecycleStarter.java:183)
	at org.apache.maven.lifecycle.internal.LifecycleStarter.execute(LifecycleStarter.java:161)
	at org.apache.maven.DefaultMaven.doExecute(DefaultMaven.java:320)
	at org.apache.maven.DefaultMaven.execute(DefaultMaven.java:156)
	at org.apache.maven.cli.MavenCli.execute(MavenCli.java:537)
	at org.apache.maven.cli.MavenCli.doMain(MavenCli.java:196)
	at org.apache.maven.cli.MavenCli.main(MavenCli.java:141)
	at sun.reflect.NativeMethodAccessorImpl.invoke0(Native Method)
	at sun.reflect.NativeMethodAccessorImpl.invoke(NativeMethodAccessorImpl.java:57)
	at sun.reflect.DelegatingMethodAccessorImpl.invoke(DelegatingMethodAccessorImpl.java:43)
	at java.lang.reflect.Method.invoke(Method.java:606)
	at org.codehaus.plexus.classworlds.launcher.Launcher.launchEnhanced(Launcher.java:290)
	at org.codehaus.plexus.classworlds.launcher.Launcher.launch(Launcher.java:230)
	at org.codehaus.plexus.classworlds.launcher.Launcher.mainWithExitCode(Launcher.java:409)
	at org.codehaus.plexus.classworlds.launcher.Launcher.main(Launcher.java:352)
Caused by: org.apache.maven.plugin.MojoFailureException: There are test failures.

Please refer to <https://builds.apache.org/job/Hama-Nightly-for-Hadoop-1.x/ws/trunk/examples/target/surefire-reports>
for the individual test results.
	at org.apache.maven.plugin.surefire.SurefireHelper.reportExecution(SurefireHelper.java:55)
	at org.apache.maven.plugin.surefire.SurefirePlugin.execute(SurefirePlugin.java:592)
	at org.apache.maven.plugin.DefaultBuildPluginManager.executeMojo(DefaultBuildPluginManager.java:101)
	at org.apache.maven.lifecycle.internal.MojoExecutor.execute(MojoExecutor.java:209)
	... 19 more
[ERROR] 
[ERROR] 
[ERROR] For more information about the errors and possible solutions, please read the following
articles:
[ERROR] [Help 1] http://cwiki.apache.org/confluence/display/MAVEN/MojoFailureException
[ERROR] 
[ERROR] After correcting the problems, you can resume the build with the command
[ERROR]   mvn <goals> -rf :hama-examples
Build step 'Invoke top-level Maven targets' marked build as failure
Archiving artifacts
Sending artifact delta relative to Hama-Nightly-for-Hadoop-1.x #1567
Archived 144 artifacts
Archive block size is 32768
Received 0 blocks and 406220 bytes
Compression is 0.0%
Took 22 sec
Recording test results

Mime
View raw message