hama-dev mailing list archives

Site index · List index
Message view « Date » · « Thread »
Top « Date » · « Thread »
From Apache Jenkins Server <jenk...@builds.apache.org>
Subject Build failed in Jenkins: Hama-Nightly-for-Hadoop-2.x #571
Date Tue, 07 Apr 2015 23:38:08 GMT
See <https://builds.apache.org/job/Hama-Nightly-for-Hadoop-2.x/571/changes>

Changes:

[edwardyoon] Build for jdk8

------------------------------------------
[...truncated 1598 lines...]
     [exec] /usr/bin/cmake -E cmake_link_script CMakeFiles/piestimator.dir/link.txt --verbose=1
     [exec] /usr/bin/c++    -g -Wall -O2 -D_REENTRANT -D_GNU_SOURCE -D_LARGEFILE_SOURCE -D_FILE_OFFSET_BITS=64
-m32    CMakeFiles/piestimator.dir/main/native/examples/impl/piestimator.cc.o  -o examples/piestimator
-rdynamic libhadooputils.a 
     [exec] make[2]: Leaving directory `<https://builds.apache.org/job/Hama-Nightly-for-Hadoop-2.x/ws/trunk/c++/target/native'>
     [exec] /usr/bin/cmake -E cmake_progress_report <https://builds.apache.org/job/Hama-Nightly-for-Hadoop-2.x/ws/trunk/c++/target/native/CMakeFiles>
 6
     [exec] [ 85%] Built target piestimator
     [exec] make -f CMakeFiles/summation.dir/build.make CMakeFiles/summation.dir/depend
     [exec] make[2]: Entering directory `<https://builds.apache.org/job/Hama-Nightly-for-Hadoop-2.x/ws/trunk/c++/target/native'>
     [exec] cd <https://builds.apache.org/job/Hama-Nightly-for-Hadoop-2.x/ws/trunk/c++/target/native>
&& /usr/bin/cmake -E cmake_depends "Unix Makefiles" <https://builds.apache.org/job/Hama-Nightly-for-Hadoop-2.x/ws/trunk/c++/src>
<https://builds.apache.org/job/Hama-Nightly-for-Hadoop-2.x/ws/trunk/c++/src> <https://builds.apache.org/job/Hama-Nightly-for-Hadoop-2.x/ws/trunk/c++/target/native>
<https://builds.apache.org/job/Hama-Nightly-for-Hadoop-2.x/ws/trunk/c++/target/native>
<https://builds.apache.org/job/Hama-Nightly-for-Hadoop-2.x/ws/trunk/c++/target/native/CMakeFiles/summation.dir/DependInfo.cmake>
--color=
     [exec] Dependee "<https://builds.apache.org/job/Hama-Nightly-for-Hadoop-2.x/ws/trunk/c++/target/native/CMakeFiles/summation.dir/DependInfo.cmake">
is newer than depender "<https://builds.apache.org/job/Hama-Nightly-for-Hadoop-2.x/ws/trunk/c++/target/native/CMakeFiles/summation.dir/depend.internal".>
     [exec] Dependee "<https://builds.apache.org/job/Hama-Nightly-for-Hadoop-2.x/ws/trunk/c++/target/native/CMakeFiles/CMakeDirectoryInformation.cmake">
is newer than depender "<https://builds.apache.org/job/Hama-Nightly-for-Hadoop-2.x/ws/trunk/c++/target/native/CMakeFiles/summation.dir/depend.internal".>
     [exec] Scanning dependencies of target summation
     [exec] make[2]: Leaving directory `<https://builds.apache.org/job/Hama-Nightly-for-Hadoop-2.x/ws/trunk/c++/target/native'>
     [exec] make -f CMakeFiles/summation.dir/build.make CMakeFiles/summation.dir/build
     [exec] make[2]: Entering directory `<https://builds.apache.org/job/Hama-Nightly-for-Hadoop-2.x/ws/trunk/c++/target/native'>
     [exec] /usr/bin/cmake -E cmake_progress_report <https://builds.apache.org/job/Hama-Nightly-for-Hadoop-2.x/ws/trunk/c++/target/native/CMakeFiles>
7
     [exec] [100%] Building CXX object CMakeFiles/summation.dir/main/native/examples/impl/summation.cc.o
     [exec] /usr/bin/c++    -g -Wall -O2 -D_REENTRANT -D_GNU_SOURCE -D_LARGEFILE_SOURCE -D_FILE_OFFSET_BITS=64
-m32 -I<https://builds.apache.org/job/Hama-Nightly-for-Hadoop-2.x/ws/trunk/c++/src/main/native/utils/api>
-I<https://builds.apache.org/job/Hama-Nightly-for-Hadoop-2.x/ws/trunk/c++/src/main/native/pipes/api>
-I<https://builds.apache.org/job/Hama-Nightly-for-Hadoop-2.x/ws/trunk/c++/src>    -o
CMakeFiles/summation.dir/main/native/examples/impl/summation.cc.o -c <https://builds.apache.org/job/Hama-Nightly-for-Hadoop-2.x/ws/trunk/c++/src/main/native/examples/impl/summation.cc>
     [exec] Linking CXX executable examples/summation
     [exec] /usr/bin/cmake -E cmake_link_script CMakeFiles/summation.dir/link.txt --verbose=1
     [exec] /usr/bin/c++    -g -Wall -O2 -D_REENTRANT -D_GNU_SOURCE -D_LARGEFILE_SOURCE -D_FILE_OFFSET_BITS=64
-m32    CMakeFiles/summation.dir/main/native/examples/impl/summation.cc.o  -o examples/summation
-rdynamic libhadooputils.a 
     [exec] make[2]: Leaving directory `<https://builds.apache.org/job/Hama-Nightly-for-Hadoop-2.x/ws/trunk/c++/target/native'>
     [exec] /usr/bin/cmake -E cmake_progress_report <https://builds.apache.org/job/Hama-Nightly-for-Hadoop-2.x/ws/trunk/c++/target/native/CMakeFiles>
 7
     [exec] [100%] Built target summation
     [exec] make[1]: Leaving directory `<https://builds.apache.org/job/Hama-Nightly-for-Hadoop-2.x/ws/trunk/c++/target/native'>
     [exec] /usr/bin/cmake -E cmake_progress_start <https://builds.apache.org/job/Hama-Nightly-for-Hadoop-2.x/ws/trunk/c++/target/native/CMakeFiles>
0
     [exec] [ 14%] Built target DenseDoubleVector
     [exec] [ 57%] Built target hadooputils
     [exec] [ 71%] Built target matrixmultiplication
     [exec] [ 85%] Built target piestimator
     [exec] [100%] Built target summation
[INFO] Executed tasks
[INFO] 
[INFO] --- gmaven-plugin:1.0:execute (default) @ hama-pipes ---
[INFO] 
[INFO] --- apache-rat-plugin:0.10:check (default) @ hama-pipes ---
[INFO] 51 implicit excludes (use -debug for more details).
[INFO] Exclude: .idea/**
[INFO] Exclude: .git/**
[INFO] Exclude: .gitignore
[INFO] Exclude: **/.classpath/**
[INFO] Exclude: **/.project
[INFO] Exclude: **/*.iml
[INFO] Exclude: **/.settings/**
[INFO] Exclude: **/*.asc
[INFO] Exclude: **/dependency-reduced-pom.xml
[INFO] Exclude: **/logs/**
[INFO] Exclude: **/docs/**
[INFO] Exclude: CHANGES.txt
[INFO] Exclude: conf/groomservers
[INFO] Exclude: src/site/resources/files/hama-eclipse-formatter.xml
[INFO] Exclude: **/src/test/resources/*.properties
[INFO] Exclude: **dependency-reduced-pom.xml
[INFO] Exclude: **/src/test/resources/*.txt
[INFO] Exclude: **/target/**
[INFO] Exclude: /docker/README.md
[INFO] 22 resources included (use -debug for more details)
[INFO] Rat check: Summary of files. Unapproved: 0 unknown: 0 generated: 0 approved: 20 licence.
[INFO] 
[INFO] --- maven-javadoc-plugin:2.9.1:jar (default) @ hama-pipes ---
[INFO] Not executing Javadoc as the project is not a Java classpath-capable package
[INFO] 
[INFO] --- maven-install-plugin:2.3:install (default-install) @ hama-pipes ---
[INFO] Installing <https://builds.apache.org/job/Hama-Nightly-for-Hadoop-2.x/ws/trunk/c++/pom.xml>
to <https://builds.apache.org/job/Hama-Nightly-for-Hadoop-2.x/ws/.repository/org/apache/hama/hama-pipes/0.7.0-SNAPSHOT/hama-pipes-0.7.0-SNAPSHOT.pom>
[INFO]                                                                         
[INFO] ------------------------------------------------------------------------
[INFO] Building commons 0.7.0-SNAPSHOT
[INFO] ------------------------------------------------------------------------
[INFO] 
[INFO] --- maven-clean-plugin:2.4.1:clean (default-clean) @ hama-commons ---
[INFO] Deleting <https://builds.apache.org/job/Hama-Nightly-for-Hadoop-2.x/ws/trunk/commons>
(includes = [lib/**, logs/**, **/docs, docs/apidocs/**, c++/src/CMakeCache.txt, c++/src/CMakeFiles/,
c++/src/Makefile, c++/src/cmake_install.cmake, c++/src/examples/], excludes = [])
[INFO] 
[INFO] --- maven-remote-resources-plugin:1.1:process (default) @ hama-commons ---
[INFO] 
[INFO] --- maven-resources-plugin:2.4:resources (default-resources) @ hama-commons ---
[INFO] Using 'UTF-8' encoding to copy filtered resources.
[INFO] skip non existing resourceDirectory <https://builds.apache.org/job/Hama-Nightly-for-Hadoop-2.x/ws/trunk/commons/src/main/resources>
[INFO] Copying 3 resources
[INFO] 
[INFO] --- maven-compiler-plugin:2.3.2:compile (default-compile) @ hama-commons ---
[INFO] Compiling 31 source files to <https://builds.apache.org/job/Hama-Nightly-for-Hadoop-2.x/ws/trunk/commons/target/classes>
[INFO] 
[INFO] --- maven-resources-plugin:2.4:testResources (default-testResources) @ hama-commons
---
[INFO] Using 'UTF-8' encoding to copy filtered resources.
[INFO] skip non existing resourceDirectory <https://builds.apache.org/job/Hama-Nightly-for-Hadoop-2.x/ws/trunk/commons/src/test/resources>
[INFO] Copying 3 resources
[INFO] 
[INFO] --- maven-compiler-plugin:2.3.2:testCompile (default-testCompile) @ hama-commons ---
[INFO] Compiling 4 source files to <https://builds.apache.org/job/Hama-Nightly-for-Hadoop-2.x/ws/trunk/commons/target/test-classes>
[INFO] 
[INFO] --- maven-surefire-plugin:2.6:test (default-test) @ hama-commons ---
[INFO] Concurrency config is {threadCount=10, parallel=methods, configurableParallelComputerPresent=false}
[INFO] Surefire report directory: <https://builds.apache.org/job/Hama-Nightly-for-Hadoop-2.x/ws/trunk/commons/target/surefire-reports>

-------------------------------------------------------
 T E S T S
-------------------------------------------------------
Running org.apache.hama.commons.math.TestDenseDoubleVector
Tests run: 45, Failures: 0, Errors: 0, Skipped: 0, Time elapsed: 0.028 sec
Running org.apache.hama.commons.math.TestSparseDoubleVector
Tests run: 15, Failures: 0, Errors: 0, Skipped: 0, Time elapsed: 0.016 sec
Running org.apache.hama.commons.math.TestFunctionFactory
Tests run: 2, Failures: 0, Errors: 0, Skipped: 0, Time elapsed: 0.013 sec
Running org.apache.hama.commons.math.TestDenseDoubleMatrix
Tests run: 14, Failures: 0, Errors: 0, Skipped: 0, Time elapsed: 0.017 sec

Results :

Tests run: 76, Failures: 0, Errors: 0, Skipped: 0

[INFO] 
[INFO] --- maven-jar-plugin:2.3:jar (default-jar) @ hama-commons ---
[INFO] Building jar: <https://builds.apache.org/job/Hama-Nightly-for-Hadoop-2.x/ws/trunk/commons/target/hama-commons-0.7.0-SNAPSHOT.jar>
[INFO] 
[INFO] --- apache-rat-plugin:0.10:check (default) @ hama-commons ---
[INFO] 51 implicit excludes (use -debug for more details).
[INFO] Exclude: .idea/**
[INFO] Exclude: .git/**
[INFO] Exclude: .gitignore
[INFO] Exclude: **/.classpath/**
[INFO] Exclude: **/.project
[INFO] Exclude: **/*.iml
[INFO] Exclude: **/.settings/**
[INFO] Exclude: **/*.asc
[INFO] Exclude: **/dependency-reduced-pom.xml
[INFO] Exclude: **/logs/**
[INFO] Exclude: **/docs/**
[INFO] Exclude: CHANGES.txt
[INFO] Exclude: conf/groomservers
[INFO] Exclude: src/site/resources/files/hama-eclipse-formatter.xml
[INFO] Exclude: **/src/test/resources/*.properties
[INFO] Exclude: **dependency-reduced-pom.xml
[INFO] Exclude: **/src/test/resources/*.txt
[INFO] Exclude: **/target/**
[INFO] Exclude: /docker/README.md
[INFO] 36 resources included (use -debug for more details)
[INFO] Rat check: Summary of files. Unapproved: 0 unknown: 0 generated: 0 approved: 36 licence.
[INFO] 
[INFO] --- maven-javadoc-plugin:2.9.1:jar (default) @ hama-commons ---
[INFO] 
usage: javadoc [options] [packagenames] [sourcefiles] [@files]
-overview <file>          Read overview documentation from HTML file
-public                   Show only public classes and members
-protected                Show protected/public classes and members (default)
-package                  Show package/protected/public classes and members
-private                  Show all classes and members
-help                     Display command line options and exit
-doclet <class>           Generate output via alternate doclet
-docletpath <path>        Specify where to find doclet class files
-sourcepath <pathlist>    Specify where to find source files
-classpath <pathlist>     Specify where to find user class files
-exclude <pkglist>        Specify a list of packages to exclude
-subpackages <subpkglist> Specify subpackages to recursively load
-breakiterator            Compute 1st sentence with BreakIterator
-bootclasspath <pathlist> Override location of class files loaded
			  by the bootstrap class loader
-source <release>         Provide source compatibility with specified release
-extdirs <dirlist>        Override location of installed extensions
-verbose                  Output messages about what Javadoc is doing
-locale <name>            Locale to be used, e.g. en_US or en_US_WIN
-encoding <name>          Source file encoding name
-quiet                    Do not display status messages
-J<flag>                  Pass <flag> directly to the runtime system
-X                        Print a synopsis of nonstandard options

Provided by Standard doclet:
-d <directory>                    Destination directory for output files
-use                              Create class and package usage pages
-version                          Include @version paragraphs
-author                           Include @author paragraphs
-docfilessubdirs                  Recursively copy doc-file subdirectories
-splitindex                       Split index into one file per letter
-windowtitle <text>               Browser window title for the documenation
-doctitle <html-code>             Include title for the overview page
-header <html-code>               Include header text for each page
-footer <html-code>               Include footer text for each page
-top    <html-code>               Include top text for each page
-bottom <html-code>               Include bottom text for each page
-link <url>                       Create links to javadoc output at <url>
-linkoffline <url> <url2>         Link to docs at <url> using package list
at <url2>
-excludedocfilessubdir <name1>:.. Exclude any doc-files subdirectories with given name.
-group <name> <p1>:<p2>..         Group specified packages together in overview
page
-nocomment                        Supress description and tags, generate only declarations.
-nodeprecated                     Do not include @deprecated information
-noqualifier <name1>:<name2>:...  Exclude the list of qualifiers from the output.
-nosince                          Do not include @since information
-notimestamp                      Do not include hidden time stamp
-nodeprecatedlist                 Do not generate deprecated list
-notree                           Do not generate class hierarchy
-noindex                          Do not generate index
-nohelp                           Do not generate help link
-nonavbar                         Do not generate navigation bar
-serialwarn                       Generate warning about @serial tag
-tag <name>:<locations>:<header>  Specify single argument custom tags
-taglet                           The fully qualified name of Taglet to register
-tagletpath                       The path to Taglets
-Xdocrootparent <url>             Replaces all appearances of @docRoot followed by /..
in doc comments with <url>
-charset <charset>                Charset for cross-platform viewing of generated documentation.
-helpfile <file>                  Include file that help link links to
-linksource                       Generate source in HTML
-sourcetab <tab length>           Specify the number of spaces each tab takes up in
the source
-keywords                         Include HTML meta tags with package, class and member info
-stylesheetfile <path>            File to change style of the generated documentation
-docencoding <name>               Output encoding name
1 error
[INFO] ------------------------------------------------------------------------
[INFO] Reactor Summary:
[INFO] 
[INFO] Apache Hama parent POM ............................ SUCCESS [9.742s]
[INFO] pipes ............................................. SUCCESS [23.761s]
[INFO] commons ........................................... FAILURE [7.333s]
[INFO] core .............................................. SKIPPED
[INFO] graph ............................................. SKIPPED
[INFO] machine learning .................................. SKIPPED
[INFO] examples .......................................... SKIPPED
[INFO] mesos ............................................. SKIPPED
[INFO] yarn .............................................. SKIPPED
[INFO] hama-dist ......................................... SKIPPED
[INFO] ------------------------------------------------------------------------
[INFO] BUILD FAILURE
[INFO] ------------------------------------------------------------------------
[INFO] Total time: 41.834s
[INFO] Finished at: Tue Apr 07 23:37:53 UTC 2015
[INFO] Final Memory: 49M/491M
[INFO] ------------------------------------------------------------------------
[ERROR] Failed to execute goal org.apache.maven.plugins:maven-javadoc-plugin:2.9.1:jar (default)
on project hama-commons: MavenReportException: Error while creating archive:
[ERROR] Exit code: 1 - javadoc: error - invalid flag: -Xdoclint:none
[ERROR] 
[ERROR] Command line was: /home/jenkins/tools/java/jdk1.7.0_25-32/jre/../bin/javadoc @options
@packages
[ERROR] 
[ERROR] Refer to the generated Javadoc files in '<https://builds.apache.org/job/Hama-Nightly-for-Hadoop-2.x/ws/trunk/commons/docs/apidocs'>
dir.
[ERROR] -> [Help 1]
[ERROR] 
[ERROR] To see the full stack trace of the errors, re-run Maven with the -e switch.
[ERROR] Re-run Maven using the -X switch to enable full debug logging.
[ERROR] 
[ERROR] For more information about the errors and possible solutions, please read the following
articles:
[ERROR] [Help 1] http://cwiki.apache.org/confluence/display/MAVEN/MojoExecutionException
[ERROR] 
[ERROR] After correcting the problems, you can resume the build with the command
[ERROR]   mvn <goals> -rf :hama-commons
Build step 'Invoke top-level Maven targets' marked build as failure
Archiving artifacts
Sending artifact delta relative to Hama-Nightly-for-Hadoop-2.x #570
Archived 11 artifacts
Archive block size is 32768
Received 1555 blocks and 78833 bytes
Compression is 99.8%
Took 13 sec
Recording test results

Mime
View raw message