hama-dev mailing list archives

Site index · List index
Message view « Date » · « Thread »
Top « Date » · « Thread »
From Apache Jenkins Server <jenk...@builds.apache.org>
Subject Build failed in Jenkins: Hama-Nightly-for-Hadoop-1.x #1590
Date Thu, 23 Apr 2015 00:04:31 GMT
See <https://builds.apache.org/job/Hama-Nightly-for-Hadoop-1.x/1590/changes>

Changes:

[edwardyoon] minor improvements

[edwardyoon] Fix race conditions about ConcurrentHashMap

[edwardyoon] minor code optimization

------------------------------------------
[...truncated 131245 lines...]
15/04/23 00:04:14 INFO graph.GraphJobRunner: Total time spent for superstep-16 synchronizing:
1 ms

15/04/23 00:04:14 INFO graph.GraphJobRunner: Total time spent for broadcasting aggregation
values: 1 ms

Exception in thread "pool-19-thread-1" 
java.lang.NullPointerException
	at org.apache.hama.graph.GraphJobRunner$ComputeRunnable.run(GraphJobRunner.java:350)
	at java.util.concurrent.ThreadPoolExecutor.runWorker(ThreadPoolExecutor.java:1145)
	at java.util.concurrent.ThreadPoolExecutor$Worker.run(ThreadPoolExecutor.java:615)
	at java.lang.Thread.run(Thread.java:724)
Exception in thread "pool-19-thread-2" 
java.lang.NullPointerException
	at org.apache.hama.graph.GraphJobRunner$ComputeRunnable.run(GraphJobRunner.java:350)
	at java.util.concurrent.ThreadPoolExecutor.runWorker(ThreadPoolExecutor.java:1145)
	at java.util.concurrent.ThreadPoolExecutor$Worker.run(ThreadPoolExecutor.java:615)
	at java.lang.Thread.run(Thread.java:724)
Exception in thread "pool-19-thread-4" 
java.lang.NullPointerException
	at org.apache.hama.graph.GraphJobRunner$ComputeRunnable.run(GraphJobRunner.java:350)
	at java.util.concurrent.ThreadPoolExecutor.runWorker(ThreadPoolExecutor.java:1145)
	at java.util.concurrent.ThreadPoolExecutor$Worker.run(ThreadPoolExecutor.java:615)
	at java.lang.Thread.run(Thread.java:724)
Exception in thread "pool-19-thread-6" 
java.lang.NullPointerException
	at org.apache.hama.graph.GraphJobRunner$ComputeRunnable.run(GraphJobRunner.java:350)
	at java.util.concurrent.ThreadPoolExecutor.runWorker(ThreadPoolExecutor.java:1145)
	at java.util.concurrent.ThreadPoolExecutor$Worker.run(ThreadPoolExecutor.java:615)
	at java.lang.Thread.run(Thread.java:724)
Exception in thread "pool-19-thread-10" 
java.lang.NullPointerException
	at org.apache.hama.graph.GraphJobRunner$ComputeRunnable.run(GraphJobRunner.java:350)
	at java.util.concurrent.ThreadPoolExecutor.runWorker(ThreadPoolExecutor.java:1145)
	at java.util.concurrent.ThreadPoolExecutor$Worker.run(ThreadPoolExecutor.java:615)
	at java.lang.Thread.run(Thread.java:724)
Exception in thread "pool-19-thread-13" 
java.lang.NullPointerException
	at org.apache.hama.graph.GraphJobRunner$ComputeRunnable.run(GraphJobRunner.java:350)
	at java.util.concurrent.ThreadPoolExecutor.runWorker(ThreadPoolExecutor.java:1145)
	at java.util.concurrent.ThreadPoolExecutor$Worker.run(ThreadPoolExecutor.java:615)
	at java.lang.Thread.run(Thread.java:724)
Exception in thread "pool-19-thread-3" 
java.lang.NullPointerException
	at org.apache.hama.graph.GraphJobRunner$ComputeRunnable.run(GraphJobRunner.java:350)
	at java.util.concurrent.ThreadPoolExecutor.runWorker(ThreadPoolExecutor.java:1145)
	at java.util.concurrent.ThreadPoolExecutor$Worker.run(ThreadPoolExecutor.java:615)
	at java.lang.Thread.run(Thread.java:724)
Exception in thread "pool-19-thread-9" 
java.lang.NullPointerException
	at org.apache.hama.graph.GraphJobRunner$ComputeRunnable.run(GraphJobRunner.java:350)
	at java.util.concurrent.ThreadPoolExecutor.runWorker(ThreadPoolExecutor.java:1145)
	at java.util.concurrent.ThreadPoolExecutor$Worker.run(ThreadPoolExecutor.java:615)
	at java.lang.Thread.run(Thread.java:724)
Exception in thread "pool-19-thread-17" 
java.lang.NullPointerException
	at org.apache.hama.graph.GraphJobRunner$ComputeRunnable.run(GraphJobRunner.java:350)
	at java.util.concurrent.ThreadPoolExecutor.runWorker(ThreadPoolExecutor.java:1145)
	at java.util.concurrent.ThreadPoolExecutor$Worker.run(ThreadPoolExecutor.java:615)
	at java.lang.Thread.run(Thread.java:724)
Exception in thread "pool-19-thread-12" 
java.lang.NullPointerException
	at org.apache.hama.graph.GraphJobRunner$ComputeRunnable.run(GraphJobRunner.java:350)
	at java.util.concurrent.ThreadPoolExecutor.runWorker(ThreadPoolExecutor.java:1145)
	at java.util.concurrent.ThreadPoolExecutor$Worker.run(ThreadPoolExecutor.java:615)
	at java.lang.Thread.run(Thread.java:724)
Exception in thread "pool-19-thread-7" 
java.lang.NullPointerException
	at org.apache.hama.graph.GraphJobRunner$ComputeRunnable.run(GraphJobRunner.java:350)
	at java.util.concurrent.ThreadPoolExecutor.runWorker(ThreadPoolExecutor.java:1145)
	at java.util.concurrent.ThreadPoolExecutor$Worker.run(ThreadPoolExecutor.java:615)
	at java.lang.Thread.run(Thread.java:724)
Exception in thread "pool-19-thread-15" 
java.lang.NullPointerException
	at org.apache.hama.graph.GraphJobRunner$ComputeRunnable.run(GraphJobRunner.java:350)
	at java.util.concurrent.ThreadPoolExecutor.runWorker(ThreadPoolExecutor.java:1145)
	at java.util.concurrent.ThreadPoolExecutor$Worker.run(ThreadPoolExecutor.java:615)
	at java.lang.Thread.run(Thread.java:724)
Exception in thread "pool-19-thread-26" 
java.lang.NullPointerException
	at org.apache.hama.graph.GraphJobRunner$ComputeRunnable.run(GraphJobRunner.java:350)
	at java.util.concurrent.ThreadPoolExecutor.runWorker(ThreadPoolExecutor.java:1145)
	at java.util.concurrent.ThreadPoolExecutor$Worker.run(ThreadPoolExecutor.java:615)
	at java.lang.Thread.run(Thread.java:724)
Exception in thread "pool-19-thread-18" 
java.lang.NullPointerException
	at org.apache.hama.graph.GraphJobRunner$ComputeRunnable.run(GraphJobRunner.java:350)
	at java.util.concurrent.ThreadPoolExecutor.runWorker(ThreadPoolExecutor.java:1145)
	at java.util.concurrent.ThreadPoolExecutor$Worker.run(ThreadPoolExecutor.java:615)
	at java.lang.Thread.run(Thread.java:724)
Exception in thread "pool-19-thread-8" 
java.lang.NullPointerException
	at org.apache.hama.graph.GraphJobRunner$ComputeRunnable.run(GraphJobRunner.java:350)
	at java.util.concurrent.ThreadPoolExecutor.runWorker(ThreadPoolExecutor.java:1145)
	at java.util.concurrent.ThreadPoolExecutor$Worker.run(ThreadPoolExecutor.java:615)
	at java.lang.Thread.run(Thread.java:724)
Exception in thread "pool-19-thread-11" 
java.lang.NullPointerException
	at org.apache.hama.graph.GraphJobRunner$ComputeRunnable.run(GraphJobRunner.java:350)
	at java.util.concurrent.ThreadPoolExecutor.runWorker(ThreadPoolExecutor.java:1145)
	at java.util.concurrent.ThreadPoolExecutor$Worker.run(ThreadPoolExecutor.java:615)
	at java.lang.Thread.run(Thread.java:724)
Exception in thread "pool-19-thread-14" 
java.lang.NullPointerException
	at org.apache.hama.graph.GraphJobRunner$ComputeRunnable.run(GraphJobRunner.java:350)
	at java.util.concurrent.ThreadPoolExecutor.runWorker(ThreadPoolExecutor.java:1145)
	at java.util.concurrent.ThreadPoolExecutor$Worker.run(ThreadPoolExecutor.java:615)
	at java.lang.Thread.run(Thread.java:724)
Exception in thread "pool-19-thread-22" 
15/04/23 00:04:14 INFO graph.GraphJobRunner: Total time spent for superstep-17 looping: 12
ms

java.lang.NullPointerException
	at org.apache.hama.graph.GraphJobRunner$ComputeRunnable.run(GraphJobRunner.java:350)
	at java.util.concurrent.ThreadPoolExecutor.runWorker(ThreadPoolExecutor.java:1145)
	at java.util.concurrent.ThreadPoolExecutor$Worker.run(ThreadPoolExecutor.java:615)
	at java.lang.Thread.run(Thread.java:724)
Exception in thread "pool-19-thread-23" 
java.lang.NullPointerException
	at org.apache.hama.graph.GraphJobRunner$ComputeRunnable.run(GraphJobRunner.java:350)
	at java.util.concurrent.ThreadPoolExecutor.runWorker(ThreadPoolExecutor.java:1145)
	at java.util.concurrent.ThreadPoolExecutor$Worker.run(ThreadPoolExecutor.java:615)
	at java.lang.Thread.run(Thread.java:724)
15/04/23 00:04:14 INFO graph.GraphJobRunner: Total time spent for superstep-17 computing vertices:
14 ms

15/04/23 00:04:14 INFO graph.GraphJobRunner: Total time spent for superstep-17 synchronizing:
0 ms

15/04/23 00:04:14 INFO Configuration.deprecation: mapred.cache.localFiles is deprecated. Instead,
use mapreduce.job.cache.local.files

15/04/23 00:04:16 INFO bsp.BSPJobClient: Current supersteps number: 16

15/04/23 00:04:16 INFO bsp.BSPJobClient: The total number of supersteps: 16

15/04/23 00:04:16 INFO bsp.BSPJobClient: Counters: 11

15/04/23 00:04:16 INFO bsp.BSPJobClient:   org.apache.hama.graph.GraphJobRunner$GraphJobCounter

15/04/23 00:04:16 INFO bsp.BSPJobClient:     ITERATIONS=16

15/04/23 00:04:16 INFO bsp.BSPJobClient:     INPUT_VERTICES=81

15/04/23 00:04:16 INFO bsp.BSPJobClient:   org.apache.hama.bsp.JobInProgress$JobCounter

15/04/23 00:04:16 INFO bsp.BSPJobClient:     SUPERSTEPS=16

15/04/23 00:04:16 INFO bsp.BSPJobClient:     LAUNCHED_TASKS=1

15/04/23 00:04:16 INFO bsp.BSPJobClient:   org.apache.hama.bsp.BSPPeerImpl$PeerCounter

15/04/23 00:04:16 INFO bsp.BSPJobClient:     SUPERSTEP_SUM=17

15/04/23 00:04:16 INFO bsp.BSPJobClient:     IO_BYTES_READ=7189

15/04/23 00:04:16 INFO bsp.BSPJobClient:     TIME_IN_SYNC_MS=4

15/04/23 00:04:16 INFO bsp.BSPJobClient:     TOTAL_MESSAGES_SENT=1632

15/04/23 00:04:16 INFO bsp.BSPJobClient:     TASK_INPUT_RECORDS=100

15/04/23 00:04:16 INFO bsp.BSPJobClient:     TOTAL_MESSAGES_RECEIVED=1530

15/04/23 00:04:16 INFO bsp.BSPJobClient:     TASK_OUTPUT_RECORDS=81

Job Finished in 3.415 seconds
C1691 = [44, 48, 49, 41, 47, 42, 46, 40, 43]
C1598 = [18, 12, 16, 19, 11, 14, 17, 13, 15, 10]
C1815 = [85, 80, 89, 82, 81, 84, 83, 86]
C1722 = [53, 50, 55, 56, 57, 54, 58, 52]
C79 = [4, 9, 5, 2, 3, 7, 6, 1, 0, 8]
C1762 = [73, 71, 75, 74, 77]
C1754 = [65, 68, 67, 61, 69, 62, 66]
C1846 = [96, 97, 91, 98, 90, 99, 93, 92, 94]
C1630 = [22, 25, 28, 26, 23, 29, 21]
C1660 = [36, 31, 37, 34, 35, 30, 33, 39]
Tests run: 1, Failures: 0, Errors: 0, Skipped: 0, Time elapsed: 0.022 sec

Results :

Failed tests: 

Tests run: 23, Failures: 1, Errors: 0, Skipped: 0

[INFO] ------------------------------------------------------------------------
[INFO] Reactor Summary:
[INFO] 
[INFO] Apache Hama parent POM ............................ SUCCESS [6.959s]
[INFO] pipes ............................................. SUCCESS [16.596s]
[INFO] commons ........................................... SUCCESS [6.921s]
[INFO] core .............................................. SUCCESS [2:57.627s]
[INFO] graph ............................................. SUCCESS [17.257s]
[INFO] machine learning .................................. SUCCESS [1:46.084s]
[INFO] examples .......................................... FAILURE [1:33.909s]
[INFO] mesos ............................................. SKIPPED
[INFO] hama-dist ......................................... SKIPPED
[INFO] ------------------------------------------------------------------------
[INFO] BUILD FAILURE
[INFO] ------------------------------------------------------------------------
[INFO] Total time: 7:06.039s
[INFO] Finished at: Thu Apr 23 00:04:16 UTC 2015
[INFO] Final Memory: 129M/610M
[INFO] ------------------------------------------------------------------------
[ERROR] Failed to execute goal org.apache.maven.plugins:maven-surefire-plugin:2.6:test (default-test)
on project hama-examples: There are test failures.
[ERROR] 
[ERROR] Please refer to <https://builds.apache.org/job/Hama-Nightly-for-Hadoop-1.x/ws/trunk/examples/target/surefire-reports>
for the individual test results.
[ERROR] -> [Help 1]
org.apache.maven.lifecycle.LifecycleExecutionException: Failed to execute goal org.apache.maven.plugins:maven-surefire-plugin:2.6:test
(default-test) on project hama-examples: There are test failures.

Please refer to <https://builds.apache.org/job/Hama-Nightly-for-Hadoop-1.x/ws/trunk/examples/target/surefire-reports>
for the individual test results.
	at org.apache.maven.lifecycle.internal.MojoExecutor.execute(MojoExecutor.java:213)
	at org.apache.maven.lifecycle.internal.MojoExecutor.execute(MojoExecutor.java:153)
	at org.apache.maven.lifecycle.internal.MojoExecutor.execute(MojoExecutor.java:145)
	at org.apache.maven.lifecycle.internal.LifecycleModuleBuilder.buildProject(LifecycleModuleBuilder.java:84)
	at org.apache.maven.lifecycle.internal.LifecycleModuleBuilder.buildProject(LifecycleModuleBuilder.java:59)
	at org.apache.maven.lifecycle.internal.LifecycleStarter.singleThreadedBuild(LifecycleStarter.java:183)
	at org.apache.maven.lifecycle.internal.LifecycleStarter.execute(LifecycleStarter.java:161)
	at org.apache.maven.DefaultMaven.doExecute(DefaultMaven.java:320)
	at org.apache.maven.DefaultMaven.execute(DefaultMaven.java:156)
	at org.apache.maven.cli.MavenCli.execute(MavenCli.java:537)
	at org.apache.maven.cli.MavenCli.doMain(MavenCli.java:196)
	at org.apache.maven.cli.MavenCli.main(MavenCli.java:141)
	at sun.reflect.NativeMethodAccessorImpl.invoke0(Native Method)
	at sun.reflect.NativeMethodAccessorImpl.invoke(NativeMethodAccessorImpl.java:57)
	at sun.reflect.DelegatingMethodAccessorImpl.invoke(DelegatingMethodAccessorImpl.java:43)
	at java.lang.reflect.Method.invoke(Method.java:606)
	at org.codehaus.plexus.classworlds.launcher.Launcher.launchEnhanced(Launcher.java:290)
	at org.codehaus.plexus.classworlds.launcher.Launcher.launch(Launcher.java:230)
	at org.codehaus.plexus.classworlds.launcher.Launcher.mainWithExitCode(Launcher.java:409)
	at org.codehaus.plexus.classworlds.launcher.Launcher.main(Launcher.java:352)
Caused by: org.apache.maven.plugin.MojoFailureException: There are test failures.

Please refer to <https://builds.apache.org/job/Hama-Nightly-for-Hadoop-1.x/ws/trunk/examples/target/surefire-reports>
for the individual test results.
	at org.apache.maven.plugin.surefire.SurefireHelper.reportExecution(SurefireHelper.java:55)
	at org.apache.maven.plugin.surefire.SurefirePlugin.execute(SurefirePlugin.java:592)
	at org.apache.maven.plugin.DefaultBuildPluginManager.executeMojo(DefaultBuildPluginManager.java:101)
	at org.apache.maven.lifecycle.internal.MojoExecutor.execute(MojoExecutor.java:209)
	... 19 more
[ERROR] 
[ERROR] 
[ERROR] For more information about the errors and possible solutions, please read the following
articles:
[ERROR] [Help 1] http://cwiki.apache.org/confluence/display/MAVEN/MojoFailureException
[ERROR] 
[ERROR] After correcting the problems, you can resume the build with the command
[ERROR]   mvn <goals> -rf :hama-examples
Build step 'Invoke top-level Maven targets' marked build as failure
Archiving artifacts
Sending artifact delta relative to Hama-Nightly-for-Hadoop-1.x #1589
Archived 146 artifacts
Archive block size is 32768
Received 1911 blocks and 460870 bytes
Compression is 99.3%
Took 13 sec
Recording test results

Mime
View raw message