hama-dev mailing list archives

Site index · List index
Message view « Date » · « Thread »
Top « Date » · « Thread »
From Apache Jenkins Server <jenk...@builds.apache.org>
Subject Build failed in Jenkins: Hama-Nightly-for-Hadoop-1.x #1518
Date Wed, 11 Feb 2015 01:03:03 GMT
See <https://builds.apache.org/job/Hama-Nightly-for-Hadoop-1.x/1518/>

------------------------------------------
[...truncated 105470 lines...]
402708, 4.792113564533352, 2.9861216440626746, -0.9197892138069559, -0.541835138835484]	4.792011704063929
[7.094064149371662, -4.309408625114272, 5.412141869325169, 4.778229824554746, 2.964266980841808,
-0.9456148394991056, -0.5756316615194502]	4.570228216084243
[7.086130978849286, -4.338807201271834, 5.402275517130851, 4.7644971285507856, 2.94260112270095,
-0.9712138933828114, -0.6091638550517424]	4.35070477467997
[7.078279787575417, -4.367467991903288, 5.392573118458076, 4.751092332714601, 2.9213451436250497,
-0.9963210944084716, -0.6421222134455117]	4.136204544458424
[7.070590165967807, -4.394674703108866, 5.383193849479623, 4.738333790121049, 2.900896989537819,
-1.0204589152235353, -0.6739496088942645]	3.9320992443258813
[7.063167338947803, -4.419480340330619, 5.374348153444877, 4.72664238634335, 2.881782773619096,
-1.0429960293855516, -0.7039094777967867]	3.746724152620719
[7.0560842347812, -4.441228589854085, 5.366181878052325, 4.716309814532597, 2.864367120496723,
-1.0634948990816013, -0.7314913386809223]	3.5882736744855825
[7.0560842347812, -4.441228589854085, 5.366181878052325, 4.716309814532597, 2.864367120496723,
-1.0634948990816013, -0.7314913386809223]	3.458803849984058

Job Finished in 9.234 seconds
Tests run: 1, Failures: 0, Errors: 0, Skipped: 0, Time elapsed: 0.008 sec
Running org.apache.hama.examples.BipartiteMatchingTest
15/02/11 01:02:41 WARN util.NativeCodeLoader: Unable to load native-hadoop library for your
platform... using builtin-java classes where applicable

15/02/11 01:02:41 INFO bsp.FileInputFormat: Total input paths to process : 1

15/02/11 01:02:41 WARN snappy.LoadSnappy: Snappy native library not loaded

15/02/11 01:02:41 INFO bsp.FileInputFormat: Total input paths to process : 1

15/02/11 01:02:41 WARN bsp.BSPJobClient: No job jar file set.  User classes may not be found.
See BSPJob#setJar(String) or check Your jar file.

15/02/11 01:02:41 INFO bsp.BSPJobClient: Running job: job_localrunner_0001

15/02/11 01:02:41 INFO bsp.LocalBSPRunner: Setting up a new barrier for 1 tasks!

15/02/11 01:02:44 INFO bsp.BSPJobClient: Current supersteps number: 1

15/02/11 01:02:44 INFO bsp.BSPJobClient: The total number of supersteps: 1

15/02/11 01:02:44 INFO bsp.BSPJobClient: Counters: 6

15/02/11 01:02:44 INFO bsp.BSPJobClient:   org.apache.hama.bsp.JobInProgress$JobCounter

15/02/11 01:02:44 INFO bsp.BSPJobClient:     SUPERSTEPS=1

15/02/11 01:02:44 INFO bsp.BSPJobClient:     LAUNCHED_TASKS=1

15/02/11 01:02:44 INFO bsp.BSPJobClient:   org.apache.hama.bsp.BSPPeerImpl$PeerCounter

15/02/11 01:02:44 INFO bsp.BSPJobClient:     SUPERSTEP_SUM=2

15/02/11 01:02:44 INFO bsp.BSPJobClient:     IO_BYTES_READ=26

15/02/11 01:02:44 INFO bsp.BSPJobClient:     TIME_IN_SYNC_MS=0

15/02/11 01:02:44 INFO bsp.BSPJobClient:     TASK_INPUT_RECORDS=4

15/02/11 01:02:44 INFO bsp.FileInputFormat: Total input paths to process : 2

15/02/11 01:02:44 WARN bsp.BSPJobClient: No job jar file set.  User classes may not be found.
See BSPJob#setJar(String) or check Your jar file.

15/02/11 01:02:44 INFO bsp.LocalBSPRunner: Setting up a new barrier for 2 tasks!

15/02/11 01:02:44 INFO bsp.BSPJobClient: Running job: job_localrunner_0001

15/02/11 01:02:44 INFO graph.GraphJobRunner: 2 vertices are loaded into local:1

15/02/11 01:02:44 INFO graph.GraphJobRunner: 2 vertices are loaded into local:0

15/02/11 01:02:47 INFO bsp.BSPJobClient: Current supersteps number: 7

15/02/11 01:02:47 INFO bsp.BSPJobClient: The total number of supersteps: 7

15/02/11 01:02:47 INFO bsp.BSPJobClient: Counters: 12

15/02/11 01:02:47 INFO bsp.BSPJobClient:   org.apache.hama.graph.GraphJobRunner$GraphJobCounter

15/02/11 01:02:47 INFO bsp.BSPJobClient:     ITERATIONS=6

15/02/11 01:02:47 INFO bsp.BSPJobClient:     INPUT_VERTICES=4

15/02/11 01:02:47 INFO bsp.BSPJobClient:   org.apache.hama.bsp.JobInProgress$JobCounter

15/02/11 01:02:47 INFO bsp.BSPJobClient:     SUPERSTEPS=7

15/02/11 01:02:47 INFO bsp.BSPJobClient:     LAUNCHED_TASKS=2

15/02/11 01:02:47 INFO bsp.BSPJobClient:   org.apache.hama.bsp.BSPPeerImpl$PeerCounter

15/02/11 01:02:47 INFO bsp.BSPJobClient:     SUPERSTEP_SUM=16

15/02/11 01:02:47 INFO bsp.BSPJobClient:     MESSAGE_BYTES_TRANSFERED=916

15/02/11 01:02:47 INFO bsp.BSPJobClient:     IO_BYTES_READ=90

15/02/11 01:02:47 INFO bsp.BSPJobClient:     TIME_IN_SYNC_MS=13

15/02/11 01:02:47 INFO bsp.BSPJobClient:     TOTAL_MESSAGES_SENT=38

15/02/11 01:02:47 INFO bsp.BSPJobClient:     TASK_INPUT_RECORDS=4

15/02/11 01:02:47 INFO bsp.BSPJobClient:     TOTAL_MESSAGES_RECEIVED=36

15/02/11 01:02:47 INFO bsp.BSPJobClient:     TASK_OUTPUT_RECORDS=4

Job Finished in 6.47 seconds
C -> D L expvalue = D L
A -> B L expvalue = B L
D -> C R expvalue = C R
B -> A R expvalue = A R
Tests run: 1, Failures: 0, Errors: 0, Skipped: 0, Time elapsed: 0.009 sec
Running org.apache.hama.examples.SemiClusterMatchingTest
15/02/11 01:02:48 WARN util.NativeCodeLoader: Unable to load native-hadoop library for your
platform... using builtin-java classes where applicable

15/02/11 01:02:48 INFO bsp.FileInputFormat: Total input paths to process : 1

15/02/11 01:02:48 WARN snappy.LoadSnappy: Snappy native library not loaded

15/02/11 01:02:48 INFO bsp.FileInputFormat: Total input paths to process : 1

15/02/11 01:02:48 WARN bsp.BSPJobClient: No job jar file set.  User classes may not be found.
See BSPJob#setJar(String) or check Your jar file.

15/02/11 01:02:48 INFO bsp.BSPJobClient: Running job: job_localrunner_0001

15/02/11 01:02:49 INFO bsp.LocalBSPRunner: Setting up a new barrier for 1 tasks!

15/02/11 01:02:51 INFO bsp.BSPJobClient: Current supersteps number: 1

15/02/11 01:02:51 INFO bsp.BSPJobClient: The total number of supersteps: 1

15/02/11 01:02:51 INFO bsp.BSPJobClient: Counters: 6

15/02/11 01:02:51 INFO bsp.BSPJobClient:   org.apache.hama.bsp.JobInProgress$JobCounter

15/02/11 01:02:51 INFO bsp.BSPJobClient:     SUPERSTEPS=1

15/02/11 01:02:51 INFO bsp.BSPJobClient:     LAUNCHED_TASKS=1

15/02/11 01:02:51 INFO bsp.BSPJobClient:   org.apache.hama.bsp.BSPPeerImpl$PeerCounter

15/02/11 01:02:51 INFO bsp.BSPJobClient:     SUPERSTEP_SUM=2

15/02/11 01:02:51 INFO bsp.BSPJobClient:     IO_BYTES_READ=7189

15/02/11 01:02:51 INFO bsp.BSPJobClient:     TIME_IN_SYNC_MS=0

15/02/11 01:02:51 INFO bsp.BSPJobClient:     TASK_INPUT_RECORDS=100

15/02/11 01:02:51 INFO bsp.FileInputFormat: Total input paths to process : 3

15/02/11 01:02:51 WARN bsp.BSPJobClient: No job jar file set.  User classes may not be found.
See BSPJob#setJar(String) or check Your jar file.

15/02/11 01:02:52 INFO bsp.LocalBSPRunner: Setting up a new barrier for 3 tasks!

15/02/11 01:02:52 INFO bsp.BSPJobClient: Running job: job_localrunner_0001

15/02/11 01:02:52 INFO graph.GraphJobRunner: 33 vertices are loaded into local:2

15/02/11 01:02:52 INFO graph.GraphJobRunner: 33 vertices are loaded into local:0

15/02/11 01:02:52 INFO graph.GraphJobRunner: 34 vertices are loaded into local:1

15/02/11 01:02:55 INFO bsp.BSPJobClient: Current supersteps number: 15

15/02/11 01:02:55 INFO bsp.BSPJobClient: The total number of supersteps: 15

15/02/11 01:02:55 INFO bsp.BSPJobClient: Counters: 12

15/02/11 01:02:55 INFO bsp.BSPJobClient:   org.apache.hama.graph.GraphJobRunner$GraphJobCounter

15/02/11 01:02:55 INFO bsp.BSPJobClient:     ITERATIONS=15

15/02/11 01:02:55 INFO bsp.BSPJobClient:     INPUT_VERTICES=100

15/02/11 01:02:55 INFO bsp.BSPJobClient:   org.apache.hama.bsp.JobInProgress$JobCounter

15/02/11 01:02:55 INFO bsp.BSPJobClient:     SUPERSTEPS=15

15/02/11 01:02:55 INFO bsp.BSPJobClient:     LAUNCHED_TASKS=3

15/02/11 01:02:55 INFO bsp.BSPJobClient:   org.apache.hama.bsp.BSPPeerImpl$PeerCounter

15/02/11 01:02:55 INFO bsp.BSPJobClient:     SUPERSTEP_SUM=48

15/02/11 01:02:55 INFO bsp.BSPJobClient:     MESSAGE_BYTES_TRANSFERED=24655041

15/02/11 01:02:55 INFO bsp.BSPJobClient:     IO_BYTES_READ=8850

15/02/11 01:02:55 INFO bsp.BSPJobClient:     TIME_IN_SYNC_MS=234

15/02/11 01:02:55 INFO bsp.BSPJobClient:     TOTAL_MESSAGES_SENT=166202

15/02/11 01:02:55 INFO bsp.BSPJobClient:     TASK_INPUT_RECORDS=100

15/02/11 01:02:55 INFO bsp.BSPJobClient:     TOTAL_MESSAGES_RECEIVED=4596

15/02/11 01:02:55 INFO bsp.BSPJobClient:     TASK_OUTPUT_RECORDS=100

Job Finished in 6.385 seconds
C1691 = [41, 44, 47, 42, 45, 48, 40, 43, 46, 49]
C1598 = [14, 17, 11, 18, 15, 12, 19, 16, 10, 13]
C1784 = [77, 74, 71, 78, 72, 75, 79, 76, 73, 70]
C1722 = [56, 59, 50, 53, 57, 54, 51, 55, 58, 52]
C1815 = [86, 83, 80, 89, 84, 81, 87, 85, 82, 88]
C79 = [5, 8, 2, 0, 6, 3, 9, 7, 1, 4]
C1753 = [62, 65, 68, 60, 63, 69, 66, 64, 61, 67]
C1629 = [26, 20, 23, 29, 27, 21, 24, 25, 28, 22]
C1846 = [98, 92, 95, 99, 90, 93, 96, 91, 94, 97]
C1660 = [38, 35, 32, 39, 36, 33, 30, 37, 34, 31]
Tests run: 1, Failures: 0, Errors: 0, Skipped: 0, Time elapsed: 0.008 sec

Results :

Failed tests: 

Tests run: 21, Failures: 1, Errors: 0, Skipped: 0

[INFO] ------------------------------------------------------------------------
[INFO] Reactor Summary:
[INFO] 
[INFO] Apache Hama parent POM ............................ SUCCESS [3.701s]
[INFO] pipes ............................................. SUCCESS [15.301s]
[INFO] commons ........................................... SUCCESS [6.600s]
[INFO] core .............................................. SUCCESS [3:07.002s]
[INFO] graph ............................................. SUCCESS [18.586s]
[INFO] machine learning .................................. SUCCESS [1:56.233s]
[INFO] examples .......................................... FAILURE [2:11.266s]
[INFO] mesos ............................................. SKIPPED
[INFO] hama-dist ......................................... SKIPPED
[INFO] ------------------------------------------------------------------------
[INFO] BUILD FAILURE
[INFO] ------------------------------------------------------------------------
[INFO] Total time: 7:59.252s
[INFO] Finished at: Wed Feb 11 01:02:55 UTC 2015
[INFO] Final Memory: 100M/569M
[INFO] ------------------------------------------------------------------------
[ERROR] Failed to execute goal org.apache.maven.plugins:maven-surefire-plugin:2.6:test (default-test)
on project hama-examples: There are test failures.
[ERROR] 
[ERROR] Please refer to <https://builds.apache.org/job/Hama-Nightly-for-Hadoop-1.x/ws/trunk/examples/target/surefire-reports>
for the individual test results.
[ERROR] -> [Help 1]
[ERROR] 
[ERROR] To see the full stack trace of the errors, re-run Maven with the -e switch.
[ERROR] Re-run Maven using the -X switch to enable full debug logging.
[ERROR] 
[ERROR] For more information about the errors and possible solutions, please read the following
articles:
[ERROR] [Help 1] http://cwiki.apache.org/confluence/display/MAVEN/MojoFailureException
[ERROR] 
[ERROR] After correcting the problems, you can resume the build with the command
[ERROR]   mvn <goals> -rf :hama-examples
Build step 'Invoke top-level Maven targets' marked build as failure
Archiving artifacts
Sending artifact delta relative to Hama-Nightly-for-Hadoop-1.x #1517
Archived 147 artifacts
Archive block size is 32768
Received 0 blocks and 412419 bytes
Compression is 0.0%
Took 4.1 sec
Recording test results

Mime
View raw message